{"text_format":"1","workbook":"xlsx","n_sheets":9,"sheets":["Instructions","Step 1-What is changing"," Step 2-How many FTE impacted","Results - Impact Assessment","LOOKUP Table","Summary by sector","Top change impacts","First draft","List Dropdown Menu"],"not_rendered":{"charts":3,"images":0,"macros":1,"external_links":0,"defined_names":3,"comments":4,"pivot_tables":1},"unopened":[],"bounds":{"document_bytes":16777216,"sheet_cells":100000,"rows_first":2000,"rows_last":500,"rows_between":2000,"halvings":0,"cell_chars":16384,"cell_head_chars":4096},"cells_cut":0,"cells_raw":0,"read":"whole","date_system":"1900"}

{"sheet":"Instructions","index":0,"n_rows":1,"n_cols":1,"rows_kept":1,"cut":false,"hidden":false,"merged":[]}
["Change Inventory and Impact Assessment"]

{"sheet":"Step 1-What is changing","index":1,"n_rows":110,"n_cols":27,"rows_kept":110,"cut":false,"hidden":false,"merged":[]}
[null,"Step 1‒What is changing for employees?"]
[]
[]
[null,null,null,null,null,null,"INSTRUCTIONS:\nFor this first step, you will need to check the box beside each potential change related to your organization's workplace modernization project. The next three colums identify the specific type of change involved such as a tool change, a behaviour change or a process change. A single type of change or a combination of changes is possible for each of them. These types of changes have already been weighted to identify the degree of change for each of the elements. The degree of change (low, medium or high) provides an idea of the level of effort that will be required to manage that change from an employee's perspective. "]
[]
[null,null,"Categories",null,null,"Low","List of changes","Changes","Formula only","Formula\nfor order in Step2 Page","Tool","Behavior","Process","formulas\nfor F,G,H",null,null,"Base point","Score of Change","Degree of Change","Weigh of the changes\nT - B - P\nLow=1   Med=2   High=3","Weigh of the changes\nT - B - P\nLow=1   Med=2   High=3","Weigh of the changes\nT - B - P\nLow=1   Med=2   High=3","Formula\nWeigh of the changes\nT - B - P\nLow=1 (25%)   Med=2 (50%)   High=3 (100%)","Formula\nWeigh of the changes\nT - B - P\nLow=1 (25%)   Med=2 (50%)   High=3 (100%)","Formula\nWeigh of the changes\nT - B - P\nLow=1 (25%)   Med=2 (50%)   High=3 (100%)","Overall, how big of a change? Overall","Degree of change"]
{"$rows_left_out":105}
{"sheet":" Step 2-How many FTE impacted","index":2,"n_rows":104,"n_cols":24,"rows_kept":104,"cut":false,"hidden":false,"merged":[]}
[null,"Step 2‒How many employees are impacted by the changes?"]
[null,"Below is a list of changes that were identified at Step 1 of your organization's modernization project. The type of change (tools, behaviour and processes) are also identified, as well as the degre of change for each of the elements. Your next task will be to include the total number of employees within your organization that are part of the project (TASK 1). Then, for each change in the list below, include the number of employees impacted in the grey column (TASK 2). For example, there may be 2,000 employees involved in the modernization project, but only 500 will be impacted by one of the changes. The higher the number of  employees impacted, the greater the impact on the organization. Accordingly, a higher level of effort will be required to manage the specific change. "]
[null,"                                                                                 Total of employees in the organization                 "]
[null,"List of changes","# of FTEs impacted\n(#FTEs)","Overall % of FTEs impacted \n(%)","Check If applicable change to your organization","Formula only","Formula\nfor order in Step2 Page","T","B","P","formula\nfor F","formula\nfor G","formula\nfor H","Base point","Score of Change","Degree of Change","Weigth of change\nT","Weigth of change\nB","Weigth of change\nP","Weigth of change\nT","Weigth of change\nB","Weigth of change\nP","Overall,how big of a change?","Degree of Change"]
[{"$f":"ROW()-4","v":1},{"$f":"IF(ISERROR(MATCH($A5,'Step 1-What is changing'!$J:$J,0)),\"\",INDEX('Step 1-What is changing'!$D:$D,MATCH($A5,'Step 1-What is changing'!$J:$J,0))&\" - \"&INDEX('Step 1-What is changing'!$G:$G,MATCH($A5,'Step 1-What is changing'!$J:$J,0)))","v":""},0,{"$f":"100*C5/$C$3","v":{"$error":"#DIV/0!"}},{"$f":"IF(F5=TRUE,\"X\",\"\")","v":""},{"$f":"IF(ISERROR(MATCH($A5,'Step 1-What is changing'!$J:$J,0)),\"\",INDEX('Step 1-What is changing'!$I:$I,MATCH($A5,'Step 1-What is changing'!$J:$J,0)))","v":""},{"$f":"IF(ISERROR(MATCH($A5,'Step 1-What is changing'!$J:$J,0)),\"\",INDEX('Step 1-What is changing'!$J:$J,MATCH($A5,'Step 1-What is changing'!$J:$J,0)))","v":""},{"$f":"IF(K5=TRUE,\"X\",\"\")","v":""},{"$f":"IF(L5=TRUE,\"X\",\"\")","v":""},{"$f":"IF(M5=TRUE,\"X\",\"\")","v":""},{"$f":"IF(ISERROR(MATCH($A5,'Step 1-What is changing'!$J:$J,0)),\"\",INDEX('Step 1-What is changing'!$N:$N,MATCH($A5,'Step 1-What is changing'!$J:$J,0)))","v":""},{"$f":"IF(ISERROR(MATCH($A5,'Step 1-What is changing'!$J:$J,0)),\"\",INDEX('Step 1-What is changing'!$O:$O,MATCH($A5,'Step 1-What is changing'!$J:$J,0)))","v":""},{"$f":"IF(ISERROR(MATCH($A5,'Step 1-What is changing'!$J:$J,0)),\"\",INDEX('Step 1-What is changing'!$P:$P,MATCH($A5,'Step 1-What is changing'!$J:$J,0)))","v":""},{"$f":"IF(ISERROR(MATCH($A5,'Step 1-What is changing'!$J:$J,0)),\"\",INDEX('Step 1-What is changing'!$Q:$Q,MATCH($A5,'Step 1-What is changing'!$J:$J,0)))","v":""},{"$f":"IF(ISERROR(MATCH($A5,'Step 1-What is changing'!$J:$J,0)),\"\",INDEX('Step 1-What is changing'!$R:$R,MATCH($A5,'Step 1-What is changing'!$J:$J,0)))","v":""},{"$f":"IF(ISERROR(MATCH($A5,'Step 1-What is changing'!$J:$J,0)),\"\",INDEX('Step 1-What is changing'!$S:$S,MATCH($A5,'Step 1-What is changing'!$J:$J,0)))","v":""},{"$f":"IF(ISERROR(MATCH($A5,'Step 1-What is changing'!$J:$J,0)),\"\",INDEX('Step 1-What is changing'!$T:$T,MATCH($A5,'Step 1-What is changing'!$J:$J,0)))","v":""},{"$f":"IF(ISERROR(MATCH($A5,'Step 1-What is changing'!$J:$J,0)),\"\",INDEX('Step 1-What is changing'!$U:$U,MATCH($A5,'Step 1-What is changing'!$J:$J,0)))","v":""},{"$f":"IF(ISERROR(MATCH($A5,'Step 1-What is changing'!$J:$J,0)),\"\",INDEX('Step 1-What is changing'!$V:$V,MATCH($A5,'Step 1-What is changing'!$J:$J,0)))","v":""},{"$f":"IF(ISERROR(MATCH($A5,'Step 1-What is changing'!$J:$J,0)),\"\",INDEX('Step 1-What is changing'!$W:$W,MATCH($A5,'Step 1-What is changing'!$J:$J,0)))","v":""},{"$f":"IF(ISERROR(MATCH($A5,'Step 1-What is changing'!$J:$J,0)),\"\",INDEX('Step 1-What is changing'!$X:$X,MATCH($A5,'Step 1-What is changing'!$J:$J,0)))","v":""},{"$f":"IF(ISERROR(MATCH($A5,'Step 1-What is changing'!$J:$J,0)),\"\",INDEX('Step 1-What is changing'!$Y:$Y,MATCH($A5,'Step 1-What is changing'!$J:$J,0)))","v":""},{"$f":"IF(ISERROR(MATCH($A5,'Step 1-What is changing'!$J:$J,0)),\"\",INDEX('Step 1-What is changing'!$Z:$Z,MATCH($A5,'Step 1-What is changing'!$J:$J,0)))","v":""},{"$f":"IF(ISERROR(MATCH($A5,'Step 1-What is changing'!$J:$J,0)),\"\",INDEX('Step 1-What is changing'!$AA:$AA,MATCH($A5,'Step 1-What is changing'!$J:$J,0)))","v":""}]
[{"$f":"ROW()-4","v":2},{"$f":"IF(ISERROR(MATCH($A6,'Step 1-What is changing'!$J:$J,0)),\"\",INDEX('Step 1-What is changing'!$D:$D,MATCH($A6,'Step 1-What is changing'!$J:$J,0))&\" - \"&INDEX('Step 1-What is changing'!$G:$G,MATCH($A6,'Step 1-What is changing'!$J:$J,0)))","v":""},0,{"$f":"100*C6/$C$3","v":{"$error":"#DIV/0!"}},{"$f":"IF(F6=TRUE,\"X\",\"\")","v":""},{"$f":"IF(ISERROR(MATCH($A6,'Step 1-What is changing'!$J:$J,0)),\"\",INDEX('Step 1-What is changing'!$I:$I,MATCH($A6,'Step 1-What is changing'!$J:$J,0)))","v":""},{"$f":"IF(ISERROR(MATCH($A6,'Step 1-What is changing'!$J:$J,0)),\"\",INDEX('Step 1-What is changing'!$J:$J,MATCH($A6,'Step 1-What is changing'!$J:$J,0)))","v":""},{"$f":"IF(K6=TRUE,\"X\",\"\")","v":""},{"$f":"IF(L6=TRUE,\"X\",\"\")","v":""},{"$f":"IF(M6=TRUE,\"X\",\"\")","v":""},{"$f":"IF(ISERROR(MATCH($A6,'Step 1-What is changing'!$J:$J,0)),\"\",INDEX('Step 1-What is changing'!$N:$N,MATCH($A6,'Step 1-What is changing'!$J:$J,0)))","v":""},{"$f":"IF(ISERROR(MATCH($A6,'Step 1-What is changing'!$J:$J,0)),\"\",INDEX('Step 1-What is changing'!$O:$O,MATCH($A6,'Step 1-What is changing'!$J:$J,0)))","v":""},{"$f":"IF(ISERROR(MATCH($A6,'Step 1-What is changing'!$J:$J,0)),\"\",INDEX('Step 1-What is changing'!$P:$P,MATCH($A6,'Step 1-What is changing'!$J:$J,0)))","v":""},{"$f":"IF(ISERROR(MATCH($A6,'Step 1-What is changing'!$J:$J,0)),\"\",INDEX('Step 1-What is changing'!$Q:$Q,MATCH($A6,'Step 1-What is changing'!$J:$J,0)))","v":""},{"$f":"IF(ISERROR(MATCH($A6,'Step 1-What is changing'!$J:$J,0)),\"\",INDEX('Step 1-What is changing'!$R:$R,MATCH($A6,'Step 1-What is changing'!$J:$J,0)))","v":""},{"$f":"IF(ISERROR(MATCH($A6,'Step 1-What is changing'!$J:$J,0)),\"\",INDEX('Step 1-What is changing'!$S:$S,MATCH($A6,'Step 1-What is changing'!$J:$J,0)))","v":""},{"$f":"IF(ISERROR(MATCH($A6,'Step 1-What is changing'!$J:$J,0)),\"\",INDEX('Step 1-What is changing'!$T:$T,MATCH($A6,'Step 1-What is changing'!$J:$J,0)))","v":""},{"$f":"IF(ISERROR(MATCH($A6,'Step 1-What is changing'!$J:$J,0)),\"\",INDEX('Step 1-What is changing'!$U:$U,MATCH($A6,'Step 1-What is changing'!$J:$J,0)))","v":""},{"$f":"IF(ISERROR(MATCH($A6,'Step 1-What is changing'!$J:$J,0)),\"\",INDEX('Step 1-What is changing'!$V:$V,MATCH($A6,'Step 1-What is changing'!$J:$J,0)))","v":""},{"$f":"IF(ISERROR(MATCH($A6,'Step 1-What is changing'!$J:$J,0)),\"\",INDEX('Step 1-What is changing'!$W:$W,MATCH($A6,'Step 1-What is changing'!$J:$J,0)))","v":""},{"$f":"IF(ISERROR(MATCH($A6,'Step 1-What is changing'!$J:$J,0)),\"\",INDEX('Step 1-What is changing'!$X:$X,MATCH($A6,'Step 1-What is changing'!$J:$J,0)))","v":""},{"$f":"IF(ISERROR(MATCH($A6,'Step 1-What is changing'!$J:$J,0)),\"\",INDEX('Step 1-What is changing'!$Y:$Y,MATCH($A6,'Step 1-What is changing'!$J:$J,0)))","v":""},{"$f":"IF(ISERROR(MATCH($A6,'Step 1-What is changing'!$J:$J,0)),\"\",INDEX('Step 1-What is changing'!$Z:$Z,MATCH($A6,'Step 1-What is changing'!$J:$J,0)))","v":""},{"$f":"IF(ISERROR(MATCH($A6,'Step 1-What is changing'!$J:$J,0)),\"\",INDEX('Step 1-What is changing'!$AA:$AA,MATCH($A6,'Step 1-What is changing'!$J:$J,0)))","v":""}]
{"$rows_left_out":99}
{"sheet":"Results - Impact Assessment","index":3,"n_rows":104,"n_cols":28,"rows_kept":104,"cut":false,"hidden":false,"merged":[]}
[null,"Results: Inventory of changes and impact assessment"]
[null,"The final results of the inventory of changes and the impact assessment are shown below. Each potential change related to the workplace modernization project is correlated with its level of impact on employees. The level of impact provides an idea of the level of effort to be dedicated for each specific element within the change management strategy. There is also a graphic indicating the number of changes per area of change (IM, IT Security, HR, Facilities), as well as a graphic showing the top 10 elements with the greatest impact on employees. "]
[null,null,2000]
[null,{"$f":"' Step 2-How many FTE impacted'!B4","v":"List of changes"},{"$f":"' Step 2-How many FTE impacted'!C4","v":"# of FTEs impacted\n(#FTEs)"},{"$f":"' Step 2-How many FTE impacted'!D4","v":"Overall % of FTEs impacted \n(%)"},{"$f":"' Step 2-How many FTE impacted'!E4","v":"Check If applicable change to your organization"},{"$f":"' Step 2-How many FTE impacted'!F4","v":"Formula only"},{"$f":"' Step 2-How many FTE impacted'!G4","v":"Formula\nfor order in Step2 Page"},{"$f":"' Step 2-How many FTE impacted'!H4","v":"T"},{"$f":"' Step 2-How many FTE impacted'!I4","v":"B"},{"$f":"' Step 2-How many FTE impacted'!J4","v":"P"},{"$f":"' Step 2-How many FTE impacted'!K4","v":"formula\nfor F"},{"$f":"' Step 2-How many FTE impacted'!L4","v":"formula\nfor G"},{"$f":"' Step 2-How many FTE impacted'!M4","v":"formula\nfor H"},{"$f":"' Step 2-How many FTE impacted'!N4","v":"Base point"},{"$f":"' Step 2-How many FTE impacted'!O4","v":"Score of Change"},{"$f":"' Step 2-How many FTE impacted'!P4","v":"Degree of Change"},{"$f":"' Step 2-How many FTE impacted'!Q4","v":"Weigth of change\nT"},{"$f":"' Step 2-How many FTE impacted'!R4","v":"Weigth of change\nB"},{"$f":"' Step 2-How many FTE impacted'!S4","v":"Weigth of change\nP"},{"$f":"' Step 2-How many FTE impacted'!T4","v":"Weigth of change\nT"},{"$f":"' Step 2-How many FTE impacted'!U4","v":"Weigth of change\nB"},{"$f":"' Step 2-How many FTE impacted'!V4","v":"Weigth of change\nP"},{"$f":"' Step 2-How many FTE impacted'!W4","v":"Overall,how big of a change?"},"Enabling sector","Impact score","Change rank",{"$f":"' Step 2-How many FTE impacted'!X4","v":"Degree of Change"},"Impact Assessment"]
[{"$f":"ROW()-4","v":1},{"$f":"' Step 2-How many FTE impacted'!B5","v":""},{"$f":"' Step 2-How many FTE impacted'!C5","v":0},{"$f":"' Step 2-How many FTE impacted'!D5","v":{"$error":"#DIV/0!"}},{"$f":"' Step 2-How many FTE impacted'!E5","v":""},{"$f":"' Step 2-How many FTE impacted'!F5","v":""},{"$f":"' Step 2-How many FTE impacted'!G5","v":""},{"$f":"' Step 2-How many FTE impacted'!H5","v":""},{"$f":"' Step 2-How many FTE impacted'!I5","v":""},{"$f":"' Step 2-How many FTE impacted'!J5","v":""},{"$f":"' Step 2-How many FTE impacted'!K5","v":""},{"$f":"' Step 2-How many FTE impacted'!L5","v":""},{"$f":"' Step 2-How many FTE impacted'!M5","v":""},{"$f":"' Step 2-How many FTE impacted'!N5","v":""},{"$f":"' Step 2-How many FTE impacted'!O5","v":""},{"$f":"' Step 2-How many FTE impacted'!P5","v":""},{"$f":"' Step 2-How many FTE impacted'!Q5","v":""},{"$f":"' Step 2-How many FTE impacted'!R5","v":""},{"$f":"' Step 2-How many FTE impacted'!S5","v":""},{"$f":"' Step 2-How many FTE impacted'!T5","v":""},{"$f":"' Step 2-How many FTE impacted'!U5","v":""},{"$f":"' Step 2-How many FTE impacted'!V5","v":""},{"$f":"' Step 2-How many FTE impacted'!W5","v":""},{"$f":"IF(_xlfn.NUMBERVALUE(LEFT(B5,1))=0,\"\",_xlfn.NUMBERVALUE(LEFT(B5,1)))","v":""},{"$f":"IF(AB5=\"LOW\",1,\nIF(AB5=\"MED\",2,\nIF(AB5=\"HIGH\",3,\"N/A\")))","v":{"$error":"#DIV/0!"}},{"$f":"_xlfn.RANK.EQ(Y5:Y104,Y5:Y104)","v":{"$error":"#DIV/0!"}},{"$f":"' Step 2-How many FTE impacted'!X5","v":""},{"$f":"IF(AND(AA5=\"LOW\",D5<50),\"LOW\",\nIF(AND(AA5=\"LOW\",D5>=50),\"MED\",\nIF(AND(AA5=\"MED\",D5<50),\"MED\",\nIF(AND(AA5=\"MED\",D5>=50),\"HIGH\",\nIF(AND(AA5=\"HIGH\",D5<50),\"MED\",\nIF(AND(AA5=\"HIGH\",D5>=50),\"HIGH\",\nIF(AA5=\"Minimal Change for Employee\",\"N/A\",\n\"ERROR\")))))))","v":{"$error":"#DIV/0!"}}]
[{"$f":"ROW()-4","v":2},{"$f":"' Step 2-How many FTE impacted'!B6","v":""},{"$f":"' Step 2-How many FTE impacted'!C6","v":0},{"$f":"' Step 2-How many FTE impacted'!D6","v":{"$error":"#DIV/0!"}},{"$f":"' Step 2-How many FTE impacted'!E6","v":""},{"$f":"' Step 2-How many FTE impacted'!F6","v":""},{"$f":"' Step 2-How many FTE impacted'!G6","v":""},{"$f":"' Step 2-How many FTE impacted'!H6","v":""},{"$f":"' Step 2-How many FTE impacted'!I6","v":""},{"$f":"' Step 2-How many FTE impacted'!J6","v":""},{"$f":"' Step 2-How many FTE impacted'!K6","v":""},{"$f":"' Step 2-How many FTE impacted'!L6","v":""},{"$f":"' Step 2-How many FTE impacted'!M6","v":""},{"$f":"' Step 2-How many FTE impacted'!N6","v":""},{"$f":"' Step 2-How many FTE impacted'!O6","v":""},{"$f":"' Step 2-How many FTE impacted'!P6","v":""},{"$f":"' Step 2-How many FTE impacted'!Q6","v":""},{"$f":"' Step 2-How many FTE impacted'!R6","v":""},{"$f":"' Step 2-How many FTE impacted'!S6","v":""},{"$f":"' Step 2-How many FTE impacted'!T6","v":""},{"$f":"' Step 2-How many FTE impacted'!U6","v":""},{"$f":"' Step 2-How many FTE impacted'!V6","v":""},{"$f":"' Step 2-How many FTE impacted'!W6","v":""},{"$f":"IF(_xlfn.NUMBERVALUE(LEFT(B6,1))=0,\"\",_xlfn.NUMBERVALUE(LEFT(B6,1)))","v":""},{"$f":"IF(AB6=\"LOW\",1,\nIF(AB6=\"MED\",2,\nIF(AB6=\"HIGH\",3,\"N/A\")))","v":{"$error":"#DIV/0!"}},{"$error":"#DIV/0!"},{"$f":"' Step 2-How many FTE impacted'!X6","v":""},{"$error":"#DIV/0!"}]
{"$rows_left_out":99}
{"sheet":"LOOKUP Table","index":4,"n_rows":101,"n_cols":6,"rows_kept":101,"cut":false,"hidden":true,"merged":[[2,0,6,0],[2,1,6,1],[7,0,12,0],[7,1,12,1],[13,0,15,0],[13,1,15,1],[16,0,26,0],[16,1,26,1],[27,0,28,0],[27,1,28,1],[29,0,30,0],[29,1,30,1],[32,0,33,0],[32,1,33,1],[34,0,37,0],[34,1,37,1],[38,0,39,0],[38,1,39,1],[42,0,43,0],[42,1,43,1],[44,0,48,0],[44,1,48,1],[49,0,60,0],[49,1,60,1],[61,0,62,0],[61,1,62,1],[64,0,66,0],[64,1,66,1],[67,0,70,0],[67,1,70,1],[71,0,73,0],[71,1,73,1],[74,0,76,0],[74,1,76,1],[77,0,80,0],[77,1,80,1],[90,0,95,0],[90,1,95,1],[96,0,100,0],[96,1,100,1],[81,0,84,0],[81,1,84,1],[85,0,86,0],[85,1,86,1],[87,0,89,0],[87,1,89,1]]}
[null,null,null,null,"Checklist"]
["2017-05-01","Categories",null,"List of changes","Check If applicable change to your organization","Formula only"]
[1.1000000000000001,"Devices","1.1.1","Computing device: going from fix to portable",null,true]
[null,null,"1.1.2","Updated and compatible computing device: New functionnality ",null,true]
[null,null,"1.1.3","Device recycling: no change for employees (back office)",null,true]
[null,null,"1.1.4","Phone devices: going from fix to portable ",null,true]
{"$rows_left_out":96}
{"sheet":"Summary by sector","index":5,"n_rows":7,"n_cols":3,"rows_kept":7,"cut":false,"hidden":true,"merged":[]}
[]
["Sector","Sector code","Summary of changes by enabling sector"]
["IT",1,{"$f":"FREQUENCY('Results - Impact Assessment'!X5:X104,'Summary by sector'!B3:B7)","v":0}]
["HR/OSH/PM",2,0]
["IM",3,0]
["Security",4,0]
{"$rows_left_out":2}
{"sheet":"Top change impacts","index":6,"n_rows":20,"n_cols":8,"rows_kept":20,"cut":false,"hidden":true,"merged":[]}
[null,"Top change impacts"]
[]
[null,null,null,null,null,"Top 10 highest change impacts"]
[]
[null,"Row Labels","Sum of Impact score","Sum of Change rank",null,"Rank","Impact","Title"]
[1,"1.2.1 IT/Connectivity - Wi-fi: new functionnality ",3,1,null,{"$f":"_xlfn.RANK.EQ(G6:G15,G6:G15)","v":1},{"$f":"C6","v":3},{"$f":"B6","v":"1.2.1 IT/Connectivity - Wi-fi: new functionnality "}]
{"$rows_left_out":15}
{"sheet":"First draft","index":7,"n_rows":109,"n_cols":43,"rows_kept":109,"cut":false,"hidden":true,"merged":[[4,20,4,22],[6,16,32,16],[1,1,1,5],[3,1,4,4],[3,6,3,15],[5,2,5,4],[6,1,10,1],[6,2,10,2],[4,10,4,12],[11,1,16,1],[11,2,16,2],[17,1,19,1],[17,2,19,2],[20,1,30,1],[20,2,30,2],[4,17,4,19],[74,2,77,2],[78,1,80,1],[48,1,49,1],[48,2,49,2],[31,1,32,1],[31,2,32,2],[33,2,33,4],[34,1,35,1],[34,2,35,2],[37,1,38,1],[37,2,38,2],[39,1,42,1],[39,2,42,2],[43,1,44,1],[43,2,44,2],[46,2,46,4],[88,1,91,1],[88,2,91,2],[104,1,108,1],[104,2,108,2],[93,1,94,1],[93,2,94,2],[95,1,97,1],[95,2,97,2],[98,1,103,1],[98,2,103,2],[4,28,4,30],[81,1,83,1],[81,2,83,2],[84,1,87,1],[84,2,87,2],[78,2,80,2],[50,1,54,1],[50,2,54,2],[55,1,66,1],[55,2,66,2],[67,1,68,1],[67,2,68,2],[69,2,69,4],[71,1,73,1],[71,2,73,2],[74,1,77,1]]}
[]
[null,"Assessment – Maturity"]
[]
[null,null,null,null,null,"Low (1)","List of Changes",null,null,null,null,null,null,null,null,null,null,null,null,null,null,null,null,null,null,null,null,null,null,null,null,null,"Medium (2)","List of changes","High (3)","Overall priority for change","Priority for change (maturity)","Priority for change (personas)","Alex","Kris","Pat","Sam","Additional Notes/Comments"]
[null,null,null,null,null,"Low maturity portrays the current average baseline across government","List of changes","Tools","Behaviors","Process","formulas\nfor H, I & J",null,null,"Base point","Score of changes ","Degree of Change","Pourcentage of applicable changes","Weigh of the changes\nT - B - P",null,null,"How big of a change?",null,null,"Overall","How big of a change?",null," How many people are impacted",null,"Formula\nScore of changes\nT - B - P",null,null,"Score","Medium maturity looks at the 2020 vision for government and sets out an achievable, yet ambitious experience for employees that is aligned to and demonstrates progress to the high maturity vision",null,"High maturity looks at the future government vision of a digital, flexible and collaborative employee experience in the workplace","1          to       10\n  low                 high","1          to       3\n  low                 high","1          to       10\n  low                 high"]
[null,1,"IT",null,null,"Low",null,"T","B","P",null,null,null,null,null,null,null,"T","B","P","T","B","P",null,null,null,null,null,null,null,null,null,"Medium",null,"High","Priority for change","Priority for change","Priority for change"]
{"$rows_left_out":104}
{"sheet":"List Dropdown Menu","index":8,"n_rows":10,"n_cols":3,"rows_kept":10,"cut":false,"hidden":true,"merged":[[0,0,0,8]]}
["List of dropdown"]
[]
[]
["Scale",null,"Scale1to5"]
[0,"no impact",1]
[1,"extramely low impact",2]
{"$rows_left_out":4}