{"text_format":"1","workbook":"xlsx","n_sheets":9,"sheets":["Directives","Étape 1 – Ce qui change"," Étape 2 – Nombre d’ETP touchés","Résultats – Évaluation des répe","LOOKUP Table","Summary by sector","Top change impacts","First draft","List Dropdown Menu"],"not_rendered":{"charts":3,"images":0,"macros":1,"external_links":1,"defined_names":3,"comments":4,"pivot_tables":1},"unopened":[],"bounds":{"document_bytes":16777216,"sheet_cells":100000,"rows_first":2000,"rows_last":500,"rows_between":2000,"halvings":0,"cell_chars":16384,"cell_head_chars":4096},"cells_cut":0,"cells_raw":0,"read":"whole","date_system":"1900"}

{"sheet":"Directives","index":0,"n_rows":1,"n_cols":1,"rows_kept":1,"cut":false,"hidden":false,"merged":[]}
["Répertoire des changements et évaluation des répercussions"]

{"sheet":"Étape 1 – Ce qui change","index":1,"n_rows":110,"n_cols":27,"rows_kept":110,"cut":false,"hidden":false,"merged":[[3,1,3,7],[75,1,78,1],[75,2,78,2],[79,1,81,1],[79,2,81,2],[72,1,74,1],[72,2,74,2],[44,1,45,1],[44,2,45,2],[49,1,50,1],[49,2,50,2],[51,1,55,1],[51,2,55,2],[56,1,67,1],[56,2,67,2],[68,1,69,1],[82,1,84,1],[82,2,84,2],[99,1,104,1],[99,2,104,2],[105,1,109,1],[105,2,109,2],[85,1,88,1],[85,2,88,2],[89,1,92,1],[89,2,92,2],[94,1,95,1],[94,2,95,2],[96,1,98,1],[96,2,98,2],[4,10,4,12],[68,2,69,2],[70,2,70,26],[47,2,47,6],[12,1,17,1],[12,2,17,2],[40,1,43,1],[40,2,43,2],[18,1,20,1],[18,2,20,2],[21,1,31,1],[21,2,31,2],[32,1,33,1],[32,2,33,2],[35,1,36,1],[35,2,36,2],[5,13,5,15],[6,2,6,26],[38,2,39,2],[5,2,5,4],[7,1,11,1],[7,2,11,2],[38,1,39,1]]}
[null,"Étape 1 – Qu’est-ce qui change pour les employés?"]
[]
[]
[null,"INSTRUCTIONS :\nPour cette première étape, vous devrez cocher la case à côté de chaque changement potentiel lié au projet de modernisation du lieu de travail de votre organisation. Les trois colonnes suivantes indiquent le type précis de changement concerné, comme un changement d’outil, un changement de comportement ou un changement de processus. Un seul type de changement ou une combinaison de changements est possible pour chacun d’entre eux. Ces types de changements ont déjà été pondérés pour déterminer le degré de changement de chaque élément. Le degré de changement (faible, moyen ou élevé) donne une idée du niveau d’effort qui sera nécessaire pour gérer ce changement du point de vue d’un employé. "]
[]
[null,null,"Catégories",null,null,"FAIBLE","Liste des changements","Changements","Formula only","Formula\nfor order in Step2 Page","Outil","Comportement","Processus","formulas\nfor F,G,H",null,null,"Base point","Score of Change","Degree of Change","Weigh of the changes\nT - B - P\nFAIBLE=1   MOYEN=2   ÉLEVÉ=3","Weigh of the changes\nT - B - P\nFAIBLE=1   MOYEN=2   ÉLEVÉ=3","Weigh of the changes\nT - B - P\nFAIBLE=1   MOYEN=2   ÉLEVÉ=3","Formula\nWeigh of the changes\nT - B - P\nFAIBLE=1 (25%)   MOYEN=2 (50%)   ÉLEVÉ=3 (100%)","Formula\nWeigh of the changes\nT - B - P\nFAIBLE=1 (25%)   MOYEN=2 (50%)   ÉLEVÉ=3 (100%)","Formula\nWeigh of the changes\nT - B - P\nFAIBLE=1 (25%)   MOYEN=2 (50%)   ÉLEVÉ=3 (100%)","Overall, how big of a change? Overall","Degré de changement"]
{"$rows_left_out":105}
{"sheet":" Étape 2 – Nombre d’ETP touchés","index":2,"n_rows":104,"n_cols":24,"rows_kept":104,"cut":false,"hidden":false,"merged":[[0,1,0,24],[1,1,1,3]]}
[null,"Étape 2 – Combien d’employés sont touchés par les changements?"]
[null,"Vous trouverez ci-dessous une liste des changements qui ont été indiqués à l’étape 1 du projet de modernisation de votre organisation. Le type de changement (outils, comportement et processus) y est également indiqué, ainsi que le degré de changement pour chacun des éléments. Votre prochaine tâche consistera à inclure le nombre total d’employés de votre organisation qui font partie du projet (TÂCHE 1). Ensuite, pour chaque changement dans la liste ci-dessous, indiquez le nombre d’employés touchés dans la colonne grise (TÂCHE 2). Par exemple, 2 000 employés peuvent être impliqués dans le projet de modernisation, mais seuls 500 seront touchés par l’un des changements. Plus le nombre d’employés touchés est élevé, plus l’incidence sur l’organisation sera importante. Par conséquent, un niveau d’effort plus élevé sera nécessaire pour gérer le changement précis. "]
[null,"                                                                                 Nombre d’employés dans l’organisation                 "]
[null,"Liste des changements","Nombre d’ETP touchés\n(nombre d’ETP)","Pourcentage global des ETP touchés \n(%)","Check If applicable change to your organization","Formula only","Formula\nfor order in Step2 Page","T","B","P","formula\nfor F","formula\nfor G","formula\nfor H","Base point","Score of Change","Degree of Change","Weigth of change\nT","Weigth of change\nB","Weigth of change\nP","Weigth of change\nT","Weigth of change\nB","Weigth of change\nP","Overall,how big of a change?","Degree of Change"]
[{"$f":"ROW()-4","v":1},{"$f":"IF(ISERROR(MATCH($A5,'[1]Step 1-What is changing'!$J:$J,0)),\"\",INDEX('Étape 1 – Ce qui change'!$D:$D,MATCH($A5,'[1]Step 1-What is changing'!$J:$J,0))&\" - \"&INDEX('Étape 1 – Ce qui change'!$G:$G,MATCH($A5,'[1]Step 1-What is changing'!$J:$J,0)))","v":""},0,{"$f":"100*C5/$C$3","v":{"$error":"#DIV/0!"}},{"$f":"IF(F5=TRUE,\"X\",\"\")","v":""},{"$f":"IF(ISERROR(MATCH($A5,'[1]Step 1-What is changing'!$J:$J,0)),\"\",INDEX('Étape 1 – Ce qui change'!$I:$I,MATCH($A5,'[1]Step 1-What is changing'!$J:$J,0)))","v":""},{"$f":"IF(ISERROR(MATCH($A5,'[1]Step 1-What is changing'!$J:$J,0)),\"\",INDEX('Étape 1 – Ce qui change'!$J:$J,MATCH($A5,'[1]Step 1-What is changing'!$J:$J,0)))","v":""},{"$f":"IF(K5=TRUE,\"X\",\"\")","v":""},"","",{"$f":"IF(ISERROR(MATCH($A5,'[1]Step 1-What is changing'!$J:$J,0)),\"\",INDEX('Étape 1 – Ce qui change'!$N:$N,MATCH($A5,'[1]Step 1-What is changing'!$J:$J,0)))","v":""},{"$f":"IF(ISERROR(MATCH($A5,'[1]Step 1-What is changing'!$J:$J,0)),\"\",INDEX('Étape 1 – Ce qui change'!$O:$O,MATCH($A5,'[1]Step 1-What is changing'!$J:$J,0)))","v":""},{"$f":"IF(ISERROR(MATCH($A5,'[1]Step 1-What is changing'!$J:$J,0)),\"\",INDEX('Étape 1 – Ce qui change'!$P:$P,MATCH($A5,'[1]Step 1-What is changing'!$J:$J,0)))","v":""},{"$f":"IF(ISERROR(MATCH($A5,'[1]Step 1-What is changing'!$J:$J,0)),\"\",INDEX('Étape 1 – Ce qui change'!$Q:$Q,MATCH($A5,'[1]Step 1-What is changing'!$J:$J,0)))","v":""},{"$f":"IF(ISERROR(MATCH($A5,'[1]Step 1-What is changing'!$J:$J,0)),\"\",INDEX('Étape 1 – Ce qui change'!$R:$R,MATCH($A5,'[1]Step 1-What is changing'!$J:$J,0)))","v":""},{"$f":"IF(ISERROR(MATCH($A5,'[1]Step 1-What is changing'!$J:$J,0)),\"\",INDEX('Étape 1 – Ce qui change'!$S:$S,MATCH($A5,'[1]Step 1-What is changing'!$J:$J,0)))","v":""},{"$f":"IF(ISERROR(MATCH($A5,'[1]Step 1-What is changing'!$J:$J,0)),\"\",INDEX('Étape 1 – Ce qui change'!$T:$T,MATCH($A5,'[1]Step 1-What is changing'!$J:$J,0)))","v":""},{"$f":"IF(ISERROR(MATCH($A5,'[1]Step 1-What is changing'!$J:$J,0)),\"\",INDEX('Étape 1 – Ce qui change'!$U:$U,MATCH($A5,'[1]Step 1-What is changing'!$J:$J,0)))","v":""},{"$f":"IF(ISERROR(MATCH($A5,'[1]Step 1-What is changing'!$J:$J,0)),\"\",INDEX('Étape 1 – Ce qui change'!$V:$V,MATCH($A5,'[1]Step 1-What is changing'!$J:$J,0)))","v":""},{"$f":"IF(ISERROR(MATCH($A5,'[1]Step 1-What is changing'!$J:$J,0)),\"\",INDEX('Étape 1 – Ce qui change'!$W:$W,MATCH($A5,'[1]Step 1-What is changing'!$J:$J,0)))","v":""},{"$f":"IF(ISERROR(MATCH($A5,'[1]Step 1-What is changing'!$J:$J,0)),\"\",INDEX('Étape 1 – Ce qui change'!$X:$X,MATCH($A5,'[1]Step 1-What is changing'!$J:$J,0)))","v":""},{"$f":"IF(ISERROR(MATCH($A5,'[1]Step 1-What is changing'!$J:$J,0)),\"\",INDEX('Étape 1 – Ce qui change'!$Y:$Y,MATCH($A5,'[1]Step 1-What is changing'!$J:$J,0)))","v":""},{"$f":"IF(ISERROR(MATCH($A5,'[1]Step 1-What is changing'!$J:$J,0)),\"\",INDEX('Étape 1 – Ce qui change'!$Z:$Z,MATCH($A5,'[1]Step 1-What is changing'!$J:$J,0)))","v":""},{"$f":"IF(ISERROR(MATCH($A5,'[1]Step 1-What is changing'!$J:$J,0)),\"\",INDEX('Étape 1 – Ce qui change'!$AA:$AA,MATCH($A5,'[1]Step 1-What is changing'!$J:$J,0)))","v":""}]
[{"$f":"ROW()-4","v":2},{"$f":"IF(ISERROR(MATCH($A6,'[1]Step 1-What is changing'!$J:$J,0)),\"\",INDEX('Étape 1 – Ce qui change'!$D:$D,MATCH($A6,'[1]Step 1-What is changing'!$J:$J,0))&\" - \"&INDEX('Étape 1 – Ce qui change'!$G:$G,MATCH($A6,'[1]Step 1-What is changing'!$J:$J,0)))","v":""},0,{"$f":"100*C6/$C$3","v":{"$error":"#DIV/0!"}},{"$f":"IF(F6=TRUE,\"X\",\"\")","v":""},{"$f":"IF(ISERROR(MATCH($A6,'[1]Step 1-What is changing'!$J:$J,0)),\"\",INDEX('Étape 1 – Ce qui change'!$I:$I,MATCH($A6,'[1]Step 1-What is changing'!$J:$J,0)))","v":""},{"$f":"IF(ISERROR(MATCH($A6,'[1]Step 1-What is changing'!$J:$J,0)),\"\",INDEX('Étape 1 – Ce qui change'!$J:$J,MATCH($A6,'[1]Step 1-What is changing'!$J:$J,0)))","v":""},"","","",{"$f":"IF(ISERROR(MATCH($A6,'[1]Step 1-What is changing'!$J:$J,0)),\"\",INDEX('Étape 1 – Ce qui change'!$N:$N,MATCH($A6,'[1]Step 1-What is changing'!$J:$J,0)))","v":""},{"$f":"IF(ISERROR(MATCH($A6,'[1]Step 1-What is changing'!$J:$J,0)),\"\",INDEX('Étape 1 – Ce qui change'!$O:$O,MATCH($A6,'[1]Step 1-What is changing'!$J:$J,0)))","v":""},{"$f":"IF(ISERROR(MATCH($A6,'[1]Step 1-What is changing'!$J:$J,0)),\"\",INDEX('Étape 1 – Ce qui change'!$P:$P,MATCH($A6,'[1]Step 1-What is changing'!$J:$J,0)))","v":""},{"$f":"IF(ISERROR(MATCH($A6,'[1]Step 1-What is changing'!$J:$J,0)),\"\",INDEX('Étape 1 – Ce qui change'!$Q:$Q,MATCH($A6,'[1]Step 1-What is changing'!$J:$J,0)))","v":""},{"$f":"IF(ISERROR(MATCH($A6,'[1]Step 1-What is changing'!$J:$J,0)),\"\",INDEX('Étape 1 – Ce qui change'!$R:$R,MATCH($A6,'[1]Step 1-What is changing'!$J:$J,0)))","v":""},{"$f":"IF(ISERROR(MATCH($A6,'[1]Step 1-What is changing'!$J:$J,0)),\"\",INDEX('Étape 1 – Ce qui change'!$S:$S,MATCH($A6,'[1]Step 1-What is changing'!$J:$J,0)))","v":""},{"$f":"IF(ISERROR(MATCH($A6,'[1]Step 1-What is changing'!$J:$J,0)),\"\",INDEX('Étape 1 – Ce qui change'!$T:$T,MATCH($A6,'[1]Step 1-What is changing'!$J:$J,0)))","v":""},{"$f":"IF(ISERROR(MATCH($A6,'[1]Step 1-What is changing'!$J:$J,0)),\"\",INDEX('Étape 1 – Ce qui change'!$U:$U,MATCH($A6,'[1]Step 1-What is changing'!$J:$J,0)))","v":""},{"$f":"IF(ISERROR(MATCH($A6,'[1]Step 1-What is changing'!$J:$J,0)),\"\",INDEX('Étape 1 – Ce qui change'!$V:$V,MATCH($A6,'[1]Step 1-What is changing'!$J:$J,0)))","v":""},{"$f":"IF(ISERROR(MATCH($A6,'[1]Step 1-What is changing'!$J:$J,0)),\"\",INDEX('Étape 1 – Ce qui change'!$W:$W,MATCH($A6,'[1]Step 1-What is changing'!$J:$J,0)))","v":""},{"$f":"IF(ISERROR(MATCH($A6,'[1]Step 1-What is changing'!$J:$J,0)),\"\",INDEX('Étape 1 – Ce qui change'!$X:$X,MATCH($A6,'[1]Step 1-What is changing'!$J:$J,0)))","v":""},{"$f":"IF(ISERROR(MATCH($A6,'[1]Step 1-What is changing'!$J:$J,0)),\"\",INDEX('Étape 1 – Ce qui change'!$Y:$Y,MATCH($A6,'[1]Step 1-What is changing'!$J:$J,0)))","v":""},{"$f":"IF(ISERROR(MATCH($A6,'[1]Step 1-What is changing'!$J:$J,0)),\"\",INDEX('Étape 1 – Ce qui change'!$Z:$Z,MATCH($A6,'[1]Step 1-What is changing'!$J:$J,0)))","v":""},{"$f":"IF(ISERROR(MATCH($A6,'[1]Step 1-What is changing'!$J:$J,0)),\"\",INDEX('Étape 1 – Ce qui change'!$AA:$AA,MATCH($A6,'[1]Step 1-What is changing'!$J:$J,0)))","v":""}]
{"$rows_left_out":99}
{"sheet":"Résultats – Évaluation des répe","index":3,"n_rows":104,"n_cols":28,"rows_kept":104,"cut":false,"hidden":false,"merged":[[0,1,0,28],[1,1,1,27]]}
[null,"Résultats : Inventaire des changements et évaluation des répercussions"]
[null,"Les résultats définitifs de l’inventaire des changements et de l’évaluation des répercussions sont présentés ci-dessous. Chaque changement potentiel lié au projet de modernisation du lieu de travail est lié à son niveau d’incidence sur les employés. Le niveau d’incidence donne une idée du niveau d’effort à consacrer à chaque élément précis de la stratégie de gestion du changement. Il y a également un graphique indiquant le nombre de changements par domaine de changement (GI, sécurité des TI, RH, installations), ainsi qu’un graphique montrant les dix éléments ayant l’incidence la plus importante sur les employés. "]
[null,null,2000]
[null,{"$f":"' Étape 2 – Nombre d’ETP touchés'!B4","v":"Liste des changements"},{"$f":"' Étape 2 – Nombre d’ETP touchés'!C4","v":"Nombre d’ETP touchés\n(nombre d’ETP)"},{"$f":"' Étape 2 – Nombre d’ETP touchés'!D4","v":"Pourcentage global des ETP touchés \n(%)"},{"$f":"' Étape 2 – Nombre d’ETP touchés'!E4","v":"Check If applicable change to your organization"},{"$f":"' Étape 2 – Nombre d’ETP touchés'!F4","v":"Formula only"},{"$f":"' Étape 2 – Nombre d’ETP touchés'!G4","v":"Formula\nfor order in Step2 Page"},{"$f":"' Étape 2 – Nombre d’ETP touchés'!H4","v":"T"},{"$f":"' Étape 2 – Nombre d’ETP touchés'!I4","v":"B"},{"$f":"' Étape 2 – Nombre d’ETP touchés'!J4","v":"P"},{"$f":"' Étape 2 – Nombre d’ETP touchés'!K4","v":"formula\nfor F"},{"$f":"' Étape 2 – Nombre d’ETP touchés'!L4","v":"formula\nfor G"},{"$f":"' Étape 2 – Nombre d’ETP touchés'!M4","v":"formula\nfor H"},{"$f":"' Étape 2 – Nombre d’ETP touchés'!N4","v":"Base point"},{"$f":"' Étape 2 – Nombre d’ETP touchés'!O4","v":"Score of Change"},{"$f":"' Étape 2 – Nombre d’ETP touchés'!P4","v":"Degree of Change"},{"$f":"' Étape 2 – Nombre d’ETP touchés'!Q4","v":"Weigth of change\nT"},{"$f":"' Étape 2 – Nombre d’ETP touchés'!R4","v":"Weigth of change\nB"},{"$f":"' Étape 2 – Nombre d’ETP touchés'!S4","v":"Weigth of change\nP"},{"$f":"' Étape 2 – Nombre d’ETP touchés'!T4","v":"Weigth of change\nT"},{"$f":"' Étape 2 – Nombre d’ETP touchés'!U4","v":"Weigth of change\nB"},{"$f":"' Étape 2 – Nombre d’ETP touchés'!V4","v":"Weigth of change\nP"},{"$f":"' Étape 2 – Nombre d’ETP touchés'!W4","v":"Overall,how big of a change?"},"Enabling sector","Impact score","Change rank",{"$f":"' Étape 2 – Nombre d’ETP touchés'!X4","v":"Degree of Change"},"Évaluation des répercussions"]
[{"$f":"ROW()-4","v":1},{"$f":"' Étape 2 – Nombre d’ETP touchés'!B5","v":""},{"$f":"' Étape 2 – Nombre d’ETP touchés'!C5","v":0},{"$f":"' Étape 2 – Nombre d’ETP touchés'!D5","v":{"$error":"#DIV/0!"}},{"$f":"' Étape 2 – Nombre d’ETP touchés'!E5","v":""},{"$f":"' Étape 2 – Nombre d’ETP touchés'!F5","v":""},{"$f":"' Étape 2 – Nombre d’ETP touchés'!G5","v":""},{"$f":"' Étape 2 – Nombre d’ETP touchés'!H5","v":""},{"$f":"' Étape 2 – Nombre d’ETP touchés'!I5","v":""},{"$f":"' Étape 2 – Nombre d’ETP touchés'!J5","v":""},{"$f":"' Étape 2 – Nombre d’ETP touchés'!K5","v":""},{"$f":"' Étape 2 – Nombre d’ETP touchés'!L5","v":""},{"$f":"' Étape 2 – Nombre d’ETP touchés'!M5","v":""},{"$f":"' Étape 2 – Nombre d’ETP touchés'!N5","v":""},{"$f":"' Étape 2 – Nombre d’ETP touchés'!O5","v":""},{"$f":"' Étape 2 – Nombre d’ETP touchés'!P5","v":""},{"$f":"' Étape 2 – Nombre d’ETP touchés'!Q5","v":""},{"$f":"' Étape 2 – Nombre d’ETP touchés'!R5","v":""},{"$f":"' Étape 2 – Nombre d’ETP touchés'!S5","v":""},{"$f":"' Étape 2 – Nombre d’ETP touchés'!T5","v":""},{"$f":"' Étape 2 – Nombre d’ETP touchés'!U5","v":""},{"$f":"' Étape 2 – Nombre d’ETP touchés'!V5","v":""},{"$f":"' Étape 2 – Nombre d’ETP touchés'!W5","v":""},{"$f":"IF(_xlfn.NUMBERVALUE(LEFT(B5,1))=0,\"\",_xlfn.NUMBERVALUE(LEFT(B5,1)))","v":""},{"$f":"IF(AB5=\"LOW\",1,\nIF(AB5=\"MED\",2,\nIF(AB5=\"HIGH\",3,\"N/A\")))","v":{"$error":"#DIV/0!"}},{"$f":"_xlfn.RANK.EQ(Y5:Y104,Y5:Y104)","v":{"$error":"#DIV/0!"}},{"$f":"' Étape 2 – Nombre d’ETP touchés'!X5","v":""},{"$f":"IF(AND(AA5=\"LOW\",D5<50),\"LOW\",\nIF(AND(AA5=\"LOW\",D5>=50),\"MED\",\nIF(AND(AA5=\"MED\",D5<50),\"MED\",\nIF(AND(AA5=\"MED\",D5>=50),\"HIGH\",\nIF(AND(AA5=\"HIGH\",D5<50),\"MED\",\nIF(AND(AA5=\"HIGH\",D5>=50),\"HIGH\",\nIF(AA5=\"Minimal Change for Employee\",\"N/A\",\n\"ERROR\")))))))","v":{"$error":"#DIV/0!"}}]
[{"$f":"ROW()-4","v":2},{"$f":"' Étape 2 – Nombre d’ETP touchés'!B6","v":""},{"$f":"' Étape 2 – Nombre d’ETP touchés'!C6","v":0},{"$f":"' Étape 2 – Nombre d’ETP touchés'!D6","v":{"$error":"#DIV/0!"}},{"$f":"' Étape 2 – Nombre d’ETP touchés'!E6","v":""},{"$f":"' Étape 2 – Nombre d’ETP touchés'!F6","v":""},{"$f":"' Étape 2 – Nombre d’ETP touchés'!G6","v":""},{"$f":"' Étape 2 – Nombre d’ETP touchés'!H6","v":""},{"$f":"' Étape 2 – Nombre d’ETP touchés'!I6","v":""},{"$f":"' Étape 2 – Nombre d’ETP touchés'!J6","v":""},{"$f":"' Étape 2 – Nombre d’ETP touchés'!K6","v":""},{"$f":"' Étape 2 – Nombre d’ETP touchés'!L6","v":""},{"$f":"' Étape 2 – Nombre d’ETP touchés'!M6","v":""},{"$f":"' Étape 2 – Nombre d’ETP touchés'!N6","v":""},{"$f":"' Étape 2 – Nombre d’ETP touchés'!O6","v":""},{"$f":"' Étape 2 – Nombre d’ETP touchés'!P6","v":""},{"$f":"' Étape 2 – Nombre d’ETP touchés'!Q6","v":""},{"$f":"' Étape 2 – Nombre d’ETP touchés'!R6","v":""},{"$f":"' Étape 2 – Nombre d’ETP touchés'!S6","v":""},{"$f":"' Étape 2 – Nombre d’ETP touchés'!T6","v":""},{"$f":"' Étape 2 – Nombre d’ETP touchés'!U6","v":""},{"$f":"' Étape 2 – Nombre d’ETP touchés'!V6","v":""},{"$f":"' Étape 2 – Nombre d’ETP touchés'!W6","v":""},{"$f":"IF(_xlfn.NUMBERVALUE(LEFT(B6,1))=0,\"\",_xlfn.NUMBERVALUE(LEFT(B6,1)))","v":""},{"$f":"IF(AB6=\"LOW\",1,\nIF(AB6=\"MED\",2,\nIF(AB6=\"HIGH\",3,\"N/A\")))","v":{"$error":"#DIV/0!"}},{"$error":"#DIV/0!"},{"$f":"' Étape 2 – Nombre d’ETP touchés'!X6","v":""},{"$error":"#DIV/0!"}]
{"$rows_left_out":99}
{"sheet":"LOOKUP Table","index":4,"n_rows":101,"n_cols":6,"rows_kept":101,"cut":false,"hidden":true,"merged":[[2,0,6,0],[2,1,6,1],[7,0,12,0],[7,1,12,1],[13,0,15,0],[13,1,15,1],[16,0,26,0],[16,1,26,1],[27,0,28,0],[27,1,28,1],[29,0,30,0],[29,1,30,1],[32,0,33,0],[32,1,33,1],[34,0,37,0],[34,1,37,1],[38,0,39,0],[38,1,39,1],[42,0,43,0],[42,1,43,1],[44,0,48,0],[44,1,48,1],[49,0,60,0],[49,1,60,1],[61,0,62,0],[61,1,62,1],[64,0,66,0],[64,1,66,1],[67,0,70,0],[67,1,70,1],[71,0,73,0],[71,1,73,1],[74,0,76,0],[74,1,76,1],[77,0,80,0],[77,1,80,1],[90,0,95,0],[90,1,95,1],[96,0,100,0],[96,1,100,1],[81,0,84,0],[81,1,84,1],[85,0,86,0],[85,1,86,1],[87,0,89,0],[87,1,89,1]]}
[null,null,null,null,"Checklist"]
["2017-05-01","Categories",null,"List of changes","Check If applicable change to your organization","Formula only"]
[1.1000000000000001,"Devices","1.1.1","Computing device: going from fix to portable",null,true]
[null,null,"1.1.2","Updated and compatible computing device: New functionnality ",null,true]
[null,null,"1.1.3","Device recycling: no change for employees (back office)",null,true]
[null,null,"1.1.4","Phone devices: going from fix to portable ",null,true]
{"$rows_left_out":96}
{"sheet":"Summary by sector","index":5,"n_rows":7,"n_cols":3,"rows_kept":7,"cut":false,"hidden":true,"merged":[]}
[]
["Sector","Sector code","Summary of changes by enabling sector"]
["TI",1,{"$f":"FREQUENCY('Résultats – Évaluation des répe'!X5:X104,'Summary by sector'!B3:B7)","v":0}]
["RH/SST/GP",2,0]
["GI",3,0]
["Sécurité",4,0]
{"$rows_left_out":2}
{"sheet":"Top change impacts","index":6,"n_rows":20,"n_cols":8,"rows_kept":20,"cut":false,"hidden":true,"merged":[]}
[null,"Top change impacts"]
[]
[null,null,null,null,null,"Top 10 highest change impacts"]
[]
[null,"Row Labels","Sum of Impact score","Sum of Change rank",null,"Rank","Impact","Title"]
[1,"1.2.1 IT/Connectivity - Wi-fi: new functionnality ",3,1,null,{"$f":"_xlfn.RANK.EQ(G6:G15,G6:G15)","v":1},{"$f":"C6","v":3},{"$f":"B6","v":"1.2.1 IT/Connectivity - Wi-fi: new functionnality "}]
{"$rows_left_out":15}
{"sheet":"First draft","index":7,"n_rows":109,"n_cols":43,"rows_kept":109,"cut":false,"hidden":true,"merged":[[4,20,4,22],[6,16,32,16],[1,1,1,5],[3,1,4,4],[3,6,3,15],[5,2,5,4],[6,1,10,1],[6,2,10,2],[4,10,4,12],[11,1,16,1],[11,2,16,2],[17,1,19,1],[17,2,19,2],[20,1,30,1],[20,2,30,2],[4,17,4,19],[74,2,77,2],[78,1,80,1],[48,1,49,1],[48,2,49,2],[31,1,32,1],[31,2,32,2],[33,2,33,4],[34,1,35,1],[34,2,35,2],[37,1,38,1],[37,2,38,2],[39,1,42,1],[39,2,42,2],[43,1,44,1],[43,2,44,2],[46,2,46,4],[88,1,91,1],[88,2,91,2],[104,1,108,1],[104,2,108,2],[93,1,94,1],[93,2,94,2],[95,1,97,1],[95,2,97,2],[98,1,103,1],[98,2,103,2],[4,28,4,30],[81,1,83,1],[81,2,83,2],[84,1,87,1],[84,2,87,2],[78,2,80,2],[50,1,54,1],[50,2,54,2],[55,1,66,1],[55,2,66,2],[67,1,68,1],[67,2,68,2],[69,2,69,4],[71,1,73,1],[71,2,73,2],[74,1,77,1]]}
[]
[null,"Assessment – Maturity"]
[]
[null,null,null,null,null,"Low (1)","List of Changes",null,null,null,null,null,null,null,null,null,null,null,null,null,null,null,null,null,null,null,null,null,null,null,null,null,"Medium (2)","List of changes","High (3)","Overall priority for change","Priority for change (maturity)","Priority for change (personas)","Alex","Kris","Pat","Sam","Additional Notes/Comments"]
[null,null,null,null,null,"Low maturity portrays the current average baseline across government","List of changes","Tools","Behaviors","Process","formulas\nfor H, I & J",null,null,"Base point","Score of changes ","Degree of Change","Pourcentage of applicable changes","Weigh of the changes\nT - B - P",null,null,"How big of a change?",null,null,"Overall","How big of a change?",null," How many people are impacted",null,"Formula\nScore of changes\nT - B - P",null,null,"Score","Medium maturity looks at the 2020 vision for government and sets out an achievable, yet ambitious experience for employees that is aligned to and demonstrates progress to the high maturity vision",null,"High maturity looks at the future government vision of a digital, flexible and collaborative employee experience in the workplace","1          to       10\n  low                 high","1          to       3\n  low                 high","1          to       10\n  low                 high"]
[null,1,"IT",null,null,"Low",null,"T","B","P",null,null,null,null,null,null,null,"T","B","P","T","B","P",null,null,null,null,null,null,null,null,null,"Medium",null,"High","Priority for change","Priority for change","Priority for change"]
{"$rows_left_out":104}
{"sheet":"List Dropdown Menu","index":8,"n_rows":10,"n_cols":3,"rows_kept":10,"cut":false,"hidden":true,"merged":[[0,0,0,8]]}
["List of dropdown"]
[]
[]
["Scale",null,"Scale1to5"]
[0,"no impact",1]
[1,"extramely low impact",2]
{"$rows_left_out":4}