{"text_format":"1","workbook":"xlsx","n_sheets":9,"sheets":["Directives","Étape 1 – Ce qui change"," Étape 2 – Nombre d’ETP touchés","Résultats – Évaluation des répe","LOOKUP Table","Summary by sector","Top change impacts","First draft","List Dropdown Menu"],"not_rendered":{"charts":3,"images":0,"macros":1,"external_links":1,"defined_names":3,"comments":4,"pivot_tables":1},"unopened":[],"bounds":{"document_bytes":16777216,"sheet_cells":100000,"rows_first":2000,"rows_last":500,"rows_between":2000,"halvings":0,"cell_chars":16384,"cell_head_chars":4096},"cells_cut":0,"cells_raw":0,"read":"whole","date_system":"1900"}

{"sheet":"Directives","index":0,"n_rows":1,"n_cols":1,"rows_kept":1,"cut":false,"hidden":false,"merged":[]}
["Répertoire des changements et évaluation des répercussions"]

{"sheet":"Étape 1 – Ce qui change","index":1,"n_rows":110,"n_cols":27,"rows_kept":110,"cut":false,"hidden":false,"merged":[[3,1,3,7],[75,1,78,1],[75,2,78,2],[79,1,81,1],[79,2,81,2],[72,1,74,1],[72,2,74,2],[44,1,45,1],[44,2,45,2],[49,1,50,1],[49,2,50,2],[51,1,55,1],[51,2,55,2],[56,1,67,1],[56,2,67,2],[68,1,69,1],[82,1,84,1],[82,2,84,2],[99,1,104,1],[99,2,104,2],[105,1,109,1],[105,2,109,2],[85,1,88,1],[85,2,88,2],[89,1,92,1],[89,2,92,2],[94,1,95,1],[94,2,95,2],[96,1,98,1],[96,2,98,2],[4,10,4,12],[68,2,69,2],[70,2,70,26],[47,2,47,6],[12,1,17,1],[12,2,17,2],[40,1,43,1],[40,2,43,2],[18,1,20,1],[18,2,20,2],[21,1,31,1],[21,2,31,2],[32,1,33,1],[32,2,33,2],[35,1,36,1],[35,2,36,2],[5,13,5,15],[6,2,6,26],[38,2,39,2],[5,2,5,4],[7,1,11,1],[7,2,11,2],[38,1,39,1]]}
[null,"Étape 1 – Qu’est-ce qui change pour les employés?"]
[]
[]
[null,"INSTRUCTIONS :\nPour cette première étape, vous devrez cocher la case à côté de chaque changement potentiel lié au projet de modernisation du lieu de travail de votre organisation. Les trois colonnes suivantes indiquent le type précis de changement concerné, comme un changement d’outil, un changement de comportement ou un changement de processus. Un seul type de changement ou une combinaison de changements est possible pour chacun d’entre eux. Ces types de changements ont déjà été pondérés pour déterminer le degré de changement de chaque élément. Le degré de changement (faible, moyen ou élevé) donne une idée du niveau d’effort qui sera nécessaire pour gérer ce changement du point de vue d’un employé. "]
[]
[null,null,"Catégories",null,null,"FAIBLE","Liste des changements","Changements","Formula only","Formula\nfor order in Step2 Page","Outil","Comportement","Processus","formulas\nfor F,G,H",null,null,"Base point","Score of Change","Degree of Change","Weigh of the changes\nT - B - P\nFAIBLE=1   MOYEN=2   ÉLEVÉ=3","Weigh of the changes\nT - B - P\nFAIBLE=1   MOYEN=2   ÉLEVÉ=3","Weigh of the changes\nT - B - P\nFAIBLE=1   MOYEN=2   ÉLEVÉ=3","Formula\nWeigh of the changes\nT - B - P\nFAIBLE=1 (25%)   MOYEN=2 (50%)   ÉLEVÉ=3 (100%)","Formula\nWeigh of the changes\nT - B - P\nFAIBLE=1 (25%)   MOYEN=2 (50%)   ÉLEVÉ=3 (100%)","Formula\nWeigh of the changes\nT - B - P\nFAIBLE=1 (25%)   MOYEN=2 (50%)   ÉLEVÉ=3 (100%)","Overall, how big of a change? Overall","Degré de changement"]
[null,1,"Technologie de l’information"]
[null,1.1000000000000001,"Appareils","1.1.1 TI/Appareils","Do employees have a flexible choice of device (e.g. tablets, laptops & desktops)? ","Devices are supplied to employees at a department level and typically fixed in nature with little choice of flexibility","Ordinateur : passer d’un ordinateur de bureau à un ordinateur portable",null,false,{"$f":"IF(I8=TRUE,COUNT(J$6:J6)+1,\"\")","v":""},null,null,null,true,true,false,2,{"$f":"SUMPRODUCT(--(N8:P8))","v":2},{"$f":"IF(R8=0,\"Changement minimal pour l’employé\",IF(R8<Q8,\"FAIBLE\",IF(R8=Q8,\"MOYEN\",\"ÉLEVÉ\")))","v":"MOYEN"},1,1,0,{"$f":"IF(T8=0,0,IF(T8<=1,33,IF(T8<=2,67,100)))","v":33},{"$f":"IF(U8=0,0,IF(U8<=1,33,IF(U8<=2,67,100)))","v":33},{"$f":"IF(V8=0,0,IF(V8<=1,33,IF(V8<=2,67,100)))","v":0},{"$f":"ROUND(AVERAGE(W8:Y8),0)","v":22},{"$f":"IF(Z8=0,\"Changement minimal pour l’employé\",IF(Z8<=33,\"FAIBLE\",IF(Z8<=67,\"MOYEN\",\"ÉLEVÉ\")))","v":"FAIBLE"}]
[null,null,null,"1.1.2 TI/Appareils","How up to date are the devices that are provided to employees?","Devices provided are outdated and are incompatible with other tools (e.g. printers, projectors) and devices","Ordinateur à jour et compatible : nouvelles fonctions ",null,false,{"$f":"IF(I9=TRUE,COUNT(J$6:J8)+1,\"\")","v":""},null,null,null,true,false,true,2,{"$f":"SUMPRODUCT(--(N9:P9))","v":2},"MOYEN",1,0,0,{"$f":"IF(T9=0,0,IF(T9<=1,33,IF(T9<=2,67,100)))","v":33},{"$f":"IF(U9=0,0,IF(U9<=1,33,IF(U9<=2,67,100)))","v":0},{"$f":"IF(V9=0,0,IF(V9<=1,33,IF(V9<=2,67,100)))","v":0},{"$f":"ROUND(AVERAGE(W9:Y9),0)","v":11},"FAIBLE"]
[null,null,null,"1.1.3 TI/Appareils","Are retired devices disposed in a environmentally friendly manner?","No device recycling scheme is in place","Recyclage des appareils : aucun changement pour les employés (changements administratifs)",null,false,{"$f":"IF(I10=TRUE,COUNT(J$6:J9)+1,\"\")","v":""},null,null,null,false,false,false,2,{"$f":"SUMPRODUCT(--(N10:P10))","v":0},"Changement minimal pour l’employé",0,0,0,0,0,0,{"$f":"ROUND(AVERAGE(W10:Y10),0)","v":0},"Changement minimal pour l’employé"]
[null,null,null,"1.1.4 TI/Appareils","What functionality is offered to employees via their phones?","Employees are provided with phones with limited functionality (i.e. calls only, no data)","Téléphone : passer d’un téléphone fixe à un téléphone mobile ",null,false,{"$f":"IF(I11=TRUE,COUNT(J$6:J10)+1,\"\")","v":""},null,null,null,true,true,false,2,{"$f":"SUMPRODUCT(--(N11:P11))","v":2},"MOYEN",1,1,0,33,33,0,22,"FAIBLE"]
[null,null,null,"1.1.5 TI/Appareils","How compatible are devices with tools and software and other devices used?","Devices have limited compatibility with most tools/software supplied by the department","Téléphone à jour et compatible : nouvelles fonctions ",null,false,{"$f":"IF(I12=TRUE,COUNT(J$6:J11)+1,\"\")","v":""},null,null,null,true,false,false,2,1,"FAIBLE",1,0,0,33,0,0,11,"FAIBLE"]
[null,1.2,"Connectivité","1.2.1 TI/Appareils","Is the wireless network fast, ÉLEVÉ performing and with large bandwidth capacity?","Unreliable connectivity and network coverage with sFAIBLE speeds and poor bandwidth. Limited wireless network available at a department level ","Wi-Fi : nouvelles fonctions ",null,false,{"$f":"IF(I13=TRUE,COUNT(J$6:J12)+1,\"\")","v":""},null,null,null,true,true,false,2,2,"MOYEN",1,3,0,33,100,0,44,{"$f":"IF(Z13=0,\"Changement minimal pour l’employé\",IF(Z13<=33,\"FAIBLE\",IF(Z13<=67,\"MOYEN\",\"ÉLEVÉ\")))","v":"MOYEN"}]
[null,null,null,"1.2.2 TI/Connectivité","How are secret networks and infrastructure set up?","There is no separate secret/classified network within the department","Réseau secret/classifié : nouveaux processus et outils communs de TI ",null,false,{"$f":"IF(I14=TRUE,COUNT(J$6:J13)+1,\"\")","v":""},null,null,null,true,true,true,2,3,"ÉLEVÉ",1,2,1,33,67,33,44,"MOYEN"]
[null,null,null,"1.2.3 TI/Connectivité","How does the department offer public wireless networks?","The department offers no public wireless network or no unified departmental network for the public","Wi-Fi public : connectivité accrue ",null,false,{"$f":"IF(I15=TRUE,COUNT(J$6:J14)+1,\"\")","v":""},null,null,null,true,true,false,2,2,"MOYEN",1,3,0,33,100,0,44,"MOYEN"]
[null,null,null,"1.2.4 TI/Connectivité","Is there secure VPN capability?","VPN capability available for most employees","Réseau privé virtuel : connectivité et mobilité accrues ",null,false,{"$f":"IF(I16=TRUE,COUNT(J$6:J15)+1,\"\")","v":""},null,null,null,true,true,true,2,3,"ÉLEVÉ",1,2,1,33,67,33,44,"MOYEN"]
[null,null,null,"1.2.5 TI/Connectivité","Do employees have the ability to securely print wirelessly?","Employees can only print at designated locations through a physical network","Impression sur demande : nouvel outil",null,false,{"$f":"IF(I17=TRUE,COUNT(J$6:J16)+1,\"\")","v":""},null,null,null,true,true,false,2,2,"MOYEN",1,2,0,33,67,0,33,"FAIBLE"]
[null,null,null,"1.2.6 TI/Connectivité","Is single sign on capability available?","No single sign on capability exists","Ouverture de session unique : nouveaux processus et fonctions (changements administratifs) ",null,false,{"$f":"IF(I18=TRUE,COUNT(J$6:J17)+1,\"\")","v":""},null,null,null,false,false,false,2,0,"Changement minimal pour l’employé",0,0,0,0,0,0,0,"Changement minimal pour l’employé"]
[null,1.3,"Soutien aux utilisateurs","1.3.1 TI/Soutien aux utilisateurs","Is IT support accessible in-person and/or remotely with good response times?","IT support is only accessible on site in person with long response times (>5 minutes)","Soutien en TI : s’inscrit dans le cadre d’autres changements (administratifs)",null,false,{"$f":"IF(I19=TRUE,COUNT(J$6:J18)+1,\"\")","v":""},null,null,null,false,false,false,2,0,"Changement minimal pour l’employé",0,0,0,0,0,0,0,"Changement minimal pour l’employé"]
[null,null,null,"1.3.2 TI/Soutien aux utilisateurs","Is training/awareness of new IT tools and software offered as required?","Limited training/awareness of new IT tools and software is offered to employees","Formation sur les outils de TI : s’inscrit dans le cadre d’autres changements (administratifs)",null,false,{"$f":"IF(I20=TRUE,COUNT(J$6:J19)+1,\"\")","v":""},null,null,null,false,true,false,2,1,"FAIBLE",0,1,0,0,33,0,11,"FAIBLE"]
[null,null,null,"1.3.3 TI/Soutien aux utilisateurs","What methods are employed to provide an efficient support network","Support is centered around traditional call centre type support","Réseau de soutien en TI par les pairs : s’inscrit dans le cadre d’autres changements (administratifs)",null,false,{"$f":"IF(I21=TRUE,COUNT(J$6:J20)+1,\"\")","v":""},null,null,null,false,false,false,2,0,"Changement minimal pour l’employé",0,0,0,0,0,0,0,"Changement minimal pour l’employé"]
[null,1.4,"Outils et logiciels","1.4.1 TI/Outils et logiciels","Is video conferencing available widely available across all devices?","Videoconferencing is only available in boardrooms or desktops","Vidéoconférence : nouveaux outils de TI",null,false,{"$f":"IF(I22=TRUE,COUNT(J$6:J21)+1,\"\")","v":""},null,null,null,true,true,false,2,2,"MOYEN",2,2,0,67,67,0,45,"MOYEN"]
[null,null,null,"1.4.2 TI/Outils et logiciels","Is an instant messaging system accessible on all devices?","An instant messaging system is not used/not accessible on all devices/or messaging only","Messagerie instantanée : nouveaux outils de TI",null,false,{"$f":"IF(I23=TRUE,COUNT(J$6:J22)+1,\"\")","v":""},null,null,null,true,true,false,2,2,"MOYEN",2,2,0,67,67,0,45,"MOYEN"]
[null,null,null,"1.4.3 TI/Outils et logiciels","Are software collaboration tools available (i.e. G Suite or Office 365)?","Collaboration tools are not available","Outils de collaboration : nouveaux outils de TI",null,false,{"$f":"IF(I24=TRUE,COUNT(J$6:J23)+1,\"\")","v":""},null,null,null,true,true,false,2,2,"MOYEN",2,2,0,67,67,0,45,"MOYEN"]
[null,null,null,"1.4.4 TI/Outils et logiciels","Is a social collaboration platform available?","A social collaboration platform is not available","Plateformes de collaboration : nouveaux outils de TI",null,false,{"$f":"IF(I25=TRUE,COUNT(J$6:J24)+1,\"\")","v":""},null,null,null,true,true,false,2,2,"MOYEN",2,2,0,67,67,0,45,"MOYEN"]
[null,null,null,"1.4.5 TI/Outils et logiciels","Is a reservation system provided?","A reservation system is not provided or used","Système de réservation : nouveaux outils de TI ",null,false,{"$f":"IF(I26=TRUE,COUNT(J$6:J25)+1,\"\")","v":""},null,null,null,true,true,true,2,3,"ÉLEVÉ",2,3,2,67,100,67,78,"ÉLEVÉ"]
[null,null,null,"1.4.6 TI/Outils et logiciels","Are innovative tools and software available? (3D printers, virtual reality, computer aided design etc.)","Limited choice of innovative tools and software","Outils et logiciels novateurs : s’inscrivent dans le cadre d’autres changements (administratifs)",null,false,{"$f":"IF(I27=TRUE,COUNT(J$6:J26)+1,\"\")","v":""},null,null,null,true,false,false,2,1,"FAIBLE",1,0,0,33,0,0,11,"FAIBLE"]
[null,null,null,"1.4.7 TI/Outils et logiciels","How are your software applications hosted?","Most applications/tools and software are on premise and internally supported","Outils et logiciels infonuagiques : s’inscrivent dans le cadre d’autres changements (administratifs)",null,false,{"$f":"IF(I28=TRUE,COUNT(J$6:J27)+1,\"\")","v":""},null,null,null,false,false,false,2,0,"Changement minimal pour l’employé",0,0,0,0,0,0,0,"Changement minimal pour l’employé"]
[null,null,null,"1.4.8 TI/Outils et logiciels","Are applications/tools accessible via mobile/smartphone/flexible?","Most applications/tools and software are not accessible via mobile/smartphone/flexible","Applications accessibles à l’aide de téléphones : nouvelles fonctions ",null,false,{"$f":"IF(I29=TRUE,COUNT(J$6:J28)+1,\"\")","v":""},null,null,null,true,false,false,2,1,"FAIBLE",1,0,0,33,0,0,11,"FAIBLE"]
[null,null,null,"1.4.9 TI/Outils et logiciels","Is an identity management system used?","An identity management system is not used consistently","Système de gestion de l’identité : nouvelles fonctions ",null,false,{"$f":"IF(I30=TRUE,COUNT(J$6:J29)+1,\"\")","v":""},null,null,null,false,false,false,2,0,"Changement minimal pour l’employé",0,0,0,0,0,0,0,"Changement minimal pour l’employé"]
[null,null,null,"1.4.10 TI/Outils et logiciels","Is digital technology used for signing authorities/approvals (e.g. biometrics or digital signatures)?","Digital technology is not used for signing authorities/approvals","Signatures numériques : nouvelles fonctions",null,false,{"$f":"IF(I31=TRUE,COUNT(J$6:J30)+1,\"\")","v":""},null,null,null,true,true,true,2,3,"ÉLEVÉ",1,2,3,33,67,100,67,"MOYEN"]
[null,null,null,"1.4.11 TI/Outils et logiciels","Do employees have a unified GC email and calendar client (e.g. all GC employees can see calendar availability)?","Email and calendar client exists at the department level and can not be shared across GC","Courriel du GC : nouvelles fonctions",null,false,{"$f":"IF(I32=TRUE,COUNT(J$6:J31)+1,\"\")","v":""},null,null,null,true,false,true,2,2,"MOYEN",1,0,0,33,0,0,11,"FAIBLE"]
[null,1.5,"Outils de collaboration","1.5.1 TI/Outils de collaboration","Do employees have access to collaboration assets (e.g. smart boards, TVs, whiteboards, writable surfaces etc.)?","Employees have limited access to collaboration assets","Biens favorisant la collaboration : s’inscrivent dans le cadre d’autres changements (administratifs)",null,false,{"$f":"IF(I33=TRUE,COUNT(J$6:J32)+1,\"\")","v":""},null,null,null,true,true,false,2,2,"MOYEN",2,2,0,67,67,0,45,"MOYEN"]
[null,null,null,"1.5.2 TI/Outils de collaboration","How compatible are digital collaboration assets/tools with employee and contractor devices?","Digital collaboration assets/tools are typically incompatible with employee devices","Biens compatibles favorisant la collaboration : s’inscrivent dans le cadre d’autres changements (administratifs)",null,false,{"$f":"IF(I34=TRUE,COUNT(J$6:J33)+1,\"\")","v":""},null,null,null,false,false,false,2,0,"Changement minimal pour l’employé",0,0,0,0,0,0,0,"Changement minimal pour l’employé"]
[null,2,"Ressources humaines/Santé et sécurité au travail/Gestion des personnes",null,null,"FAIBLE",null,null,null,{"$f":"IF(B35=TRUE,COUNT(J$6:J34)+1,\"\")","v":""}]
[null,2.1,"Politiques et conventions","2.1.1 RH/SST/GP-Politiques et conventions","Are policies, directives and collective agreements, that impact workplace conditions that alFAIBLE flexible/remote and collaborative working (principles aligned with GCworkplace), applied consistently?","Policies, directives and collective agreements are not adapted to GCworkplace principles and not applied consistently","Politiques et directives adaptées aux principes du Milieu de travail du GC",null,false,{"$f":"IF(I36=TRUE,COUNT(J$6:J35)+1,\"\")","v":""},null,null,null,false,false,false,2,{"$f":"SUMPRODUCT(--(N36:P36))","v":0},{"$f":"IF(R36=0,\"Changement minimal pour l’employé\",IF(R36<Q36,\"FAIBLE\",IF(R36=Q36,\"MOYEN\",\"ÉLEVÉ\")))","v":"Changement minimal pour l’employé"},0,0,0,{"$f":"IF(T36=0,0,IF(T36<=1,33,IF(T36<=2,67,100)))","v":0},{"$f":"IF(U36=0,0,IF(U36<=1,33,IF(U36<=2,67,100)))","v":0},{"$f":"IF(V36=0,0,IF(V36<=1,33,IF(V36<=2,67,100)))","v":0},0,{"$f":"IF(Z36=0,\"Changement minimal pour l’employé\",IF(Z36<=33,\"FAIBLE\",IF(Z36<=67,\"MOYEN\",\"ÉLEVÉ\")))","v":"Changement minimal pour l’employé"}]
[null,null,null,"2.1.2 RH/SST/GP-Politiques et conventions","Are work-related policies accessible GC-wide?","Ability to access policies imMOYENiately via self-service is difficult or impossible without contacting functional area","Accroissement du libre-service grâce à des politiques faciles à appliquer",null,false,{"$f":"IF(I37=TRUE,COUNT(J$6:J36)+1,\"\")","v":""},null,null,null,false,false,false,2,0,"Changement minimal pour l’employé",0,0,0,0,0,0,0,"Changement minimal pour l’employé"]
[null,2.2000000000000002,"Libre-service/Communications","2.2.1 RH/SST/GP-Libre-service/Communications","How are we ensuring the GC-wide connectivity on modern workplace issues and services?","Little or no communication regarding workplace issues and services","Communications fréquentes et opportunes sur les enjeux liés au milieu de travail",null,false,{"$f":"IF(I38=TRUE,COUNT(J$6:J37)+1,\"\")","v":""},null,null,null,false,false,false,2,0,"Changement minimal pour l’employé",0,0,0,0,0,0,0,"Changement minimal pour l’employé"]
[null,2.2999999999999998,"Pratiques de gestion des personnes/Leadership/Gestion du personnel","2.3.1 RH/SST/GP-Pratiques de gestion des personnes/Leadership/Gestion du personnel","Is the employee performance program's objective to enable each employee to achieve their best performance?","Employee performance is measured by objectives and deliverables but managers are not well equipped or there is inconsistent application of performance measurement","Mesure du rendement axée sur les objectifs et les produits livrables",null,false,{"$f":"IF(I39=TRUE,COUNT(J$6:J38)+1,\"\")","v":""},null,null,null,false,true,false,2,1,"FAIBLE",0,3,0,0,100,0,33,"FAIBLE"]
[null,null,null,"2.3.2 RH/SST/GP-Pratiques de gestion des personnes/Leadership/Gestion du personnel","Does the department provide guidance, training and leadership on the performance management framework?","Guidance for performance management is available with training available for managers but managers and employees are not engaged in training nor see it as a priority","Formation sur la gestion du rendement",null,false,{"$f":"IF(I40=TRUE,COUNT(J$6:J39)+1,\"\")","v":""},null,null,null,false,true,false,2,1,"FAIBLE",0,2,0,0,67,0,22,"FAIBLE"]
[null,2.4,"Méthodes de travail modernes et numériques en RH","2.4.1 RH/SST/GP-Méthodes de travail modernes et numériques en RH","Are we maximizing the use of existing technological solutions to promote collaboration and create a sustainable environment?","Lack of trust and lack of support in digital solutions create an inconsistent use of technological solutions","Adoption de solutions numériques fiables et intégration adéquate des utilisateurs",null,false,{"$f":"IF(I41=TRUE,COUNT(J$6:J40)+1,\"\")","v":""},null,null,null,true,true,false,2,2,"MOYEN",2,2,0,67,67,0,45,"MOYEN"]
[null,null,null,"2.4.2 RH/SST/GP-Méthodes de travail modernes et numériques en RH","Does the department adopt green sustainable work-related policies and activities?","Work-related policies have little or no consideration of green sustainability","Mise à jour des politiques pour y intégrer les concepts d’écologisation et de durabilité",null,false,{"$f":"IF(I42=TRUE,COUNT(J$6:J41)+1,\"\")","v":""},null,null,null,false,true,true,2,2,"MOYEN",0,2,1,0,67,33,33,"FAIBLE"]
[null,null,null,"2.4.3 RH/SST/GP-Méthodes de travail modernes et numériques en RH","Is virtual reality used for training?","No virtual reality used in training","Recours à la formation sur la réalité virtuelle",null,false,{"$f":"IF(I43=TRUE,COUNT(J$6:J42)+1,\"\")","v":""},null,null,null,true,true,false,2,2,"MOYEN",1,1,0,33,33,0,22,{"$f":"IF(Z43=AE450,\"Changement minimal pour l’employé\",IF(Z43<=33,\"FAIBLE\",IF(Z43<=67,\"MOYEN\",\"HIGH\")))","v":"FAIBLE"}]
[null,null,null,"2.4.4 RH/SST/GP-Méthodes de travail modernes et numériques en RH","Is there guidance or corporate knowledge on how to use/find collaboration assets (e.g. training/support system/list of experts for using tools)?","Limited guidance or corporate knowledge on how to use/find collaboration assets","Formation sur les biens favorisant la collaboration",null,false,{"$f":"IF(I44=TRUE,COUNT(J$6:J43)+1,\"\")","v":""},null,null,null,false,true,false,2,1,"FAIBLE",0,1,0,0,33,0,11,{"$f":"IF(Z44=0,\"Changement minimal pour l’employé\",IF(Z44<=33,\"FAIBLE\",IF(Z44<=67,\"MOYEN\",\"ÉLEVÉ\")))","v":"FAIBLE"}]
[null,2.5,"Apprentissage et perfectionnement","2.5.1 RH/SST/GP-Apprentissage et perfectionnement","How are employees supported and encouraged to integrate mobile, modern, agile and flexible work practices?","Current culture resists the integration of mobile, modern, agile and flexible work practices","Mise sur pied et direction d’un programme favorisant les changements culturels (pratiques de travail modernes, agiles et souples)",null,false,{"$f":"IF(I45=TRUE,COUNT(J$6:J44)+1,\"\")","v":""},null,null,null,true,true,true,2,3,"ÉLEVÉ",2,3,2,67,100,67,78,{"$f":"IF(Z45=0,\"Changement minimal pour l’employé\",IF(Z45<=33,\"FAIBLE\",IF(Z45<=67,\"MOYEN\",\"ÉLEVÉ\")))","v":"ÉLEVÉ"}]
[null,null,null,"2.5.2 RH/SST/GP-Apprentissage et perfectionnement","Do we provide managers with modern, up to date people management training and promote the approach?","Lack of a mature and modern people management training and awareness ","Méthodes de formation matures et modernes en gestion des personnes et de sensibilisation à cet égard",null,false,{"$f":"IF(I46=TRUE,COUNT(J$6:J45)+1,\"\")","v":""},null,null,null,false,false,false,2,0,"Changement minimal pour l’employé",0,3,0,0,100,0,33,{"$f":"IF(Z46=0,\"Changement minimal pour l’employé\",IF(Z46<=33,\"FAIBLE\",IF(Z46<=67,\"MOYEN\",\"ÉLEVÉ\")))","v":"FAIBLE"}]
[null,2.6,"Santé et sécurité au travail","2.6.1 RH/SST/GP-Santé et sécurité au travail","Do we have consistent application of OHS policy and directives to create an integrated culture of a safe and healthy workplace for all public servants?","Applications are inconsistent, internally focused and not government wide on health and safety requirements","Application uniforme des politiques en matière de santé et de sécurité au travail à l’échelle du GC",null,false,{"$f":"IF(I47=TRUE,COUNT(J$6:J46)+1,\"\")","v":""},null,null,null,false,false,true,2,1,"FAIBLE",0,0,3,0,0,100,33,{"$f":"IF(Z47=0,\"Changement minimal pour l’employé\",IF(Z47<=33,\"FAIBLE\",IF(Z47<=67,\"MOYEN\",\"ÉLEVÉ\")))","v":"FAIBLE"}]
[null,3,"Gestion de l’information",null,null,null,null,null,null,{"$f":"IF(B48=TRUE,COUNT(J$6:J47)+1,\"\")","v":""}]
[null,3.1,"Politiques/ Processus/ Procédures","3.1.1 Gestion de l’information-Politiques/Processus/Procédures","Are departmental IM policies reviewed and updated regularly?","GC-wide IM policies exist but have not been implemented across the department","Mise en œuvre des politiques en matière de GI à l’échelle du GC",null,false,{"$f":"IF(I49=TRUE,COUNT(J$6:J48)+1,\"\")","v":""},null,null,null,false,true,false,2,{"$f":"SUMPRODUCT(--(N49:P49))","v":1},{"$f":"IF(R49=0,\"Changement minimal pour l’employé\",IF(R49<Q49,\"FAIBLE\",IF(R49=Q49,\"MOYEN\",\"ÉLEVÉ\")))","v":"FAIBLE"},0,2,0,{"$f":"IF(T49=0,0,IF(T49<=1,33,IF(T49<=2,67,100)))","v":0},{"$f":"IF(U49=0,0,IF(U49<=1,33,IF(U49<=2,67,100)))","v":67},{"$f":"IF(V49=0,0,IF(V49<=1,33,IF(V49<=2,67,100)))","v":0},22,{"$f":"IF(Z49=0,\"Changement minimal pour l’employé\",IF(Z49<=33,\"FAIBLE\",IF(Z49<=67,\"MOYEN\",\"ÉLEVÉ\")))","v":"FAIBLE"}]
[null,3.2,"Gouvernance","3.2.1 Gestion de l’information/Gouvernance","Do you have an IM governance model?","An IM governance model is included but is not a ÉLEVÉ priority/there is no dedicated IM function within the department","Fonction de GI spécialisée au sein du Ministère",null,false,{"$f":"IF(I50=TRUE,COUNT(J$6:J49)+1,\"\")","v":""},null,null,null,false,false,true,2,1,"FAIBLE",0,0,2,0,0,67,22,"FAIBLE"]
[null,null,null,"3.2.2 Gestion de l’information/Gouvernance","Do you have IM resources to support information management/records keeping planning & governance?","Resources do not exist or have been identified but funding has not been secured","Ressources de GI stables ",null,false,{"$f":"IF(I51=TRUE,COUNT(J$6:J50)+1,\"\")","v":""},null,null,null,true,false,true,2,2,"MOYEN",0,0,2,0,0,67,22,"FAIBLE"]
[null,3.3,"Fonds de renseignements","3.3.1 Gestion de l’information/Fonds de renseignements","Do employees have the ability to share and collaborate (through cloud file-sharing) on documents with colleagues on all security classifications?","Employees have limited ability to share and or collaborate on secure documents using a cloud-based system","Perfectionner la capacité des employés à partager des documents ou de collaborer à leur élaboration à l’aide d’un système infonuagique ",null,false,{"$f":"IF(I52=TRUE,COUNT(J$6:J51)+1,\"\")","v":""},null,null,null,true,true,true,2,3,"ÉLEVÉ",2,2,2,67,67,67,67,"MOYEN"]
[null,null,null,"3.3.2 Gestion de l’information/Fonds de renseignements","What is the environment to manage physical (paper) and electronic data?","Departmental funding or strategy is not in place to digitize paper-based documents; limited/no ability to share paper based documents; mass storage of paper documents persist","Faire la transition vers un environnement sans papier ou à papier réduit ",null,false,{"$f":"IF(I53=TRUE,COUNT(J$6:J52)+1,\"\")","v":""},null,null,null,true,true,true,2,3,"ÉLEVÉ",2,2,2,67,67,67,67,"MOYEN"]
[null,null,null,"3.3.3 Gestion de l’information/Fonds de renseignements","Does the department manage digital documents throughout the lifecycle?","Departmental branches are only able to manage paper information through its lifecycle and have no ability to manage digital documents","Gestion des documents numériques tout au long de leur cycle de vie",null,false,{"$f":"IF(I54=TRUE,COUNT(J$6:J53)+1,\"\")","v":""},null,null,null,true,true,true,2,3,"ÉLEVÉ",2,2,2,67,67,67,67,"MOYEN"]
[null,null,null,"3.3.4 Gestion de l’information/Fonds de renseignements","How are documents being stored?","No departmental funding or strategy in place to digitize paper-based documents; limited/no ability to share paper based documents; mass storage of paper documents persist","Stratégie de numérisation : réduction de l’espace d’entreposage des documents papier",null,false,{"$f":"IF(I55=TRUE,COUNT(J$6:J54)+1,\"\")","v":""},null,null,null,true,true,true,2,3,"ÉLEVÉ",2,2,2,67,67,67,67,"MOYEN"]
[null,null,null,"3.3.5 Gestion de l’information/Fonds de renseignements","Does your organization have capacity to perform Document discovery, Access to Information and Privacy (ATIP), Privacy etc. requests?","Limited capacity to perform document discovery, ATIP, Privacy etc.","Communication de documents (demandes d’accès à l’information et de protection des renseignements personnels, confidentialité) : accroissement de la capacité du Ministère ",null,false,{"$f":"IF(I56=TRUE,COUNT(J$6:J55)+1,\"\")","v":""},null,null,null,true,true,true,2,3,"ÉLEVÉ",1,1,1,33,33,33,33,"FAIBLE"]
[null,3.4,"Outils de gestion du contenu","3.4.1 Gestion de l’information/Outils de gestion du contenu","How is information held within databases (centrally and unified or fragmented)?","Databases are not unified and are disparately held and controlled within the department","Bases de données (RH, sécurité, Active Directory) : gérées à l’échelle du Ministère",null,false,{"$f":"IF(I57=TRUE,COUNT(J$6:J56)+1,\"\")","v":""},null,null,null,false,false,false,2,0,"Changement minimal pour l’employé",0,0,0,0,0,0,0,"Changement minimal pour l’employé"]
[null,null,null,"3.4.2 Gestion de l’information/Outils de gestion du contenu","Are business intelligence reports/dashboards automated and personalized?","Business intelligence reporting is a manual activity","Tableaux de bord automatisés",null,false,{"$f":"IF(I58=TRUE,COUNT(J$6:J57)+1,\"\")","v":""},null,null,null,false,false,false,2,0,"Changement minimal pour l’employé",0,0,0,0,0,0,0,"Changement minimal pour l’employé"]
[null,null,null,"3.4.3 Gestion de l’information/Outils de gestion du contenu","How is your document management system rolled out/implemented?","No departmental document management system exists or a disparate document management system is used across the department","Système centralisé de gestion des documents",null,false,{"$f":"IF(I59=TRUE,COUNT(J$6:J58)+1,\"\")","v":""},null,null,null,true,true,true,2,3,"ÉLEVÉ",3,3,3,100,100,100,100,"ÉLEVÉ"]
[null,null,null,"3.4.4 Gestion de l’information/Outils de gestion du contenu","Does a cloud file-sharing solution exist within the organization?","Disparate cloud file-sharing solution exists within the department","Solution infonuagique de partage de fichiers",null,false,{"$f":"IF(I60=TRUE,COUNT(J$6:J59)+1,\"\")","v":""},null,null,null,true,true,true,2,3,"ÉLEVÉ",3,3,3,100,100,100,100,"ÉLEVÉ"]
[null,null,null,"3.4.5 Gestion de l’information/Outils de gestion du contenu","How does the department manage its document lifecycle?","There are a lack of tools to manage lifecycle management/managed disposal of physical and digital data","Outils de gestion du cycle de vie des documents et d’élimination des données matérielles et numériques",null,false,{"$f":"IF(I61=TRUE,COUNT(J$6:J60)+1,\"\")","v":""},null,null,null,false,false,false,2,0,"Changement minimal pour l’employé",0,0,0,0,0,0,0,"Changement minimal pour l’employé"]
[null,null,null,"3.4.6 Gestion de l’information/Outils de gestion du contenu","Does your organization have capacity to work on secret documents from more than one work point?","Limited ability to work on secret documents from more than one work point","Capacité de travailler à des documents secrets à partir de plus d’un poste de travail",null,false,{"$f":"IF(I62=TRUE,COUNT(J$6:J61)+1,\"\")","v":""},null,null,null,true,false,false,2,1,"FAIBLE",1,0,0,33,0,0,11,"FAIBLE"]
[null,null,null,"3.4.7 Gestion de l’information/Outils de gestion du contenu","How does the department manage duplication and version control of documents?","Tools are being used in an ad-hoc manner to identify duplicate documents","Réduction de la production en double de documents électroniques : nouvel outil ou nouvelles fonctions",null,false,{"$f":"IF(I63=TRUE,COUNT(J$6:J62)+1,\"\")","v":""},null,null,null,true,true,false,2,2,"MOYEN",1,1,0,33,33,0,22,"FAIBLE"]
[null,null,null,"3.4.8 Gestion de l’information/Outils de gestion du contenu","How does the department manage the capture of information resource of business value (IRBV) and information resource of enduring value (IREV) digital documentation when off boarding employees?","Limited capacity to capture IRBV and IREV digital documentation/assets when off-boarding employees","Saisie des ressources documentaires à valeur opérationnelle et des ressources documentaires à valeur durable lors du départ d’employés (GCdocs)",null,false,{"$f":"IF(I64=TRUE,COUNT(J$6:J63)+1,\"\")","v":""},null,null,null,false,false,false,2,0,"Changement minimal pour l’employé",0,0,0,0,0,0,0,"Changement minimal pour l’employé"]
[null,null,null,"3.4.9 Gestion de l’information/Outils de gestion du contenu","Are document management tools able to automate security classification levels?","Limited departmental document management tool exists or being applied that alFAIBLE multiple security classification levels to be accessed by employees with the correct security clearance and privileges","Niveaux de classification de sécurité multiples : nouvelles fonctions",null,false,{"$f":"IF(I65=TRUE,COUNT(J$6:J64)+1,\"\")","v":""},null,null,null,true,true,true,2,3,"ÉLEVÉ",1,1,1,33,33,33,33,"FAIBLE"]
[null,null,null,"3.4.10 Gestion de l’information/Outils de gestion du contenu","Do you use auto classification tools for document and records management?","No auto document and records management tool exists, or a manual process exists though employees are relied on to append metadata","Autoclassification des documents (GCdocs) : nouvelles fonctions",null,false,{"$f":"IF(I66=TRUE,COUNT(J$6:J65)+1,\"\")","v":""},null,null,null,true,true,true,2,3,"ÉLEVÉ",1,1,1,33,33,33,33,"FAIBLE"]
[null,null,null,"3.4.11 Gestion de l’information/Outils de gestion du contenu","Is imaging software available and compliant to set standards?","Limited and inconsistent imaging software and standards used by Branch/Directorate/Division. Non-existent imaging software and not using standards Branch/Directorate/Division standards","Services d’imagerie : nouvel outil",null,false,{"$f":"IF(I67=TRUE,COUNT(J$6:J66)+1,\"\")","v":""},null,null,null,true,false,false,2,1,"FAIBLE",1,0,0,33,0,0,11,"FAIBLE"]
[null,null,null,"3.4.12 Gestion de l’information/Outils de gestion du contenu","Do monitoring and reporting tools exist for quality control?","Limited and inconsistent monitoring and reporting tools exist","Outils de surveillance et d’établissement de rapports : nouveaux outils",null,false,{"$f":"IF(I68=TRUE,COUNT(J$6:J67)+1,\"\")","v":""},null,null,null,false,false,false,2,0,"Changement minimal pour l’employé",0,0,0,0,0,0,0,"Changement minimal pour l’employé"]
[null,3.5,"Soutien, sensibilisation, participation et formation","3.5.1 Gestion de l’information-Soutien, sensibilisation, participation et formation","How is your ability to communicate IM awareness, education and training ","Inconsistent ability to communicate on IM awareness, education, deliver training throughout the department","Sensibilisation à la GI et formation sur celle-ci",null,false,{"$f":"IF(I69=TRUE,COUNT(J$6:J68)+1,\"\")","v":""},null,null,null,false,true,false,2,1,"FAIBLE",0,2,0,0,67,0,22,"FAIBLE"]
[null,null,null,"3.5.2 Gestion de l’information-Soutien, sensibilisation, participation et formation","Does the department have the capability to help employees with an IM support network?","Unreliable access to departmental ongoing guidance and support","Orientation et soutien en matière de GI",null,false,{"$f":"IF(I70=TRUE,COUNT(J$6:J69)+1,\"\")","v":""},null,null,null,false,true,false,2,1,"FAIBLE",0,1,0,0,33,0,11,"FAIBLE"]
[null,4,"Sécurité"]
[null,4.0999999999999996,"Politique sur la sécurité","4.1.1 Sécurité/Politique sur la sécurité","How well are security policies established and updated?","Departmental security policies are leveraged from the Treasury Board","Politiques à jour en matière de sécurité",null,false,{"$f":"IF(I72=TRUE,COUNT(J$6:J71)+1,\"\")","v":""},null,null,null,false,false,false,2,{"$f":"SUMPRODUCT(--(N72:P72))","v":0},{"$f":"IF(R72=0,\"Changement minimal pour l’employé\",IF(R72<Q72,\"FAIBLE\",IF(R72=Q72,\"MOYEN\",\"ÉLEVÉ\")))","v":"Changement minimal pour l’employé"},0,0,0,{"$f":"IF(T72=0,0,IF(T72<=1,33,IF(T72<=2,67,100)))","v":0},{"$f":"IF(U72=0,0,IF(U72<=1,33,IF(U72<=2,67,100)))","v":0},{"$f":"IF(V72=0,0,IF(V72<=1,33,IF(V72<=2,67,100)))","v":0},0,{"$f":"IF(Z72=0,\"Changement minimal pour l’employé\",IF(Z72<=33,\"FAIBLE\",IF(Z72<=67,\"MOYEN\",\"ÉLEVÉ\")))","v":"Changement minimal pour l’employé"}]
[null,4.2,"Sensibilisation sur la sécurité","4.2.1 Sécurité/Sensibilisation sur la sécurité","Does a security awareness program exist?","A security awareness program exists for employees but with limited MOYENia and resources","Solide programme de sensibilisation à la sécurité à l’intention des employés",null,false,{"$f":"IF(I73=TRUE,COUNT(J$6:J72)+1,\"\")","v":""},null,null,null,false,true,false,2,1,"FAIBLE",0,2,0,0,67,0,22,"FAIBLE"]
[null,null,null,"4.2.2 Sécurité/Sensibilisation sur la sécurité","Is the security awareness program tailored to duties of employees?","Security awareness program and resources are rarely tailored to duties of employees","Solide programme de sensibilisation sur la sécurité à l’intention des employés",null,false,{"$f":"IF(I74=TRUE,COUNT(J$6:J73)+1,\"\")","v":""},null,null,null,false,false,false,2,0,"Changement minimal pour l’employé",0,0,0,0,0,0,{"$f":"ROUND(AVERAGE(W74:Y74),0)","v":0},"Changement minimal pour l’employé"]
[null,null,null,"4.2.3 Sécurité/Sensibilisation sur la sécurité","What resources do you have allocated to your security and awareness program?","Limited resources (< than 1 FTE [full time employee] for 2500 employees) are responsible for the security awareness program","Ressources stables et adéquates affectées au programme de sensibilisation à la sécurité",null,false,{"$f":"IF(I75=TRUE,COUNT(J$6:J74)+1,\"\")","v":""},null,null,null,false,false,true,2,1,"FAIBLE",0,0,1,0,0,33,11,"FAIBLE"]
[null,4.3,"Sécurité de l’information","4.3.1 Sécurité/Sécurité de l’information","How is the security classification marked within the department or agency?","Manual or no application of security classification/categorization of government information","Application de niveaux de sécurité à l’information (marquage des documents)",null,false,{"$f":"IF(I76=TRUE,COUNT(J$6:J75)+1,\"\")","v":""},null,null,null,true,true,true,2,3,"ÉLEVÉ",1,1,1,33,33,33,33,"FAIBLE"]
[null,null,null,"4.3.2 Sécurité/Sécurité de l’information","Is data classified/categorized correctly within the department or agency?","Security classifications/categorization are inconsistently or inaccurately applied to departmental or agency information","Processus rigoureux de classement par niveau de sécurité",null,false,{"$f":"IF(I77=TRUE,COUNT(J$6:J76)+1,\"\")","v":""},null,null,null,false,true,false,2,1,"FAIBLE",0,1,0,0,33,0,11,"FAIBLE"]
[null,null,null,"4.3.3 Sécurité/Sécurité de l’information","How often are audits conducted of office space or electronic data repositories?","Department or agency performs audits and administrative investigations in response to incidents, as required","Signalement rapide des incidents",null,false,{"$f":"IF(I78=TRUE,COUNT(J$6:J77)+1,\"\")","v":""},null,null,null,false,false,false,2,0,"Changement minimal pour l’employé",0,0,0,0,0,0,0,"Changement minimal pour l’employé"]
[null,null,null,"4.3.4 Sécurité/Sécurité de l’information","How secure is the storage and destruction of protected/sensitive information?","Approved containers and equipment for the storage and destruction of protected/sensitive information are provided, though only in limited locations, and may not meet the maximum classification/categorization level required within the department or agency","Programme d’entreposage et de destruction des documents classifiés",null,false,{"$f":"IF(I79=TRUE,COUNT(J$6:J78)+1,\"\")","v":""},null,null,null,false,false,false,2,0,"Changement minimal pour l’employé",0,0,0,0,0,0,0,"Changement minimal pour l’employé"]
[null,4.4000000000000004,"Sécurité du personnel","4.4.1 Sécurité/Sécurité du personnel","How secure is access to government information, assets and/or facilities?","Access to government information, assets and/or facilities is not uniformly controlled at the department or agency level","Contrôle centralisé/ministériel de l’accès à l’information et aux biens",null,false,{"$f":"IF(I80=TRUE,COUNT(J$6:J79)+1,\"\")","v":""},null,null,null,false,false,false,2,0,"Changement minimal pour l’employé",0,0,0,0,0,0,0,"Changement minimal pour l’employé"]
[null,null,null,"4.4.2 Sécurité/Sécurité du personnel","How are security screening levels determined?","Security screening levels are departmentally determined, based on position and are inconsistent and non-transferable between GC departments/agencies","Contrôle centralisé des enquêtes de sécurité harmonisé avec l’approche du GC",null,false,{"$f":"IF(I81=TRUE,COUNT(J$6:J80)+1,\"\")","v":""},null,null,null,false,false,false,2,0,"Changement minimal pour l’employé",0,0,0,0,0,0,0,"Changement minimal pour l’employé"]
[null,null,null,"4.4.3 Sécurité/Sécurité du personnel","How is access control controlled?","A formal process for granting and revoking access does not exist and the department or agency performs audits only when mandated by a central agency","Processus officiel d’autorisation et de révocation d’accès",null,false,{"$f":"IF(I82=TRUE,COUNT(J$6:J81)+1,\"\")","v":""},null,null,null,false,false,false,2,0,"Changement minimal pour l’employé",0,0,0,0,0,0,0,"Changement minimal pour l’employé"]
[null,4.5,"Gestion des urgences","4.5.1 Sécurité/Gestion des urgences","How well are employees trained on what to do in the event of an emergency?","Employees have minimal training on what to do in the event of an emergency, though it is not tested, rehearsed or practiced","Solide formation sur la gestion des urgences à l’intention des employés (examen et mise en pratique)",null,false,{"$f":"IF(I83=TRUE,COUNT(J$6:J82)+1,\"\")","v":""},null,null,null,false,true,false,2,1,"FAIBLE",0,1,0,0,33,0,11,"FAIBLE"]
[null,null,null,"4.5.2 Sécurité/Gestion des urgences","How does the department manage its emergency management policies and strategies?","Emergency management policies, strategies and incident response plans are managed by the major tenant","Politiques et stratégies ministérielles sur la gestion des urgences",null,false,{"$f":"IF(I84=TRUE,COUNT(J$6:J83)+1,\"\")","v":""},null,null,null,false,false,false,2,0,"Changement minimal pour l’employé",0,0,0,0,0,0,0,"Changement minimal pour l’employé"]
[null,null,null,"4.5.3 Sécurité/Gestion des urgences","How consistent are the department's emergency notifications?","Inconsistent emergency notifications within the department or agency","Diffusion en même temps d’avis uniformes en cas d’urgence à tous les employés",null,false,{"$f":"IF(I85=TRUE,COUNT(J$6:J84)+1,\"\")","v":""},null,null,null,false,true,false,2,1,"FAIBLE",0,1,0,0,33,0,11,"FAIBLE"]
[null,4.5999999999999996,"Sécurité physique","4.6.1 Sécurité/Sécurité physique","How well are security considerations integrated into the planning, site selection, design, procurement, contracting, construction, modification, operation and maintenance of facilities?","Security considerations are partially integrated into the planning, site selection, design, procurement, contracting, construction, modification, operation and maintenance of facilities","Intégration des considérations en matière de sécurité à la planification, à la sélection de l’emplacement, à la conception, etc. (installations)",null,false,{"$f":"IF(I86=TRUE,COUNT(J$6:J85)+1,\"\")","v":""},null,null,null,false,false,false,2,0,"Changement minimal pour l’employé",0,0,0,0,0,0,0,"Changement minimal pour l’employé"]
[null,null,null,"4.6.2 Sécurité/Sécurité physique","How are physical security and identity management systems implemented?","Department or agency uses multiple security and identity management systems to administer building access or have manual and/or lengthy processes in place","Système de gestion de l’identité unique",null,false,{"$f":"IF(I87=TRUE,COUNT(J$6:J86)+1,\"\")","v":""},null,null,null,false,true,true,2,2,"MOYEN",0,1,1,0,33,33,22,"FAIBLE"]
[null,null,null,"4.6.3 Sécurité/Sécurité physique","How is physical access granted?","Physical access is departmentally issued and employee access is restricted to primary work location as identified by the manager","Accès intégré des employés aux emplacements",null,false,{"$f":"IF(I88=TRUE,COUNT(J$6:J87)+1,\"\")","v":""},null,null,null,false,true,true,2,2,"MOYEN",0,1,1,0,33,33,22,"FAIBLE"]
[null,null,null,"4.6.4 Sécurité/Sécurité physique","What physical security methods are used for building access?","Use RFID to access buildings, floors and rooms within departments/agencies","Système d’accès intégré aux immeubles",null,false,{"$f":"IF(I89=TRUE,COUNT(J$6:J88)+1,\"\")","v":""},null,null,null,false,false,false,2,0,"Changement minimal pour l’employé",0,0,0,0,0,0,0,"Changement minimal pour l’employé"]
[null,4.7,"Sécurité des TI","4.7.1 Sécurité/Sécurité des TI","What measures are in place to prevent loss of GC data?","Department or agency has limited technical controls in place to safeguard and protect privacy of data at rest and in motion","Solide contrôle technique pour la protection des données et des renseignements personnels ",null,false,{"$f":"IF(I90=TRUE,COUNT(J$6:J89)+1,\"\")","v":""},null,null,null,false,false,false,2,0,"Changement minimal pour l’employé",0,0,0,0,0,0,0,"Changement minimal pour l’employé"]
[null,null,null,"4.7.2 Sécurité/Sécurité des TI","Are systems and networks certified to the correct level?","Systems and networks are not certified to the required security level","Attestation au niveau de sécurité requis des systèmes et des réseaux",null,false,{"$f":"IF(I91=TRUE,COUNT(J$6:J90)+1,\"\")","v":""},null,null,null,false,false,false,2,0,"Changement minimal pour l’employé",0,0,0,0,0,0,0,"Changement minimal pour l’employé"]
[null,null,null,"4.7.3 Sécurité/Sécurité des TI","How much authorized access is there to your secret network or infrastructure?","Limited access to secret network or infrastructure for authorized users based on security clearance and the need-to-know principle","Accès au réseau secret accordé à tous les employés qui en ont besoin",null,false,{"$f":"IF(I92=TRUE,COUNT(J$6:J91)+1,\"\")","v":""},null,null,null,true,true,true,2,3,"ÉLEVÉ",1,2,1,33,67,33,44,"MOYEN"]
[null,null,null,"4.7.4 Sécurité/Sécurité des TI","How up to date are your systems and applications in terms of Security Assessment and Authorization (SA&A)?","Fewer than 60% of systems and applications have updated SA&A at the department or agency level","Évaluation et autorisation de sécurité à jour pour la plupart ou l’ensemble des systèmes",null,false,{"$f":"IF(I93=TRUE,COUNT(J$6:J92)+1,\"\")","v":""},null,null,null,false,false,false,2,0,"Changement minimal pour l’employé",0,0,0,0,0,0,0,"Changement minimal pour l’employé"]
[null,5,"Installations, matériel et aménagement intérieur",null,null,"FAIBLE",null,null,null,{"$f":"IF(B94=TRUE,COUNT(J$6:J93)+1,\"\")","v":""}]
[null,5.0999999999999996,"Accessibilité","5.1.1 Installations, matériel et aménagement intérieur/Accessibilité","How well is inclusivity considered in the office layout and design?","Inclusivity is not consistently applied in office layout and design","Prise en compte de l’inclusivité dans la conception des bureaux",null,false,{"$f":"IF(I95=TRUE,COUNT(J$6:J94)+1,\"\")","v":""},null,null,null,false,true,false,2,{"$f":"SUMPRODUCT(--(N95:P95))","v":1},{"$f":"IF(R95=0,\"Changement minimal pour l’employé\",IF(R95<Q95,\"FAIBLE\",IF(R95=Q95,\"MOYEN\",\"ÉLEVÉ\")))","v":"FAIBLE"},0,1,0,{"$f":"IF(T95=0,0,IF(T95<=1,33,IF(T95<=2,67,100)))","v":0},{"$f":"IF(U95=0,0,IF(U95<=1,33,IF(U95<=2,67,100)))","v":33},{"$f":"IF(V95=0,0,IF(V95<=1,33,IF(V95<=2,67,100)))","v":0},{"$f":"ROUND(AVERAGE(W95:Y95),0)","v":11},{"$f":"IF(Z95=0,\"Changement minimal pour l’employé\",IF(Z95<=33,\"FAIBLE\",IF(Z95<=67,\"MOYEN\",\"ÉLEVÉ\")))","v":"FAIBLE"}]
[null,null,null,"5.1.2 Installations, matériel et aménagement intérieur/Accessibilité","What work spaces do employees have access to after hours?","Employees have restricted access to departmental buildings after hours","Prolongation des heures d’accès aux immeubles du Ministère",null,false,{"$f":"IF(I96=TRUE,COUNT(J$6:J95)+1,\"\")","v":""},null,null,null,false,true,false,2,{"$f":"SUMPRODUCT(--(N96:P96))","v":1},"FAIBLE",0,1,0,0,33,0,11,"FAIBLE"]
[null,5.2,"Postes de travail","5.2.1 Installations, matériel et aménagement intérieur/Postes de travail","Are employees provided multiple work points (including collaboration zones) to choose from?","Limited choice in type of work points available for employees","Plus de choix de type de postes de travail",null,false,{"$f":"IF(I97=TRUE,COUNT(J$6:J96)+1,\"\")","v":""},null,null,null,true,true,true,2,{"$f":"SUMPRODUCT(--(N97:P97))","v":3},"ÉLEVÉ",2,3,3,67,100,100,89,"ÉLEVÉ"]
[null,null,null,"5.2.2 Installations, matériel et aménagement intérieur/Postes de travail","Are employees free to work in any location with a variety of work point locations?","Employees have an assigned work point, (typically) in a fixed location and are not able to book via an online reservation system","Transition vers un environnement de postes de travail non attribués ",null,false,{"$f":"IF(I98=TRUE,COUNT(J$6:J97)+1,\"\")","v":""},null,null,null,true,true,true,2,{"$f":"SUMPRODUCT(--(N98:P98))","v":3},"ÉLEVÉ",2,3,3,67,100,100,89,"ÉLEVÉ"]
[null,null,null,"5.2.3 Installations, matériel et aménagement intérieur/Postes de travail","Do work points have ergonomic considerations factored in (e.g. adjustable furniture)?","Ergonomic considerations are inconsistent","Ergonomie prise en compte dans tous les postes de travail",null,false,{"$f":"IF(I99=TRUE,COUNT(J$6:J98)+1,\"\")","v":""},null,null,null,true,true,false,2,{"$f":"SUMPRODUCT(--(N99:P99))","v":2},"MOYEN",1,2,0,33,67,0,33,"FAIBLE"]
[null,5.3,"Installations","5.3.1 Installations, matériel et aménagement intérieur/Installations","Do employees have access to a healthy environment (e.g. gyms, cafes, access to healthy foods, bike racks etc.)?","Departmental facilities are not offering a healthy environment","Accès à un environnement sain (p. ex. centre de conditionnement physique, aliments sains, support à vélos, etc.)",null,false,{"$f":"IF(I100=TRUE,COUNT(J$6:J99)+1,\"\")","v":""},null,null,null,false,true,false,2,{"$f":"SUMPRODUCT(--(N100:P100))","v":1},"FAIBLE",0,1,0,0,33,0,11,"FAIBLE"]
[null,null,null,"5.3.2 Installations, matériel et aménagement intérieur/Installations","How environmentally friendly are the facilities?","Departmental facilities have a ÉLEVÉ carbon footprint/offer no renewable method of energy generation and/or little to no recycling","Recyclage, faible empreinte carbone et méthode de production d’énergie renouvelable ",null,false,{"$f":"IF(I101=TRUE,COUNT(J$6:J100)+1,\"\")","v":""},null,null,null,false,false,false,2,0,"Changement minimal pour l’employé",0,0,0,0,0,0,0,"Changement minimal pour l’employé"]
[null,null,null,"5.3.3 Installations, matériel et aménagement intérieur/Installations","How 'smart' are the office spaces?","Most office space is not smart and has manual functions (e.g. blinds, lights etc.)","Locaux à bureaux intelligents (stores automatiques, ascenseurs intelligents, éclairage automatique, régulation de la température, etc.)",null,false,{"$f":"IF(I102=TRUE,COUNT(J$6:J101)+1,\"\")","v":""},null,null,null,true,true,false,2,2,"MOYEN",1,1,0,33,33,0,22,"FAIBLE"]
[null,null,null,"5.3.4 Installations, matériel et aménagement intérieur/Installations","Do your facilities have  an internationally recognized accreditation","Leased and Crown facilities have no accreditation","Installations louées ou appartenant à l’État certifiées ",null,false,{"$f":"IF(I103=TRUE,COUNT(J$6:J102)+1,\"\")","v":""},null,null,null,false,false,false,2,0,"Changement minimal pour l’employé",0,0,0,0,0,0,0,"Changement minimal pour l’employé"]
[null,null,null,"5.3.5 Installations, matériel et aménagement intérieur/Installations","Does your workplace offer storage for your personal effects?","Employees have no choice in type of storage/locker or nothing is offered","Casiers",null,false,{"$f":"IF(I104=TRUE,COUNT(J$6:J103)+1,\"\")","v":""},null,null,null,true,true,true,2,3,"ÉLEVÉ",1,3,1,33,100,33,55,"MOYEN"]
[null,null,null,"5.3.6 Installations, matériel et aménagement intérieur/Installations","Does your workplace offer the means to travel between buildings? (e.g. green transportation system, shuttle system etc.)","The workplace does not offer the means to travel between buildings","Transport écologique entre les immeubles",null,false,{"$f":"IF(I105=TRUE,COUNT(J$6:J104)+1,\"\")","v":""},null,null,null,false,true,true,2,2,"MOYEN",0,1,1,0,33,33,22,"FAIBLE"]
[null,5.4,"Aménagement intérieur","5.4.1 Installations, matériel et aménagement intérieur/Aménagement intérieur","Does your workplace offer an inspiring environment? (e.g. natural light, motivating colors etc.)","Department does not offer an interior design that provides an inspiring work environment","Environnement de travail inspirant",null,false,{"$f":"IF(I106=TRUE,COUNT(J$6:J105)+1,\"\")","v":""},null,null,null,false,false,false,2,{"$f":"SUMPRODUCT(--(N106:P106))","v":0},"Changement minimal pour l’employé",0,0,0,0,0,0,0,"Changement minimal pour l’employé"]
[null,null,null,"5.4.2 Installations, matériel et aménagement intérieur/Aménagement intérieur","How well do your offices use assets (e.g. privacy glass, security zoning, privacy screens etc.) that promote security?","The interior design of department offices do not use assets that promote security or they are not used properly","Biens permettant de promouvoir la sécurité",null,false,{"$f":"IF(I107=TRUE,COUNT(J$6:J106)+1,\"\")","v":""},null,null,null,false,false,false,2,{"$f":"SUMPRODUCT(--(N107:P107))","v":0},"Changement minimal pour l’employé",0,0,0,0,0,0,0,"Changement minimal pour l’employé"]
[null,null,null,"5.4.3 Installations, matériel et aménagement intérieur/Aménagement intérieur","How well does office interior design promote collaboration (e.g. writable walls, collaboration spaces etc.)?","The interior design of department offices limits collaboration","Aires de collaboration",null,false,{"$f":"IF(I108=TRUE,COUNT(J$6:J107)+1,\"\")","v":""},null,null,null,true,true,false,2,{"$f":"SUMPRODUCT(--(N108:P108))","v":2},"MOYEN",1,2,0,33,67,0,33,"FAIBLE"]
[null,null,null,"5.4.4 Installations, matériel et aménagement intérieur/Aménagement intérieur","How well do your offices offer non-work related activities (e.g. ping-pong tables etc.)?","The department offers few spaces dedicated to non-work related activities","Aires de socialisation (ou activités non liées au travail)",null,false,{"$f":"IF(I109=TRUE,COUNT(J$6:J108)+1,\"\")","v":""},null,null,null,true,true,false,2,{"$f":"SUMPRODUCT(--(N109:P109))","v":2},"MOYEN",1,2,0,33,67,0,33,"FAIBLE"]
[null,null,null,"5.4.5 Installations, matériel et aménagement intérieur/Aménagement intérieur","Does your current workplace offer a variety of work zones that suits your needs and preferences? (e.g. 'Do not disturb me' zone, Collaboration Space, Activities Area)","The department does not offer a workplace with different work zones","Zones de travail variées",null,false,{"$f":"IF(I110=TRUE,COUNT(J$6:J109)+1,\"\")","v":""},null,null,null,true,true,true,2,{"$f":"SUMPRODUCT(--(N110:P110))","v":3},"ÉLEVÉ",2,3,3,67,100,100,89,"ÉLEVÉ"]

{"sheet":" Étape 2 – Nombre d’ETP touchés","index":2,"n_rows":104,"n_cols":24,"rows_kept":104,"cut":false,"hidden":false,"merged":[[0,1,0,24],[1,1,1,3]]}
[null,"Étape 2 – Combien d’employés sont touchés par les changements?"]
[null,"Vous trouverez ci-dessous une liste des changements qui ont été indiqués à l’étape 1 du projet de modernisation de votre organisation. Le type de changement (outils, comportement et processus) y est également indiqué, ainsi que le degré de changement pour chacun des éléments. Votre prochaine tâche consistera à inclure le nombre total d’employés de votre organisation qui font partie du projet (TÂCHE 1). Ensuite, pour chaque changement dans la liste ci-dessous, indiquez le nombre d’employés touchés dans la colonne grise (TÂCHE 2). Par exemple, 2 000 employés peuvent être impliqués dans le projet de modernisation, mais seuls 500 seront touchés par l’un des changements. Plus le nombre d’employés touchés est élevé, plus l’incidence sur l’organisation sera importante. Par conséquent, un niveau d’effort plus élevé sera nécessaire pour gérer le changement précis. "]
[null,"                                                                                 Nombre d’employés dans l’organisation                 "]
[null,"Liste des changements","Nombre d’ETP touchés\n(nombre d’ETP)","Pourcentage global des ETP touchés \n(%)","Check If applicable change to your organization","Formula only","Formula\nfor order in Step2 Page","T","B","P","formula\nfor F","formula\nfor G","formula\nfor H","Base point","Score of Change","Degree of Change","Weigth of change\nT","Weigth of change\nB","Weigth of change\nP","Weigth of change\nT","Weigth of change\nB","Weigth of change\nP","Overall,how big of a change?","Degree of Change"]
[{"$f":"ROW()-4","v":1},{"$f":"IF(ISERROR(MATCH($A5,'[1]Step 1-What is changing'!$J:$J,0)),\"\",INDEX('Étape 1 – Ce qui change'!$D:$D,MATCH($A5,'[1]Step 1-What is changing'!$J:$J,0))&\" - \"&INDEX('Étape 1 – Ce qui change'!$G:$G,MATCH($A5,'[1]Step 1-What is changing'!$J:$J,0)))","v":""},0,{"$f":"100*C5/$C$3","v":{"$error":"#DIV/0!"}},{"$f":"IF(F5=TRUE,\"X\",\"\")","v":""},{"$f":"IF(ISERROR(MATCH($A5,'[1]Step 1-What is changing'!$J:$J,0)),\"\",INDEX('Étape 1 – Ce qui change'!$I:$I,MATCH($A5,'[1]Step 1-What is changing'!$J:$J,0)))","v":""},{"$f":"IF(ISERROR(MATCH($A5,'[1]Step 1-What is changing'!$J:$J,0)),\"\",INDEX('Étape 1 – Ce qui change'!$J:$J,MATCH($A5,'[1]Step 1-What is changing'!$J:$J,0)))","v":""},{"$f":"IF(K5=TRUE,\"X\",\"\")","v":""},"","",{"$f":"IF(ISERROR(MATCH($A5,'[1]Step 1-What is changing'!$J:$J,0)),\"\",INDEX('Étape 1 – Ce qui change'!$N:$N,MATCH($A5,'[1]Step 1-What is changing'!$J:$J,0)))","v":""},{"$f":"IF(ISERROR(MATCH($A5,'[1]Step 1-What is changing'!$J:$J,0)),\"\",INDEX('Étape 1 – Ce qui change'!$O:$O,MATCH($A5,'[1]Step 1-What is changing'!$J:$J,0)))","v":""},{"$f":"IF(ISERROR(MATCH($A5,'[1]Step 1-What is changing'!$J:$J,0)),\"\",INDEX('Étape 1 – Ce qui change'!$P:$P,MATCH($A5,'[1]Step 1-What is changing'!$J:$J,0)))","v":""},{"$f":"IF(ISERROR(MATCH($A5,'[1]Step 1-What is changing'!$J:$J,0)),\"\",INDEX('Étape 1 – Ce qui change'!$Q:$Q,MATCH($A5,'[1]Step 1-What is changing'!$J:$J,0)))","v":""},{"$f":"IF(ISERROR(MATCH($A5,'[1]Step 1-What is changing'!$J:$J,0)),\"\",INDEX('Étape 1 – Ce qui change'!$R:$R,MATCH($A5,'[1]Step 1-What is changing'!$J:$J,0)))","v":""},{"$f":"IF(ISERROR(MATCH($A5,'[1]Step 1-What is changing'!$J:$J,0)),\"\",INDEX('Étape 1 – Ce qui change'!$S:$S,MATCH($A5,'[1]Step 1-What is changing'!$J:$J,0)))","v":""},{"$f":"IF(ISERROR(MATCH($A5,'[1]Step 1-What is changing'!$J:$J,0)),\"\",INDEX('Étape 1 – Ce qui change'!$T:$T,MATCH($A5,'[1]Step 1-What is changing'!$J:$J,0)))","v":""},{"$f":"IF(ISERROR(MATCH($A5,'[1]Step 1-What is changing'!$J:$J,0)),\"\",INDEX('Étape 1 – Ce qui change'!$U:$U,MATCH($A5,'[1]Step 1-What is changing'!$J:$J,0)))","v":""},{"$f":"IF(ISERROR(MATCH($A5,'[1]Step 1-What is changing'!$J:$J,0)),\"\",INDEX('Étape 1 – Ce qui change'!$V:$V,MATCH($A5,'[1]Step 1-What is changing'!$J:$J,0)))","v":""},{"$f":"IF(ISERROR(MATCH($A5,'[1]Step 1-What is changing'!$J:$J,0)),\"\",INDEX('Étape 1 – Ce qui change'!$W:$W,MATCH($A5,'[1]Step 1-What is changing'!$J:$J,0)))","v":""},{"$f":"IF(ISERROR(MATCH($A5,'[1]Step 1-What is changing'!$J:$J,0)),\"\",INDEX('Étape 1 – Ce qui change'!$X:$X,MATCH($A5,'[1]Step 1-What is changing'!$J:$J,0)))","v":""},{"$f":"IF(ISERROR(MATCH($A5,'[1]Step 1-What is changing'!$J:$J,0)),\"\",INDEX('Étape 1 – Ce qui change'!$Y:$Y,MATCH($A5,'[1]Step 1-What is changing'!$J:$J,0)))","v":""},{"$f":"IF(ISERROR(MATCH($A5,'[1]Step 1-What is changing'!$J:$J,0)),\"\",INDEX('Étape 1 – Ce qui change'!$Z:$Z,MATCH($A5,'[1]Step 1-What is changing'!$J:$J,0)))","v":""},{"$f":"IF(ISERROR(MATCH($A5,'[1]Step 1-What is changing'!$J:$J,0)),\"\",INDEX('Étape 1 – Ce qui change'!$AA:$AA,MATCH($A5,'[1]Step 1-What is changing'!$J:$J,0)))","v":""}]
[{"$f":"ROW()-4","v":2},{"$f":"IF(ISERROR(MATCH($A6,'[1]Step 1-What is changing'!$J:$J,0)),\"\",INDEX('Étape 1 – Ce qui change'!$D:$D,MATCH($A6,'[1]Step 1-What is changing'!$J:$J,0))&\" - \"&INDEX('Étape 1 – Ce qui change'!$G:$G,MATCH($A6,'[1]Step 1-What is changing'!$J:$J,0)))","v":""},0,{"$f":"100*C6/$C$3","v":{"$error":"#DIV/0!"}},{"$f":"IF(F6=TRUE,\"X\",\"\")","v":""},{"$f":"IF(ISERROR(MATCH($A6,'[1]Step 1-What is changing'!$J:$J,0)),\"\",INDEX('Étape 1 – Ce qui change'!$I:$I,MATCH($A6,'[1]Step 1-What is changing'!$J:$J,0)))","v":""},{"$f":"IF(ISERROR(MATCH($A6,'[1]Step 1-What is changing'!$J:$J,0)),\"\",INDEX('Étape 1 – Ce qui change'!$J:$J,MATCH($A6,'[1]Step 1-What is changing'!$J:$J,0)))","v":""},"","","",{"$f":"IF(ISERROR(MATCH($A6,'[1]Step 1-What is changing'!$J:$J,0)),\"\",INDEX('Étape 1 – Ce qui change'!$N:$N,MATCH($A6,'[1]Step 1-What is changing'!$J:$J,0)))","v":""},{"$f":"IF(ISERROR(MATCH($A6,'[1]Step 1-What is changing'!$J:$J,0)),\"\",INDEX('Étape 1 – Ce qui change'!$O:$O,MATCH($A6,'[1]Step 1-What is changing'!$J:$J,0)))","v":""},{"$f":"IF(ISERROR(MATCH($A6,'[1]Step 1-What is changing'!$J:$J,0)),\"\",INDEX('Étape 1 – Ce qui change'!$P:$P,MATCH($A6,'[1]Step 1-What is changing'!$J:$J,0)))","v":""},{"$f":"IF(ISERROR(MATCH($A6,'[1]Step 1-What is changing'!$J:$J,0)),\"\",INDEX('Étape 1 – Ce qui change'!$Q:$Q,MATCH($A6,'[1]Step 1-What is changing'!$J:$J,0)))","v":""},{"$f":"IF(ISERROR(MATCH($A6,'[1]Step 1-What is changing'!$J:$J,0)),\"\",INDEX('Étape 1 – Ce qui change'!$R:$R,MATCH($A6,'[1]Step 1-What is changing'!$J:$J,0)))","v":""},{"$f":"IF(ISERROR(MATCH($A6,'[1]Step 1-What is changing'!$J:$J,0)),\"\",INDEX('Étape 1 – Ce qui change'!$S:$S,MATCH($A6,'[1]Step 1-What is changing'!$J:$J,0)))","v":""},{"$f":"IF(ISERROR(MATCH($A6,'[1]Step 1-What is changing'!$J:$J,0)),\"\",INDEX('Étape 1 – Ce qui change'!$T:$T,MATCH($A6,'[1]Step 1-What is changing'!$J:$J,0)))","v":""},{"$f":"IF(ISERROR(MATCH($A6,'[1]Step 1-What is changing'!$J:$J,0)),\"\",INDEX('Étape 1 – Ce qui change'!$U:$U,MATCH($A6,'[1]Step 1-What is changing'!$J:$J,0)))","v":""},{"$f":"IF(ISERROR(MATCH($A6,'[1]Step 1-What is changing'!$J:$J,0)),\"\",INDEX('Étape 1 – Ce qui change'!$V:$V,MATCH($A6,'[1]Step 1-What is changing'!$J:$J,0)))","v":""},{"$f":"IF(ISERROR(MATCH($A6,'[1]Step 1-What is changing'!$J:$J,0)),\"\",INDEX('Étape 1 – Ce qui change'!$W:$W,MATCH($A6,'[1]Step 1-What is changing'!$J:$J,0)))","v":""},{"$f":"IF(ISERROR(MATCH($A6,'[1]Step 1-What is changing'!$J:$J,0)),\"\",INDEX('Étape 1 – Ce qui change'!$X:$X,MATCH($A6,'[1]Step 1-What is changing'!$J:$J,0)))","v":""},{"$f":"IF(ISERROR(MATCH($A6,'[1]Step 1-What is changing'!$J:$J,0)),\"\",INDEX('Étape 1 – Ce qui change'!$Y:$Y,MATCH($A6,'[1]Step 1-What is changing'!$J:$J,0)))","v":""},{"$f":"IF(ISERROR(MATCH($A6,'[1]Step 1-What is changing'!$J:$J,0)),\"\",INDEX('Étape 1 – Ce qui change'!$Z:$Z,MATCH($A6,'[1]Step 1-What is changing'!$J:$J,0)))","v":""},{"$f":"IF(ISERROR(MATCH($A6,'[1]Step 1-What is changing'!$J:$J,0)),\"\",INDEX('Étape 1 – Ce qui change'!$AA:$AA,MATCH($A6,'[1]Step 1-What is changing'!$J:$J,0)))","v":""}]
[3,{"$f":"IF(ISERROR(MATCH($A7,'[1]Step 1-What is changing'!$J:$J,0)),\"\",INDEX('Étape 1 – Ce qui change'!$D:$D,MATCH($A7,'[1]Step 1-What is changing'!$J:$J,0))&\" - \"&INDEX('Étape 1 – Ce qui change'!$G:$G,MATCH($A7,'[1]Step 1-What is changing'!$J:$J,0)))","v":""},0,{"$error":"#DIV/0!"},{"$f":"IF(F7=TRUE,\"X\",\"\")","v":""},{"$f":"IF(ISERROR(MATCH($A7,'[1]Step 1-What is changing'!$J:$J,0)),\"\",INDEX('Étape 1 – Ce qui change'!$I:$I,MATCH($A7,'[1]Step 1-What is changing'!$J:$J,0)))","v":""},{"$f":"IF(ISERROR(MATCH($A7,'[1]Step 1-What is changing'!$J:$J,0)),\"\",INDEX('Étape 1 – Ce qui change'!$J:$J,MATCH($A7,'[1]Step 1-What is changing'!$J:$J,0)))","v":""},"","","",{"$f":"IF(ISERROR(MATCH($A7,'[1]Step 1-What is changing'!$J:$J,0)),\"\",INDEX('Étape 1 – Ce qui change'!$N:$N,MATCH($A7,'[1]Step 1-What is changing'!$J:$J,0)))","v":""},{"$f":"IF(ISERROR(MATCH($A7,'[1]Step 1-What is changing'!$J:$J,0)),\"\",INDEX('Étape 1 – Ce qui change'!$O:$O,MATCH($A7,'[1]Step 1-What is changing'!$J:$J,0)))","v":""},{"$f":"IF(ISERROR(MATCH($A7,'[1]Step 1-What is changing'!$J:$J,0)),\"\",INDEX('Étape 1 – Ce qui change'!$P:$P,MATCH($A7,'[1]Step 1-What is changing'!$J:$J,0)))","v":""},{"$f":"IF(ISERROR(MATCH($A7,'[1]Step 1-What is changing'!$J:$J,0)),\"\",INDEX('Étape 1 – Ce qui change'!$Q:$Q,MATCH($A7,'[1]Step 1-What is changing'!$J:$J,0)))","v":""},{"$f":"IF(ISERROR(MATCH($A7,'[1]Step 1-What is changing'!$J:$J,0)),\"\",INDEX('Étape 1 – Ce qui change'!$R:$R,MATCH($A7,'[1]Step 1-What is changing'!$J:$J,0)))","v":""},{"$f":"IF(ISERROR(MATCH($A7,'[1]Step 1-What is changing'!$J:$J,0)),\"\",INDEX('Étape 1 – Ce qui change'!$S:$S,MATCH($A7,'[1]Step 1-What is changing'!$J:$J,0)))","v":""},{"$f":"IF(ISERROR(MATCH($A7,'[1]Step 1-What is changing'!$J:$J,0)),\"\",INDEX('Étape 1 – Ce qui change'!$T:$T,MATCH($A7,'[1]Step 1-What is changing'!$J:$J,0)))","v":""},{"$f":"IF(ISERROR(MATCH($A7,'[1]Step 1-What is changing'!$J:$J,0)),\"\",INDEX('Étape 1 – Ce qui change'!$U:$U,MATCH($A7,'[1]Step 1-What is changing'!$J:$J,0)))","v":""},{"$f":"IF(ISERROR(MATCH($A7,'[1]Step 1-What is changing'!$J:$J,0)),\"\",INDEX('Étape 1 – Ce qui change'!$V:$V,MATCH($A7,'[1]Step 1-What is changing'!$J:$J,0)))","v":""},{"$f":"IF(ISERROR(MATCH($A7,'[1]Step 1-What is changing'!$J:$J,0)),\"\",INDEX('Étape 1 – Ce qui change'!$W:$W,MATCH($A7,'[1]Step 1-What is changing'!$J:$J,0)))","v":""},{"$f":"IF(ISERROR(MATCH($A7,'[1]Step 1-What is changing'!$J:$J,0)),\"\",INDEX('Étape 1 – Ce qui change'!$X:$X,MATCH($A7,'[1]Step 1-What is changing'!$J:$J,0)))","v":""},{"$f":"IF(ISERROR(MATCH($A7,'[1]Step 1-What is changing'!$J:$J,0)),\"\",INDEX('Étape 1 – Ce qui change'!$Y:$Y,MATCH($A7,'[1]Step 1-What is changing'!$J:$J,0)))","v":""},{"$f":"IF(ISERROR(MATCH($A7,'[1]Step 1-What is changing'!$J:$J,0)),\"\",INDEX('Étape 1 – Ce qui change'!$Z:$Z,MATCH($A7,'[1]Step 1-What is changing'!$J:$J,0)))","v":""},{"$f":"IF(ISERROR(MATCH($A7,'[1]Step 1-What is changing'!$J:$J,0)),\"\",INDEX('Étape 1 – Ce qui change'!$AA:$AA,MATCH($A7,'[1]Step 1-What is changing'!$J:$J,0)))","v":""}]
[4,{"$f":"IF(ISERROR(MATCH($A8,'[1]Step 1-What is changing'!$J:$J,0)),\"\",INDEX('Étape 1 – Ce qui change'!$D:$D,MATCH($A8,'[1]Step 1-What is changing'!$J:$J,0))&\" - \"&INDEX('Étape 1 – Ce qui change'!$G:$G,MATCH($A8,'[1]Step 1-What is changing'!$J:$J,0)))","v":""},0,{"$error":"#DIV/0!"},{"$f":"IF(F8=TRUE,\"X\",\"\")","v":""},{"$f":"IF(ISERROR(MATCH($A8,'[1]Step 1-What is changing'!$J:$J,0)),\"\",INDEX('Étape 1 – Ce qui change'!$I:$I,MATCH($A8,'[1]Step 1-What is changing'!$J:$J,0)))","v":""},{"$f":"IF(ISERROR(MATCH($A8,'[1]Step 1-What is changing'!$J:$J,0)),\"\",INDEX('Étape 1 – Ce qui change'!$J:$J,MATCH($A8,'[1]Step 1-What is changing'!$J:$J,0)))","v":""},"","","",{"$f":"IF(ISERROR(MATCH($A8,'[1]Step 1-What is changing'!$J:$J,0)),\"\",INDEX('Étape 1 – Ce qui change'!$N:$N,MATCH($A8,'[1]Step 1-What is changing'!$J:$J,0)))","v":""},{"$f":"IF(ISERROR(MATCH($A8,'[1]Step 1-What is changing'!$J:$J,0)),\"\",INDEX('Étape 1 – Ce qui change'!$O:$O,MATCH($A8,'[1]Step 1-What is changing'!$J:$J,0)))","v":""},{"$f":"IF(ISERROR(MATCH($A8,'[1]Step 1-What is changing'!$J:$J,0)),\"\",INDEX('Étape 1 – Ce qui change'!$P:$P,MATCH($A8,'[1]Step 1-What is changing'!$J:$J,0)))","v":""},{"$f":"IF(ISERROR(MATCH($A8,'[1]Step 1-What is changing'!$J:$J,0)),\"\",INDEX('Étape 1 – Ce qui change'!$Q:$Q,MATCH($A8,'[1]Step 1-What is changing'!$J:$J,0)))","v":""},{"$f":"IF(ISERROR(MATCH($A8,'[1]Step 1-What is changing'!$J:$J,0)),\"\",INDEX('Étape 1 – Ce qui change'!$R:$R,MATCH($A8,'[1]Step 1-What is changing'!$J:$J,0)))","v":""},{"$f":"IF(ISERROR(MATCH($A8,'[1]Step 1-What is changing'!$J:$J,0)),\"\",INDEX('Étape 1 – Ce qui change'!$S:$S,MATCH($A8,'[1]Step 1-What is changing'!$J:$J,0)))","v":""},{"$f":"IF(ISERROR(MATCH($A8,'[1]Step 1-What is changing'!$J:$J,0)),\"\",INDEX('Étape 1 – Ce qui change'!$T:$T,MATCH($A8,'[1]Step 1-What is changing'!$J:$J,0)))","v":""},{"$f":"IF(ISERROR(MATCH($A8,'[1]Step 1-What is changing'!$J:$J,0)),\"\",INDEX('Étape 1 – Ce qui change'!$U:$U,MATCH($A8,'[1]Step 1-What is changing'!$J:$J,0)))","v":""},{"$f":"IF(ISERROR(MATCH($A8,'[1]Step 1-What is changing'!$J:$J,0)),\"\",INDEX('Étape 1 – Ce qui change'!$V:$V,MATCH($A8,'[1]Step 1-What is changing'!$J:$J,0)))","v":""},{"$f":"IF(ISERROR(MATCH($A8,'[1]Step 1-What is changing'!$J:$J,0)),\"\",INDEX('Étape 1 – Ce qui change'!$W:$W,MATCH($A8,'[1]Step 1-What is changing'!$J:$J,0)))","v":""},{"$f":"IF(ISERROR(MATCH($A8,'[1]Step 1-What is changing'!$J:$J,0)),\"\",INDEX('Étape 1 – Ce qui change'!$X:$X,MATCH($A8,'[1]Step 1-What is changing'!$J:$J,0)))","v":""},{"$f":"IF(ISERROR(MATCH($A8,'[1]Step 1-What is changing'!$J:$J,0)),\"\",INDEX('Étape 1 – Ce qui change'!$Y:$Y,MATCH($A8,'[1]Step 1-What is changing'!$J:$J,0)))","v":""},{"$f":"IF(ISERROR(MATCH($A8,'[1]Step 1-What is changing'!$J:$J,0)),\"\",INDEX('Étape 1 – Ce qui change'!$Z:$Z,MATCH($A8,'[1]Step 1-What is changing'!$J:$J,0)))","v":""},{"$f":"IF(ISERROR(MATCH($A8,'[1]Step 1-What is changing'!$J:$J,0)),\"\",INDEX('Étape 1 – Ce qui change'!$AA:$AA,MATCH($A8,'[1]Step 1-What is changing'!$J:$J,0)))","v":""}]
[5,{"$f":"IF(ISERROR(MATCH($A9,'[1]Step 1-What is changing'!$J:$J,0)),\"\",INDEX('Étape 1 – Ce qui change'!$D:$D,MATCH($A9,'[1]Step 1-What is changing'!$J:$J,0))&\" - \"&INDEX('Étape 1 – Ce qui change'!$G:$G,MATCH($A9,'[1]Step 1-What is changing'!$J:$J,0)))","v":""},0,{"$error":"#DIV/0!"},{"$f":"IF(F9=TRUE,\"X\",\"\")","v":""},{"$f":"IF(ISERROR(MATCH($A9,'[1]Step 1-What is changing'!$J:$J,0)),\"\",INDEX('Étape 1 – Ce qui change'!$I:$I,MATCH($A9,'[1]Step 1-What is changing'!$J:$J,0)))","v":""},{"$f":"IF(ISERROR(MATCH($A9,'[1]Step 1-What is changing'!$J:$J,0)),\"\",INDEX('Étape 1 – Ce qui change'!$J:$J,MATCH($A9,'[1]Step 1-What is changing'!$J:$J,0)))","v":""},"","","",{"$f":"IF(ISERROR(MATCH($A9,'[1]Step 1-What is changing'!$J:$J,0)),\"\",INDEX('Étape 1 – Ce qui change'!$N:$N,MATCH($A9,'[1]Step 1-What is changing'!$J:$J,0)))","v":""},{"$f":"IF(ISERROR(MATCH($A9,'[1]Step 1-What is changing'!$J:$J,0)),\"\",INDEX('Étape 1 – Ce qui change'!$O:$O,MATCH($A9,'[1]Step 1-What is changing'!$J:$J,0)))","v":""},{"$f":"IF(ISERROR(MATCH($A9,'[1]Step 1-What is changing'!$J:$J,0)),\"\",INDEX('Étape 1 – Ce qui change'!$P:$P,MATCH($A9,'[1]Step 1-What is changing'!$J:$J,0)))","v":""},{"$f":"IF(ISERROR(MATCH($A9,'[1]Step 1-What is changing'!$J:$J,0)),\"\",INDEX('Étape 1 – Ce qui change'!$Q:$Q,MATCH($A9,'[1]Step 1-What is changing'!$J:$J,0)))","v":""},{"$f":"IF(ISERROR(MATCH($A9,'[1]Step 1-What is changing'!$J:$J,0)),\"\",INDEX('Étape 1 – Ce qui change'!$R:$R,MATCH($A9,'[1]Step 1-What is changing'!$J:$J,0)))","v":""},{"$f":"IF(ISERROR(MATCH($A9,'[1]Step 1-What is changing'!$J:$J,0)),\"\",INDEX('Étape 1 – Ce qui change'!$S:$S,MATCH($A9,'[1]Step 1-What is changing'!$J:$J,0)))","v":""},{"$f":"IF(ISERROR(MATCH($A9,'[1]Step 1-What is changing'!$J:$J,0)),\"\",INDEX('Étape 1 – Ce qui change'!$T:$T,MATCH($A9,'[1]Step 1-What is changing'!$J:$J,0)))","v":""},{"$f":"IF(ISERROR(MATCH($A9,'[1]Step 1-What is changing'!$J:$J,0)),\"\",INDEX('Étape 1 – Ce qui change'!$U:$U,MATCH($A9,'[1]Step 1-What is changing'!$J:$J,0)))","v":""},{"$f":"IF(ISERROR(MATCH($A9,'[1]Step 1-What is changing'!$J:$J,0)),\"\",INDEX('Étape 1 – Ce qui change'!$V:$V,MATCH($A9,'[1]Step 1-What is changing'!$J:$J,0)))","v":""},{"$f":"IF(ISERROR(MATCH($A9,'[1]Step 1-What is changing'!$J:$J,0)),\"\",INDEX('Étape 1 – Ce qui change'!$W:$W,MATCH($A9,'[1]Step 1-What is changing'!$J:$J,0)))","v":""},{"$f":"IF(ISERROR(MATCH($A9,'[1]Step 1-What is changing'!$J:$J,0)),\"\",INDEX('Étape 1 – Ce qui change'!$X:$X,MATCH($A9,'[1]Step 1-What is changing'!$J:$J,0)))","v":""},{"$f":"IF(ISERROR(MATCH($A9,'[1]Step 1-What is changing'!$J:$J,0)),\"\",INDEX('Étape 1 – Ce qui change'!$Y:$Y,MATCH($A9,'[1]Step 1-What is changing'!$J:$J,0)))","v":""},{"$f":"IF(ISERROR(MATCH($A9,'[1]Step 1-What is changing'!$J:$J,0)),\"\",INDEX('Étape 1 – Ce qui change'!$Z:$Z,MATCH($A9,'[1]Step 1-What is changing'!$J:$J,0)))","v":""},{"$f":"IF(ISERROR(MATCH($A9,'[1]Step 1-What is changing'!$J:$J,0)),\"\",INDEX('Étape 1 – Ce qui change'!$AA:$AA,MATCH($A9,'[1]Step 1-What is changing'!$J:$J,0)))","v":""}]
[6,{"$f":"IF(ISERROR(MATCH($A10,'[1]Step 1-What is changing'!$J:$J,0)),\"\",INDEX('Étape 1 – Ce qui change'!$D:$D,MATCH($A10,'[1]Step 1-What is changing'!$J:$J,0))&\" - \"&INDEX('Étape 1 – Ce qui change'!$G:$G,MATCH($A10,'[1]Step 1-What is changing'!$J:$J,0)))","v":""},0,{"$error":"#DIV/0!"},{"$f":"IF(F10=TRUE,\"X\",\"\")","v":""},{"$f":"IF(ISERROR(MATCH($A10,'[1]Step 1-What is changing'!$J:$J,0)),\"\",INDEX('Étape 1 – Ce qui change'!$I:$I,MATCH($A10,'[1]Step 1-What is changing'!$J:$J,0)))","v":""},{"$f":"IF(ISERROR(MATCH($A10,'[1]Step 1-What is changing'!$J:$J,0)),\"\",INDEX('Étape 1 – Ce qui change'!$J:$J,MATCH($A10,'[1]Step 1-What is changing'!$J:$J,0)))","v":""},{"$f":"IF(K10=TRUE,\"X\",\"\")","v":""},{"$f":"IF(L10=TRUE,\"X\",\"\")","v":""},{"$f":"IF(M10=TRUE,\"X\",\"\")","v":""},{"$f":"IF(ISERROR(MATCH($A10,'[1]Step 1-What is changing'!$J:$J,0)),\"\",INDEX('Étape 1 – Ce qui change'!$N:$N,MATCH($A10,'[1]Step 1-What is changing'!$J:$J,0)))","v":""},{"$f":"IF(ISERROR(MATCH($A10,'[1]Step 1-What is changing'!$J:$J,0)),\"\",INDEX('Étape 1 – Ce qui change'!$O:$O,MATCH($A10,'[1]Step 1-What is changing'!$J:$J,0)))","v":""},{"$f":"IF(ISERROR(MATCH($A10,'[1]Step 1-What is changing'!$J:$J,0)),\"\",INDEX('Étape 1 – Ce qui change'!$P:$P,MATCH($A10,'[1]Step 1-What is changing'!$J:$J,0)))","v":""},{"$f":"IF(ISERROR(MATCH($A10,'[1]Step 1-What is changing'!$J:$J,0)),\"\",INDEX('Étape 1 – Ce qui change'!$Q:$Q,MATCH($A10,'[1]Step 1-What is changing'!$J:$J,0)))","v":""},{"$f":"IF(ISERROR(MATCH($A10,'[1]Step 1-What is changing'!$J:$J,0)),\"\",INDEX('Étape 1 – Ce qui change'!$R:$R,MATCH($A10,'[1]Step 1-What is changing'!$J:$J,0)))","v":""},{"$f":"IF(ISERROR(MATCH($A10,'[1]Step 1-What is changing'!$J:$J,0)),\"\",INDEX('Étape 1 – Ce qui change'!$S:$S,MATCH($A10,'[1]Step 1-What is changing'!$J:$J,0)))","v":""},{"$f":"IF(ISERROR(MATCH($A10,'[1]Step 1-What is changing'!$J:$J,0)),\"\",INDEX('Étape 1 – Ce qui change'!$T:$T,MATCH($A10,'[1]Step 1-What is changing'!$J:$J,0)))","v":""},{"$f":"IF(ISERROR(MATCH($A10,'[1]Step 1-What is changing'!$J:$J,0)),\"\",INDEX('Étape 1 – Ce qui change'!$U:$U,MATCH($A10,'[1]Step 1-What is changing'!$J:$J,0)))","v":""},{"$f":"IF(ISERROR(MATCH($A10,'[1]Step 1-What is changing'!$J:$J,0)),\"\",INDEX('Étape 1 – Ce qui change'!$V:$V,MATCH($A10,'[1]Step 1-What is changing'!$J:$J,0)))","v":""},{"$f":"IF(ISERROR(MATCH($A10,'[1]Step 1-What is changing'!$J:$J,0)),\"\",INDEX('Étape 1 – Ce qui change'!$W:$W,MATCH($A10,'[1]Step 1-What is changing'!$J:$J,0)))","v":""},{"$f":"IF(ISERROR(MATCH($A10,'[1]Step 1-What is changing'!$J:$J,0)),\"\",INDEX('Étape 1 – Ce qui change'!$X:$X,MATCH($A10,'[1]Step 1-What is changing'!$J:$J,0)))","v":""},{"$f":"IF(ISERROR(MATCH($A10,'[1]Step 1-What is changing'!$J:$J,0)),\"\",INDEX('Étape 1 – Ce qui change'!$Y:$Y,MATCH($A10,'[1]Step 1-What is changing'!$J:$J,0)))","v":""},{"$f":"IF(ISERROR(MATCH($A10,'[1]Step 1-What is changing'!$J:$J,0)),\"\",INDEX('Étape 1 – Ce qui change'!$Z:$Z,MATCH($A10,'[1]Step 1-What is changing'!$J:$J,0)))","v":""},{"$f":"IF(ISERROR(MATCH($A10,'[1]Step 1-What is changing'!$J:$J,0)),\"\",INDEX('Étape 1 – Ce qui change'!$AA:$AA,MATCH($A10,'[1]Step 1-What is changing'!$J:$J,0)))","v":""}]
[7,{"$f":"IF(ISERROR(MATCH($A11,'[1]Step 1-What is changing'!$J:$J,0)),\"\",INDEX('Étape 1 – Ce qui change'!$D:$D,MATCH($A11,'[1]Step 1-What is changing'!$J:$J,0))&\" - \"&INDEX('Étape 1 – Ce qui change'!$G:$G,MATCH($A11,'[1]Step 1-What is changing'!$J:$J,0)))","v":""},0,{"$error":"#DIV/0!"},"",{"$f":"IF(ISERROR(MATCH($A11,'[1]Step 1-What is changing'!$J:$J,0)),\"\",INDEX('Étape 1 – Ce qui change'!$I:$I,MATCH($A11,'[1]Step 1-What is changing'!$J:$J,0)))","v":""},{"$f":"IF(ISERROR(MATCH($A11,'[1]Step 1-What is changing'!$J:$J,0)),\"\",INDEX('Étape 1 – Ce qui change'!$J:$J,MATCH($A11,'[1]Step 1-What is changing'!$J:$J,0)))","v":""},"","","",{"$f":"IF(ISERROR(MATCH($A11,'[1]Step 1-What is changing'!$J:$J,0)),\"\",INDEX('Étape 1 – Ce qui change'!$N:$N,MATCH($A11,'[1]Step 1-What is changing'!$J:$J,0)))","v":""},{"$f":"IF(ISERROR(MATCH($A11,'[1]Step 1-What is changing'!$J:$J,0)),\"\",INDEX('Étape 1 – Ce qui change'!$O:$O,MATCH($A11,'[1]Step 1-What is changing'!$J:$J,0)))","v":""},{"$f":"IF(ISERROR(MATCH($A11,'[1]Step 1-What is changing'!$J:$J,0)),\"\",INDEX('Étape 1 – Ce qui change'!$P:$P,MATCH($A11,'[1]Step 1-What is changing'!$J:$J,0)))","v":""},{"$f":"IF(ISERROR(MATCH($A11,'[1]Step 1-What is changing'!$J:$J,0)),\"\",INDEX('Étape 1 – Ce qui change'!$Q:$Q,MATCH($A11,'[1]Step 1-What is changing'!$J:$J,0)))","v":""},{"$f":"IF(ISERROR(MATCH($A11,'[1]Step 1-What is changing'!$J:$J,0)),\"\",INDEX('Étape 1 – Ce qui change'!$R:$R,MATCH($A11,'[1]Step 1-What is changing'!$J:$J,0)))","v":""},{"$f":"IF(ISERROR(MATCH($A11,'[1]Step 1-What is changing'!$J:$J,0)),\"\",INDEX('Étape 1 – Ce qui change'!$S:$S,MATCH($A11,'[1]Step 1-What is changing'!$J:$J,0)))","v":""},{"$f":"IF(ISERROR(MATCH($A11,'[1]Step 1-What is changing'!$J:$J,0)),\"\",INDEX('Étape 1 – Ce qui change'!$T:$T,MATCH($A11,'[1]Step 1-What is changing'!$J:$J,0)))","v":""},{"$f":"IF(ISERROR(MATCH($A11,'[1]Step 1-What is changing'!$J:$J,0)),\"\",INDEX('Étape 1 – Ce qui change'!$U:$U,MATCH($A11,'[1]Step 1-What is changing'!$J:$J,0)))","v":""},{"$f":"IF(ISERROR(MATCH($A11,'[1]Step 1-What is changing'!$J:$J,0)),\"\",INDEX('Étape 1 – Ce qui change'!$V:$V,MATCH($A11,'[1]Step 1-What is changing'!$J:$J,0)))","v":""},{"$f":"IF(ISERROR(MATCH($A11,'[1]Step 1-What is changing'!$J:$J,0)),\"\",INDEX('Étape 1 – Ce qui change'!$W:$W,MATCH($A11,'[1]Step 1-What is changing'!$J:$J,0)))","v":""},{"$f":"IF(ISERROR(MATCH($A11,'[1]Step 1-What is changing'!$J:$J,0)),\"\",INDEX('Étape 1 – Ce qui change'!$X:$X,MATCH($A11,'[1]Step 1-What is changing'!$J:$J,0)))","v":""},{"$f":"IF(ISERROR(MATCH($A11,'[1]Step 1-What is changing'!$J:$J,0)),\"\",INDEX('Étape 1 – Ce qui change'!$Y:$Y,MATCH($A11,'[1]Step 1-What is changing'!$J:$J,0)))","v":""},{"$f":"IF(ISERROR(MATCH($A11,'[1]Step 1-What is changing'!$J:$J,0)),\"\",INDEX('Étape 1 – Ce qui change'!$Z:$Z,MATCH($A11,'[1]Step 1-What is changing'!$J:$J,0)))","v":""},{"$f":"IF(ISERROR(MATCH($A11,'[1]Step 1-What is changing'!$J:$J,0)),\"\",INDEX('Étape 1 – Ce qui change'!$AA:$AA,MATCH($A11,'[1]Step 1-What is changing'!$J:$J,0)))","v":""}]
[8,{"$f":"IF(ISERROR(MATCH($A12,'[1]Step 1-What is changing'!$J:$J,0)),\"\",INDEX('Étape 1 – Ce qui change'!$D:$D,MATCH($A12,'[1]Step 1-What is changing'!$J:$J,0))&\" - \"&INDEX('Étape 1 – Ce qui change'!$G:$G,MATCH($A12,'[1]Step 1-What is changing'!$J:$J,0)))","v":""},0,{"$error":"#DIV/0!"},"",{"$f":"IF(ISERROR(MATCH($A12,'[1]Step 1-What is changing'!$J:$J,0)),\"\",INDEX('Étape 1 – Ce qui change'!$I:$I,MATCH($A12,'[1]Step 1-What is changing'!$J:$J,0)))","v":""},{"$f":"IF(ISERROR(MATCH($A12,'[1]Step 1-What is changing'!$J:$J,0)),\"\",INDEX('Étape 1 – Ce qui change'!$J:$J,MATCH($A12,'[1]Step 1-What is changing'!$J:$J,0)))","v":""},"","","",{"$f":"IF(ISERROR(MATCH($A12,'[1]Step 1-What is changing'!$J:$J,0)),\"\",INDEX('Étape 1 – Ce qui change'!$N:$N,MATCH($A12,'[1]Step 1-What is changing'!$J:$J,0)))","v":""},{"$f":"IF(ISERROR(MATCH($A12,'[1]Step 1-What is changing'!$J:$J,0)),\"\",INDEX('Étape 1 – Ce qui change'!$O:$O,MATCH($A12,'[1]Step 1-What is changing'!$J:$J,0)))","v":""},{"$f":"IF(ISERROR(MATCH($A12,'[1]Step 1-What is changing'!$J:$J,0)),\"\",INDEX('Étape 1 – Ce qui change'!$P:$P,MATCH($A12,'[1]Step 1-What is changing'!$J:$J,0)))","v":""},{"$f":"IF(ISERROR(MATCH($A12,'[1]Step 1-What is changing'!$J:$J,0)),\"\",INDEX('Étape 1 – Ce qui change'!$Q:$Q,MATCH($A12,'[1]Step 1-What is changing'!$J:$J,0)))","v":""},{"$f":"IF(ISERROR(MATCH($A12,'[1]Step 1-What is changing'!$J:$J,0)),\"\",INDEX('Étape 1 – Ce qui change'!$R:$R,MATCH($A12,'[1]Step 1-What is changing'!$J:$J,0)))","v":""},{"$f":"IF(ISERROR(MATCH($A12,'[1]Step 1-What is changing'!$J:$J,0)),\"\",INDEX('Étape 1 – Ce qui change'!$S:$S,MATCH($A12,'[1]Step 1-What is changing'!$J:$J,0)))","v":""},{"$f":"IF(ISERROR(MATCH($A12,'[1]Step 1-What is changing'!$J:$J,0)),\"\",INDEX('Étape 1 – Ce qui change'!$T:$T,MATCH($A12,'[1]Step 1-What is changing'!$J:$J,0)))","v":""},{"$f":"IF(ISERROR(MATCH($A12,'[1]Step 1-What is changing'!$J:$J,0)),\"\",INDEX('Étape 1 – Ce qui change'!$U:$U,MATCH($A12,'[1]Step 1-What is changing'!$J:$J,0)))","v":""},{"$f":"IF(ISERROR(MATCH($A12,'[1]Step 1-What is changing'!$J:$J,0)),\"\",INDEX('Étape 1 – Ce qui change'!$V:$V,MATCH($A12,'[1]Step 1-What is changing'!$J:$J,0)))","v":""},{"$f":"IF(ISERROR(MATCH($A12,'[1]Step 1-What is changing'!$J:$J,0)),\"\",INDEX('Étape 1 – Ce qui change'!$W:$W,MATCH($A12,'[1]Step 1-What is changing'!$J:$J,0)))","v":""},{"$f":"IF(ISERROR(MATCH($A12,'[1]Step 1-What is changing'!$J:$J,0)),\"\",INDEX('Étape 1 – Ce qui change'!$X:$X,MATCH($A12,'[1]Step 1-What is changing'!$J:$J,0)))","v":""},{"$f":"IF(ISERROR(MATCH($A12,'[1]Step 1-What is changing'!$J:$J,0)),\"\",INDEX('Étape 1 – Ce qui change'!$Y:$Y,MATCH($A12,'[1]Step 1-What is changing'!$J:$J,0)))","v":""},{"$f":"IF(ISERROR(MATCH($A12,'[1]Step 1-What is changing'!$J:$J,0)),\"\",INDEX('Étape 1 – Ce qui change'!$Z:$Z,MATCH($A12,'[1]Step 1-What is changing'!$J:$J,0)))","v":""},{"$f":"IF(ISERROR(MATCH($A12,'[1]Step 1-What is changing'!$J:$J,0)),\"\",INDEX('Étape 1 – Ce qui change'!$AA:$AA,MATCH($A12,'[1]Step 1-What is changing'!$J:$J,0)))","v":""}]
[9,{"$f":"IF(ISERROR(MATCH($A13,'[1]Step 1-What is changing'!$J:$J,0)),\"\",INDEX('Étape 1 – Ce qui change'!$D:$D,MATCH($A13,'[1]Step 1-What is changing'!$J:$J,0))&\" - \"&INDEX('Étape 1 – Ce qui change'!$G:$G,MATCH($A13,'[1]Step 1-What is changing'!$J:$J,0)))","v":""},0,{"$error":"#DIV/0!"},"",{"$f":"IF(ISERROR(MATCH($A13,'[1]Step 1-What is changing'!$J:$J,0)),\"\",INDEX('Étape 1 – Ce qui change'!$I:$I,MATCH($A13,'[1]Step 1-What is changing'!$J:$J,0)))","v":""},{"$f":"IF(ISERROR(MATCH($A13,'[1]Step 1-What is changing'!$J:$J,0)),\"\",INDEX('Étape 1 – Ce qui change'!$J:$J,MATCH($A13,'[1]Step 1-What is changing'!$J:$J,0)))","v":""},"","","",{"$f":"IF(ISERROR(MATCH($A13,'[1]Step 1-What is changing'!$J:$J,0)),\"\",INDEX('Étape 1 – Ce qui change'!$N:$N,MATCH($A13,'[1]Step 1-What is changing'!$J:$J,0)))","v":""},{"$f":"IF(ISERROR(MATCH($A13,'[1]Step 1-What is changing'!$J:$J,0)),\"\",INDEX('Étape 1 – Ce qui change'!$O:$O,MATCH($A13,'[1]Step 1-What is changing'!$J:$J,0)))","v":""},{"$f":"IF(ISERROR(MATCH($A13,'[1]Step 1-What is changing'!$J:$J,0)),\"\",INDEX('Étape 1 – Ce qui change'!$P:$P,MATCH($A13,'[1]Step 1-What is changing'!$J:$J,0)))","v":""},{"$f":"IF(ISERROR(MATCH($A13,'[1]Step 1-What is changing'!$J:$J,0)),\"\",INDEX('Étape 1 – Ce qui change'!$Q:$Q,MATCH($A13,'[1]Step 1-What is changing'!$J:$J,0)))","v":""},{"$f":"IF(ISERROR(MATCH($A13,'[1]Step 1-What is changing'!$J:$J,0)),\"\",INDEX('Étape 1 – Ce qui change'!$R:$R,MATCH($A13,'[1]Step 1-What is changing'!$J:$J,0)))","v":""},{"$f":"IF(ISERROR(MATCH($A13,'[1]Step 1-What is changing'!$J:$J,0)),\"\",INDEX('Étape 1 – Ce qui change'!$S:$S,MATCH($A13,'[1]Step 1-What is changing'!$J:$J,0)))","v":""},{"$f":"IF(ISERROR(MATCH($A13,'[1]Step 1-What is changing'!$J:$J,0)),\"\",INDEX('Étape 1 – Ce qui change'!$T:$T,MATCH($A13,'[1]Step 1-What is changing'!$J:$J,0)))","v":""},{"$f":"IF(ISERROR(MATCH($A13,'[1]Step 1-What is changing'!$J:$J,0)),\"\",INDEX('Étape 1 – Ce qui change'!$U:$U,MATCH($A13,'[1]Step 1-What is changing'!$J:$J,0)))","v":""},{"$f":"IF(ISERROR(MATCH($A13,'[1]Step 1-What is changing'!$J:$J,0)),\"\",INDEX('Étape 1 – Ce qui change'!$V:$V,MATCH($A13,'[1]Step 1-What is changing'!$J:$J,0)))","v":""},{"$f":"IF(ISERROR(MATCH($A13,'[1]Step 1-What is changing'!$J:$J,0)),\"\",INDEX('Étape 1 – Ce qui change'!$W:$W,MATCH($A13,'[1]Step 1-What is changing'!$J:$J,0)))","v":""},{"$f":"IF(ISERROR(MATCH($A13,'[1]Step 1-What is changing'!$J:$J,0)),\"\",INDEX('Étape 1 – Ce qui change'!$X:$X,MATCH($A13,'[1]Step 1-What is changing'!$J:$J,0)))","v":""},{"$f":"IF(ISERROR(MATCH($A13,'[1]Step 1-What is changing'!$J:$J,0)),\"\",INDEX('Étape 1 – Ce qui change'!$Y:$Y,MATCH($A13,'[1]Step 1-What is changing'!$J:$J,0)))","v":""},{"$f":"IF(ISERROR(MATCH($A13,'[1]Step 1-What is changing'!$J:$J,0)),\"\",INDEX('Étape 1 – Ce qui change'!$Z:$Z,MATCH($A13,'[1]Step 1-What is changing'!$J:$J,0)))","v":""},{"$f":"IF(ISERROR(MATCH($A13,'[1]Step 1-What is changing'!$J:$J,0)),\"\",INDEX('Étape 1 – Ce qui change'!$AA:$AA,MATCH($A13,'[1]Step 1-What is changing'!$J:$J,0)))","v":""}]
[10,{"$f":"IF(ISERROR(MATCH($A14,'[1]Step 1-What is changing'!$J:$J,0)),\"\",INDEX('Étape 1 – Ce qui change'!$D:$D,MATCH($A14,'[1]Step 1-What is changing'!$J:$J,0))&\" - \"&INDEX('Étape 1 – Ce qui change'!$G:$G,MATCH($A14,'[1]Step 1-What is changing'!$J:$J,0)))","v":""},0,{"$error":"#DIV/0!"},"",{"$f":"IF(ISERROR(MATCH($A14,'[1]Step 1-What is changing'!$J:$J,0)),\"\",INDEX('Étape 1 – Ce qui change'!$I:$I,MATCH($A14,'[1]Step 1-What is changing'!$J:$J,0)))","v":""},{"$f":"IF(ISERROR(MATCH($A14,'[1]Step 1-What is changing'!$J:$J,0)),\"\",INDEX('Étape 1 – Ce qui change'!$J:$J,MATCH($A14,'[1]Step 1-What is changing'!$J:$J,0)))","v":""},"","","",{"$f":"IF(ISERROR(MATCH($A14,'[1]Step 1-What is changing'!$J:$J,0)),\"\",INDEX('Étape 1 – Ce qui change'!$N:$N,MATCH($A14,'[1]Step 1-What is changing'!$J:$J,0)))","v":""},{"$f":"IF(ISERROR(MATCH($A14,'[1]Step 1-What is changing'!$J:$J,0)),\"\",INDEX('Étape 1 – Ce qui change'!$O:$O,MATCH($A14,'[1]Step 1-What is changing'!$J:$J,0)))","v":""},{"$f":"IF(ISERROR(MATCH($A14,'[1]Step 1-What is changing'!$J:$J,0)),\"\",INDEX('Étape 1 – Ce qui change'!$P:$P,MATCH($A14,'[1]Step 1-What is changing'!$J:$J,0)))","v":""},{"$f":"IF(ISERROR(MATCH($A14,'[1]Step 1-What is changing'!$J:$J,0)),\"\",INDEX('Étape 1 – Ce qui change'!$Q:$Q,MATCH($A14,'[1]Step 1-What is changing'!$J:$J,0)))","v":""},{"$f":"IF(ISERROR(MATCH($A14,'[1]Step 1-What is changing'!$J:$J,0)),\"\",INDEX('Étape 1 – Ce qui change'!$R:$R,MATCH($A14,'[1]Step 1-What is changing'!$J:$J,0)))","v":""},{"$f":"IF(ISERROR(MATCH($A14,'[1]Step 1-What is changing'!$J:$J,0)),\"\",INDEX('Étape 1 – Ce qui change'!$S:$S,MATCH($A14,'[1]Step 1-What is changing'!$J:$J,0)))","v":""},{"$f":"IF(ISERROR(MATCH($A14,'[1]Step 1-What is changing'!$J:$J,0)),\"\",INDEX('Étape 1 – Ce qui change'!$T:$T,MATCH($A14,'[1]Step 1-What is changing'!$J:$J,0)))","v":""},{"$f":"IF(ISERROR(MATCH($A14,'[1]Step 1-What is changing'!$J:$J,0)),\"\",INDEX('Étape 1 – Ce qui change'!$U:$U,MATCH($A14,'[1]Step 1-What is changing'!$J:$J,0)))","v":""},{"$f":"IF(ISERROR(MATCH($A14,'[1]Step 1-What is changing'!$J:$J,0)),\"\",INDEX('Étape 1 – Ce qui change'!$V:$V,MATCH($A14,'[1]Step 1-What is changing'!$J:$J,0)))","v":""},{"$f":"IF(ISERROR(MATCH($A14,'[1]Step 1-What is changing'!$J:$J,0)),\"\",INDEX('Étape 1 – Ce qui change'!$W:$W,MATCH($A14,'[1]Step 1-What is changing'!$J:$J,0)))","v":""},{"$f":"IF(ISERROR(MATCH($A14,'[1]Step 1-What is changing'!$J:$J,0)),\"\",INDEX('Étape 1 – Ce qui change'!$X:$X,MATCH($A14,'[1]Step 1-What is changing'!$J:$J,0)))","v":""},{"$f":"IF(ISERROR(MATCH($A14,'[1]Step 1-What is changing'!$J:$J,0)),\"\",INDEX('Étape 1 – Ce qui change'!$Y:$Y,MATCH($A14,'[1]Step 1-What is changing'!$J:$J,0)))","v":""},{"$f":"IF(ISERROR(MATCH($A14,'[1]Step 1-What is changing'!$J:$J,0)),\"\",INDEX('Étape 1 – Ce qui change'!$Z:$Z,MATCH($A14,'[1]Step 1-What is changing'!$J:$J,0)))","v":""},{"$f":"IF(ISERROR(MATCH($A14,'[1]Step 1-What is changing'!$J:$J,0)),\"\",INDEX('Étape 1 – Ce qui change'!$AA:$AA,MATCH($A14,'[1]Step 1-What is changing'!$J:$J,0)))","v":""}]
[11,{"$f":"IF(ISERROR(MATCH($A15,'[1]Step 1-What is changing'!$J:$J,0)),\"\",INDEX('Étape 1 – Ce qui change'!$D:$D,MATCH($A15,'[1]Step 1-What is changing'!$J:$J,0))&\" - \"&INDEX('Étape 1 – Ce qui change'!$G:$G,MATCH($A15,'[1]Step 1-What is changing'!$J:$J,0)))","v":""},0,{"$error":"#DIV/0!"},"",{"$f":"IF(ISERROR(MATCH($A15,'[1]Step 1-What is changing'!$J:$J,0)),\"\",INDEX('Étape 1 – Ce qui change'!$I:$I,MATCH($A15,'[1]Step 1-What is changing'!$J:$J,0)))","v":""},{"$f":"IF(ISERROR(MATCH($A15,'[1]Step 1-What is changing'!$J:$J,0)),\"\",INDEX('Étape 1 – Ce qui change'!$J:$J,MATCH($A15,'[1]Step 1-What is changing'!$J:$J,0)))","v":""},"","","",{"$f":"IF(ISERROR(MATCH($A15,'[1]Step 1-What is changing'!$J:$J,0)),\"\",INDEX('Étape 1 – Ce qui change'!$N:$N,MATCH($A15,'[1]Step 1-What is changing'!$J:$J,0)))","v":""},{"$f":"IF(ISERROR(MATCH($A15,'[1]Step 1-What is changing'!$J:$J,0)),\"\",INDEX('Étape 1 – Ce qui change'!$O:$O,MATCH($A15,'[1]Step 1-What is changing'!$J:$J,0)))","v":""},{"$f":"IF(ISERROR(MATCH($A15,'[1]Step 1-What is changing'!$J:$J,0)),\"\",INDEX('Étape 1 – Ce qui change'!$P:$P,MATCH($A15,'[1]Step 1-What is changing'!$J:$J,0)))","v":""},{"$f":"IF(ISERROR(MATCH($A15,'[1]Step 1-What is changing'!$J:$J,0)),\"\",INDEX('Étape 1 – Ce qui change'!$Q:$Q,MATCH($A15,'[1]Step 1-What is changing'!$J:$J,0)))","v":""},{"$f":"IF(ISERROR(MATCH($A15,'[1]Step 1-What is changing'!$J:$J,0)),\"\",INDEX('Étape 1 – Ce qui change'!$R:$R,MATCH($A15,'[1]Step 1-What is changing'!$J:$J,0)))","v":""},{"$f":"IF(ISERROR(MATCH($A15,'[1]Step 1-What is changing'!$J:$J,0)),\"\",INDEX('Étape 1 – Ce qui change'!$S:$S,MATCH($A15,'[1]Step 1-What is changing'!$J:$J,0)))","v":""},{"$f":"IF(ISERROR(MATCH($A15,'[1]Step 1-What is changing'!$J:$J,0)),\"\",INDEX('Étape 1 – Ce qui change'!$T:$T,MATCH($A15,'[1]Step 1-What is changing'!$J:$J,0)))","v":""},{"$f":"IF(ISERROR(MATCH($A15,'[1]Step 1-What is changing'!$J:$J,0)),\"\",INDEX('Étape 1 – Ce qui change'!$U:$U,MATCH($A15,'[1]Step 1-What is changing'!$J:$J,0)))","v":""},{"$f":"IF(ISERROR(MATCH($A15,'[1]Step 1-What is changing'!$J:$J,0)),\"\",INDEX('Étape 1 – Ce qui change'!$V:$V,MATCH($A15,'[1]Step 1-What is changing'!$J:$J,0)))","v":""},{"$f":"IF(ISERROR(MATCH($A15,'[1]Step 1-What is changing'!$J:$J,0)),\"\",INDEX('Étape 1 – Ce qui change'!$W:$W,MATCH($A15,'[1]Step 1-What is changing'!$J:$J,0)))","v":""},{"$f":"IF(ISERROR(MATCH($A15,'[1]Step 1-What is changing'!$J:$J,0)),\"\",INDEX('Étape 1 – Ce qui change'!$X:$X,MATCH($A15,'[1]Step 1-What is changing'!$J:$J,0)))","v":""},{"$f":"IF(ISERROR(MATCH($A15,'[1]Step 1-What is changing'!$J:$J,0)),\"\",INDEX('Étape 1 – Ce qui change'!$Y:$Y,MATCH($A15,'[1]Step 1-What is changing'!$J:$J,0)))","v":""},{"$f":"IF(ISERROR(MATCH($A15,'[1]Step 1-What is changing'!$J:$J,0)),\"\",INDEX('Étape 1 – Ce qui change'!$Z:$Z,MATCH($A15,'[1]Step 1-What is changing'!$J:$J,0)))","v":""},{"$f":"IF(ISERROR(MATCH($A15,'[1]Step 1-What is changing'!$J:$J,0)),\"\",INDEX('Étape 1 – Ce qui change'!$AA:$AA,MATCH($A15,'[1]Step 1-What is changing'!$J:$J,0)))","v":""}]
[12,{"$f":"IF(ISERROR(MATCH($A16,'[1]Step 1-What is changing'!$J:$J,0)),\"\",INDEX('Étape 1 – Ce qui change'!$D:$D,MATCH($A16,'[1]Step 1-What is changing'!$J:$J,0))&\" - \"&INDEX('Étape 1 – Ce qui change'!$G:$G,MATCH($A16,'[1]Step 1-What is changing'!$J:$J,0)))","v":""},0,{"$error":"#DIV/0!"},"",{"$f":"IF(ISERROR(MATCH($A16,'[1]Step 1-What is changing'!$J:$J,0)),\"\",INDEX('Étape 1 – Ce qui change'!$I:$I,MATCH($A16,'[1]Step 1-What is changing'!$J:$J,0)))","v":""},{"$f":"IF(ISERROR(MATCH($A16,'[1]Step 1-What is changing'!$J:$J,0)),\"\",INDEX('Étape 1 – Ce qui change'!$J:$J,MATCH($A16,'[1]Step 1-What is changing'!$J:$J,0)))","v":""},"","","",{"$f":"IF(ISERROR(MATCH($A16,'[1]Step 1-What is changing'!$J:$J,0)),\"\",INDEX('Étape 1 – Ce qui change'!$N:$N,MATCH($A16,'[1]Step 1-What is changing'!$J:$J,0)))","v":""},{"$f":"IF(ISERROR(MATCH($A16,'[1]Step 1-What is changing'!$J:$J,0)),\"\",INDEX('Étape 1 – Ce qui change'!$O:$O,MATCH($A16,'[1]Step 1-What is changing'!$J:$J,0)))","v":""},{"$f":"IF(ISERROR(MATCH($A16,'[1]Step 1-What is changing'!$J:$J,0)),\"\",INDEX('Étape 1 – Ce qui change'!$P:$P,MATCH($A16,'[1]Step 1-What is changing'!$J:$J,0)))","v":""},{"$f":"IF(ISERROR(MATCH($A16,'[1]Step 1-What is changing'!$J:$J,0)),\"\",INDEX('Étape 1 – Ce qui change'!$Q:$Q,MATCH($A16,'[1]Step 1-What is changing'!$J:$J,0)))","v":""},{"$f":"IF(ISERROR(MATCH($A16,'[1]Step 1-What is changing'!$J:$J,0)),\"\",INDEX('Étape 1 – Ce qui change'!$R:$R,MATCH($A16,'[1]Step 1-What is changing'!$J:$J,0)))","v":""},{"$f":"IF(ISERROR(MATCH($A16,'[1]Step 1-What is changing'!$J:$J,0)),\"\",INDEX('Étape 1 – Ce qui change'!$S:$S,MATCH($A16,'[1]Step 1-What is changing'!$J:$J,0)))","v":""},{"$f":"IF(ISERROR(MATCH($A16,'[1]Step 1-What is changing'!$J:$J,0)),\"\",INDEX('Étape 1 – Ce qui change'!$T:$T,MATCH($A16,'[1]Step 1-What is changing'!$J:$J,0)))","v":""},{"$f":"IF(ISERROR(MATCH($A16,'[1]Step 1-What is changing'!$J:$J,0)),\"\",INDEX('Étape 1 – Ce qui change'!$U:$U,MATCH($A16,'[1]Step 1-What is changing'!$J:$J,0)))","v":""},{"$f":"IF(ISERROR(MATCH($A16,'[1]Step 1-What is changing'!$J:$J,0)),\"\",INDEX('Étape 1 – Ce qui change'!$V:$V,MATCH($A16,'[1]Step 1-What is changing'!$J:$J,0)))","v":""},{"$f":"IF(ISERROR(MATCH($A16,'[1]Step 1-What is changing'!$J:$J,0)),\"\",INDEX('Étape 1 – Ce qui change'!$W:$W,MATCH($A16,'[1]Step 1-What is changing'!$J:$J,0)))","v":""},{"$f":"IF(ISERROR(MATCH($A16,'[1]Step 1-What is changing'!$J:$J,0)),\"\",INDEX('Étape 1 – Ce qui change'!$X:$X,MATCH($A16,'[1]Step 1-What is changing'!$J:$J,0)))","v":""},{"$f":"IF(ISERROR(MATCH($A16,'[1]Step 1-What is changing'!$J:$J,0)),\"\",INDEX('Étape 1 – Ce qui change'!$Y:$Y,MATCH($A16,'[1]Step 1-What is changing'!$J:$J,0)))","v":""},{"$f":"IF(ISERROR(MATCH($A16,'[1]Step 1-What is changing'!$J:$J,0)),\"\",INDEX('Étape 1 – Ce qui change'!$Z:$Z,MATCH($A16,'[1]Step 1-What is changing'!$J:$J,0)))","v":""},{"$f":"IF(ISERROR(MATCH($A16,'[1]Step 1-What is changing'!$J:$J,0)),\"\",INDEX('Étape 1 – Ce qui change'!$AA:$AA,MATCH($A16,'[1]Step 1-What is changing'!$J:$J,0)))","v":""}]
[13,{"$f":"IF(ISERROR(MATCH($A17,'[1]Step 1-What is changing'!$J:$J,0)),\"\",INDEX('Étape 1 – Ce qui change'!$D:$D,MATCH($A17,'[1]Step 1-What is changing'!$J:$J,0))&\" - \"&INDEX('Étape 1 – Ce qui change'!$G:$G,MATCH($A17,'[1]Step 1-What is changing'!$J:$J,0)))","v":""},0,{"$error":"#DIV/0!"},"",{"$f":"IF(ISERROR(MATCH($A17,'[1]Step 1-What is changing'!$J:$J,0)),\"\",INDEX('Étape 1 – Ce qui change'!$I:$I,MATCH($A17,'[1]Step 1-What is changing'!$J:$J,0)))","v":""},{"$f":"IF(ISERROR(MATCH($A17,'[1]Step 1-What is changing'!$J:$J,0)),\"\",INDEX('Étape 1 – Ce qui change'!$J:$J,MATCH($A17,'[1]Step 1-What is changing'!$J:$J,0)))","v":""},"","","",{"$f":"IF(ISERROR(MATCH($A17,'[1]Step 1-What is changing'!$J:$J,0)),\"\",INDEX('Étape 1 – Ce qui change'!$N:$N,MATCH($A17,'[1]Step 1-What is changing'!$J:$J,0)))","v":""},{"$f":"IF(ISERROR(MATCH($A17,'[1]Step 1-What is changing'!$J:$J,0)),\"\",INDEX('Étape 1 – Ce qui change'!$O:$O,MATCH($A17,'[1]Step 1-What is changing'!$J:$J,0)))","v":""},{"$f":"IF(ISERROR(MATCH($A17,'[1]Step 1-What is changing'!$J:$J,0)),\"\",INDEX('Étape 1 – Ce qui change'!$P:$P,MATCH($A17,'[1]Step 1-What is changing'!$J:$J,0)))","v":""},{"$f":"IF(ISERROR(MATCH($A17,'[1]Step 1-What is changing'!$J:$J,0)),\"\",INDEX('Étape 1 – Ce qui change'!$Q:$Q,MATCH($A17,'[1]Step 1-What is changing'!$J:$J,0)))","v":""},{"$f":"IF(ISERROR(MATCH($A17,'[1]Step 1-What is changing'!$J:$J,0)),\"\",INDEX('Étape 1 – Ce qui change'!$R:$R,MATCH($A17,'[1]Step 1-What is changing'!$J:$J,0)))","v":""},{"$f":"IF(ISERROR(MATCH($A17,'[1]Step 1-What is changing'!$J:$J,0)),\"\",INDEX('Étape 1 – Ce qui change'!$S:$S,MATCH($A17,'[1]Step 1-What is changing'!$J:$J,0)))","v":""},{"$f":"IF(ISERROR(MATCH($A17,'[1]Step 1-What is changing'!$J:$J,0)),\"\",INDEX('Étape 1 – Ce qui change'!$T:$T,MATCH($A17,'[1]Step 1-What is changing'!$J:$J,0)))","v":""},{"$f":"IF(ISERROR(MATCH($A17,'[1]Step 1-What is changing'!$J:$J,0)),\"\",INDEX('Étape 1 – Ce qui change'!$U:$U,MATCH($A17,'[1]Step 1-What is changing'!$J:$J,0)))","v":""},{"$f":"IF(ISERROR(MATCH($A17,'[1]Step 1-What is changing'!$J:$J,0)),\"\",INDEX('Étape 1 – Ce qui change'!$V:$V,MATCH($A17,'[1]Step 1-What is changing'!$J:$J,0)))","v":""},{"$f":"IF(ISERROR(MATCH($A17,'[1]Step 1-What is changing'!$J:$J,0)),\"\",INDEX('Étape 1 – Ce qui change'!$W:$W,MATCH($A17,'[1]Step 1-What is changing'!$J:$J,0)))","v":""},{"$f":"IF(ISERROR(MATCH($A17,'[1]Step 1-What is changing'!$J:$J,0)),\"\",INDEX('Étape 1 – Ce qui change'!$X:$X,MATCH($A17,'[1]Step 1-What is changing'!$J:$J,0)))","v":""},{"$f":"IF(ISERROR(MATCH($A17,'[1]Step 1-What is changing'!$J:$J,0)),\"\",INDEX('Étape 1 – Ce qui change'!$Y:$Y,MATCH($A17,'[1]Step 1-What is changing'!$J:$J,0)))","v":""},{"$f":"IF(ISERROR(MATCH($A17,'[1]Step 1-What is changing'!$J:$J,0)),\"\",INDEX('Étape 1 – Ce qui change'!$Z:$Z,MATCH($A17,'[1]Step 1-What is changing'!$J:$J,0)))","v":""},{"$f":"IF(ISERROR(MATCH($A17,'[1]Step 1-What is changing'!$J:$J,0)),\"\",INDEX('Étape 1 – Ce qui change'!$AA:$AA,MATCH($A17,'[1]Step 1-What is changing'!$J:$J,0)))","v":""}]
[14,{"$f":"IF(ISERROR(MATCH($A18,'[1]Step 1-What is changing'!$J:$J,0)),\"\",INDEX('Étape 1 – Ce qui change'!$D:$D,MATCH($A18,'[1]Step 1-What is changing'!$J:$J,0))&\" - \"&INDEX('Étape 1 – Ce qui change'!$G:$G,MATCH($A18,'[1]Step 1-What is changing'!$J:$J,0)))","v":""},0,{"$error":"#DIV/0!"},"",{"$f":"IF(ISERROR(MATCH($A18,'[1]Step 1-What is changing'!$J:$J,0)),\"\",INDEX('Étape 1 – Ce qui change'!$I:$I,MATCH($A18,'[1]Step 1-What is changing'!$J:$J,0)))","v":""},{"$f":"IF(ISERROR(MATCH($A18,'[1]Step 1-What is changing'!$J:$J,0)),\"\",INDEX('Étape 1 – Ce qui change'!$J:$J,MATCH($A18,'[1]Step 1-What is changing'!$J:$J,0)))","v":""},"","","",{"$f":"IF(ISERROR(MATCH($A18,'[1]Step 1-What is changing'!$J:$J,0)),\"\",INDEX('Étape 1 – Ce qui change'!$N:$N,MATCH($A18,'[1]Step 1-What is changing'!$J:$J,0)))","v":""},{"$f":"IF(ISERROR(MATCH($A18,'[1]Step 1-What is changing'!$J:$J,0)),\"\",INDEX('Étape 1 – Ce qui change'!$O:$O,MATCH($A18,'[1]Step 1-What is changing'!$J:$J,0)))","v":""},{"$f":"IF(ISERROR(MATCH($A18,'[1]Step 1-What is changing'!$J:$J,0)),\"\",INDEX('Étape 1 – Ce qui change'!$P:$P,MATCH($A18,'[1]Step 1-What is changing'!$J:$J,0)))","v":""},{"$f":"IF(ISERROR(MATCH($A18,'[1]Step 1-What is changing'!$J:$J,0)),\"\",INDEX('Étape 1 – Ce qui change'!$Q:$Q,MATCH($A18,'[1]Step 1-What is changing'!$J:$J,0)))","v":""},{"$f":"IF(ISERROR(MATCH($A18,'[1]Step 1-What is changing'!$J:$J,0)),\"\",INDEX('Étape 1 – Ce qui change'!$R:$R,MATCH($A18,'[1]Step 1-What is changing'!$J:$J,0)))","v":""},{"$f":"IF(ISERROR(MATCH($A18,'[1]Step 1-What is changing'!$J:$J,0)),\"\",INDEX('Étape 1 – Ce qui change'!$S:$S,MATCH($A18,'[1]Step 1-What is changing'!$J:$J,0)))","v":""},{"$f":"IF(ISERROR(MATCH($A18,'[1]Step 1-What is changing'!$J:$J,0)),\"\",INDEX('Étape 1 – Ce qui change'!$T:$T,MATCH($A18,'[1]Step 1-What is changing'!$J:$J,0)))","v":""},{"$f":"IF(ISERROR(MATCH($A18,'[1]Step 1-What is changing'!$J:$J,0)),\"\",INDEX('Étape 1 – Ce qui change'!$U:$U,MATCH($A18,'[1]Step 1-What is changing'!$J:$J,0)))","v":""},{"$f":"IF(ISERROR(MATCH($A18,'[1]Step 1-What is changing'!$J:$J,0)),\"\",INDEX('Étape 1 – Ce qui change'!$V:$V,MATCH($A18,'[1]Step 1-What is changing'!$J:$J,0)))","v":""},{"$f":"IF(ISERROR(MATCH($A18,'[1]Step 1-What is changing'!$J:$J,0)),\"\",INDEX('Étape 1 – Ce qui change'!$W:$W,MATCH($A18,'[1]Step 1-What is changing'!$J:$J,0)))","v":""},{"$f":"IF(ISERROR(MATCH($A18,'[1]Step 1-What is changing'!$J:$J,0)),\"\",INDEX('Étape 1 – Ce qui change'!$X:$X,MATCH($A18,'[1]Step 1-What is changing'!$J:$J,0)))","v":""},{"$f":"IF(ISERROR(MATCH($A18,'[1]Step 1-What is changing'!$J:$J,0)),\"\",INDEX('Étape 1 – Ce qui change'!$Y:$Y,MATCH($A18,'[1]Step 1-What is changing'!$J:$J,0)))","v":""},{"$f":"IF(ISERROR(MATCH($A18,'[1]Step 1-What is changing'!$J:$J,0)),\"\",INDEX('Étape 1 – Ce qui change'!$Z:$Z,MATCH($A18,'[1]Step 1-What is changing'!$J:$J,0)))","v":""},{"$f":"IF(ISERROR(MATCH($A18,'[1]Step 1-What is changing'!$J:$J,0)),\"\",INDEX('Étape 1 – Ce qui change'!$AA:$AA,MATCH($A18,'[1]Step 1-What is changing'!$J:$J,0)))","v":""}]
[15,{"$f":"IF(ISERROR(MATCH($A19,'[1]Step 1-What is changing'!$J:$J,0)),\"\",INDEX('Étape 1 – Ce qui change'!$D:$D,MATCH($A19,'[1]Step 1-What is changing'!$J:$J,0))&\" - \"&INDEX('Étape 1 – Ce qui change'!$G:$G,MATCH($A19,'[1]Step 1-What is changing'!$J:$J,0)))","v":""},0,{"$error":"#DIV/0!"},"",{"$f":"IF(ISERROR(MATCH($A19,'[1]Step 1-What is changing'!$J:$J,0)),\"\",INDEX('Étape 1 – Ce qui change'!$I:$I,MATCH($A19,'[1]Step 1-What is changing'!$J:$J,0)))","v":""},{"$f":"IF(ISERROR(MATCH($A19,'[1]Step 1-What is changing'!$J:$J,0)),\"\",INDEX('Étape 1 – Ce qui change'!$J:$J,MATCH($A19,'[1]Step 1-What is changing'!$J:$J,0)))","v":""},"","","",{"$f":"IF(ISERROR(MATCH($A19,'[1]Step 1-What is changing'!$J:$J,0)),\"\",INDEX('Étape 1 – Ce qui change'!$N:$N,MATCH($A19,'[1]Step 1-What is changing'!$J:$J,0)))","v":""},{"$f":"IF(ISERROR(MATCH($A19,'[1]Step 1-What is changing'!$J:$J,0)),\"\",INDEX('Étape 1 – Ce qui change'!$O:$O,MATCH($A19,'[1]Step 1-What is changing'!$J:$J,0)))","v":""},{"$f":"IF(ISERROR(MATCH($A19,'[1]Step 1-What is changing'!$J:$J,0)),\"\",INDEX('Étape 1 – Ce qui change'!$P:$P,MATCH($A19,'[1]Step 1-What is changing'!$J:$J,0)))","v":""},{"$f":"IF(ISERROR(MATCH($A19,'[1]Step 1-What is changing'!$J:$J,0)),\"\",INDEX('Étape 1 – Ce qui change'!$Q:$Q,MATCH($A19,'[1]Step 1-What is changing'!$J:$J,0)))","v":""},{"$f":"IF(ISERROR(MATCH($A19,'[1]Step 1-What is changing'!$J:$J,0)),\"\",INDEX('Étape 1 – Ce qui change'!$R:$R,MATCH($A19,'[1]Step 1-What is changing'!$J:$J,0)))","v":""},{"$f":"IF(ISERROR(MATCH($A19,'[1]Step 1-What is changing'!$J:$J,0)),\"\",INDEX('Étape 1 – Ce qui change'!$S:$S,MATCH($A19,'[1]Step 1-What is changing'!$J:$J,0)))","v":""},{"$f":"IF(ISERROR(MATCH($A19,'[1]Step 1-What is changing'!$J:$J,0)),\"\",INDEX('Étape 1 – Ce qui change'!$T:$T,MATCH($A19,'[1]Step 1-What is changing'!$J:$J,0)))","v":""},{"$f":"IF(ISERROR(MATCH($A19,'[1]Step 1-What is changing'!$J:$J,0)),\"\",INDEX('Étape 1 – Ce qui change'!$U:$U,MATCH($A19,'[1]Step 1-What is changing'!$J:$J,0)))","v":""},{"$f":"IF(ISERROR(MATCH($A19,'[1]Step 1-What is changing'!$J:$J,0)),\"\",INDEX('Étape 1 – Ce qui change'!$V:$V,MATCH($A19,'[1]Step 1-What is changing'!$J:$J,0)))","v":""},{"$f":"IF(ISERROR(MATCH($A19,'[1]Step 1-What is changing'!$J:$J,0)),\"\",INDEX('Étape 1 – Ce qui change'!$W:$W,MATCH($A19,'[1]Step 1-What is changing'!$J:$J,0)))","v":""},{"$f":"IF(ISERROR(MATCH($A19,'[1]Step 1-What is changing'!$J:$J,0)),\"\",INDEX('Étape 1 – Ce qui change'!$X:$X,MATCH($A19,'[1]Step 1-What is changing'!$J:$J,0)))","v":""},{"$f":"IF(ISERROR(MATCH($A19,'[1]Step 1-What is changing'!$J:$J,0)),\"\",INDEX('Étape 1 – Ce qui change'!$Y:$Y,MATCH($A19,'[1]Step 1-What is changing'!$J:$J,0)))","v":""},{"$f":"IF(ISERROR(MATCH($A19,'[1]Step 1-What is changing'!$J:$J,0)),\"\",INDEX('Étape 1 – Ce qui change'!$Z:$Z,MATCH($A19,'[1]Step 1-What is changing'!$J:$J,0)))","v":""},{"$f":"IF(ISERROR(MATCH($A19,'[1]Step 1-What is changing'!$J:$J,0)),\"\",INDEX('Étape 1 – Ce qui change'!$AA:$AA,MATCH($A19,'[1]Step 1-What is changing'!$J:$J,0)))","v":""}]
[16,{"$f":"IF(ISERROR(MATCH($A20,'[1]Step 1-What is changing'!$J:$J,0)),\"\",INDEX('Étape 1 – Ce qui change'!$D:$D,MATCH($A20,'[1]Step 1-What is changing'!$J:$J,0))&\" - \"&INDEX('Étape 1 – Ce qui change'!$G:$G,MATCH($A20,'[1]Step 1-What is changing'!$J:$J,0)))","v":""},0,{"$error":"#DIV/0!"},"",{"$f":"IF(ISERROR(MATCH($A20,'[1]Step 1-What is changing'!$J:$J,0)),\"\",INDEX('Étape 1 – Ce qui change'!$I:$I,MATCH($A20,'[1]Step 1-What is changing'!$J:$J,0)))","v":""},{"$f":"IF(ISERROR(MATCH($A20,'[1]Step 1-What is changing'!$J:$J,0)),\"\",INDEX('Étape 1 – Ce qui change'!$J:$J,MATCH($A20,'[1]Step 1-What is changing'!$J:$J,0)))","v":""},"","","",{"$f":"IF(ISERROR(MATCH($A20,'[1]Step 1-What is changing'!$J:$J,0)),\"\",INDEX('Étape 1 – Ce qui change'!$N:$N,MATCH($A20,'[1]Step 1-What is changing'!$J:$J,0)))","v":""},{"$f":"IF(ISERROR(MATCH($A20,'[1]Step 1-What is changing'!$J:$J,0)),\"\",INDEX('Étape 1 – Ce qui change'!$O:$O,MATCH($A20,'[1]Step 1-What is changing'!$J:$J,0)))","v":""},{"$f":"IF(ISERROR(MATCH($A20,'[1]Step 1-What is changing'!$J:$J,0)),\"\",INDEX('Étape 1 – Ce qui change'!$P:$P,MATCH($A20,'[1]Step 1-What is changing'!$J:$J,0)))","v":""},{"$f":"IF(ISERROR(MATCH($A20,'[1]Step 1-What is changing'!$J:$J,0)),\"\",INDEX('Étape 1 – Ce qui change'!$Q:$Q,MATCH($A20,'[1]Step 1-What is changing'!$J:$J,0)))","v":""},{"$f":"IF(ISERROR(MATCH($A20,'[1]Step 1-What is changing'!$J:$J,0)),\"\",INDEX('Étape 1 – Ce qui change'!$R:$R,MATCH($A20,'[1]Step 1-What is changing'!$J:$J,0)))","v":""},{"$f":"IF(ISERROR(MATCH($A20,'[1]Step 1-What is changing'!$J:$J,0)),\"\",INDEX('Étape 1 – Ce qui change'!$S:$S,MATCH($A20,'[1]Step 1-What is changing'!$J:$J,0)))","v":""},{"$f":"IF(ISERROR(MATCH($A20,'[1]Step 1-What is changing'!$J:$J,0)),\"\",INDEX('Étape 1 – Ce qui change'!$T:$T,MATCH($A20,'[1]Step 1-What is changing'!$J:$J,0)))","v":""},{"$f":"IF(ISERROR(MATCH($A20,'[1]Step 1-What is changing'!$J:$J,0)),\"\",INDEX('Étape 1 – Ce qui change'!$U:$U,MATCH($A20,'[1]Step 1-What is changing'!$J:$J,0)))","v":""},{"$f":"IF(ISERROR(MATCH($A20,'[1]Step 1-What is changing'!$J:$J,0)),\"\",INDEX('Étape 1 – Ce qui change'!$V:$V,MATCH($A20,'[1]Step 1-What is changing'!$J:$J,0)))","v":""},{"$f":"IF(ISERROR(MATCH($A20,'[1]Step 1-What is changing'!$J:$J,0)),\"\",INDEX('Étape 1 – Ce qui change'!$W:$W,MATCH($A20,'[1]Step 1-What is changing'!$J:$J,0)))","v":""},{"$f":"IF(ISERROR(MATCH($A20,'[1]Step 1-What is changing'!$J:$J,0)),\"\",INDEX('Étape 1 – Ce qui change'!$X:$X,MATCH($A20,'[1]Step 1-What is changing'!$J:$J,0)))","v":""},{"$f":"IF(ISERROR(MATCH($A20,'[1]Step 1-What is changing'!$J:$J,0)),\"\",INDEX('Étape 1 – Ce qui change'!$Y:$Y,MATCH($A20,'[1]Step 1-What is changing'!$J:$J,0)))","v":""},{"$f":"IF(ISERROR(MATCH($A20,'[1]Step 1-What is changing'!$J:$J,0)),\"\",INDEX('Étape 1 – Ce qui change'!$Z:$Z,MATCH($A20,'[1]Step 1-What is changing'!$J:$J,0)))","v":""},{"$f":"IF(ISERROR(MATCH($A20,'[1]Step 1-What is changing'!$J:$J,0)),\"\",INDEX('Étape 1 – Ce qui change'!$AA:$AA,MATCH($A20,'[1]Step 1-What is changing'!$J:$J,0)))","v":""}]
[17,{"$f":"IF(ISERROR(MATCH($A21,'[1]Step 1-What is changing'!$J:$J,0)),\"\",INDEX('Étape 1 – Ce qui change'!$D:$D,MATCH($A21,'[1]Step 1-What is changing'!$J:$J,0))&\" - \"&INDEX('Étape 1 – Ce qui change'!$G:$G,MATCH($A21,'[1]Step 1-What is changing'!$J:$J,0)))","v":""},0,{"$error":"#DIV/0!"},"",{"$f":"IF(ISERROR(MATCH($A21,'[1]Step 1-What is changing'!$J:$J,0)),\"\",INDEX('Étape 1 – Ce qui change'!$I:$I,MATCH($A21,'[1]Step 1-What is changing'!$J:$J,0)))","v":""},{"$f":"IF(ISERROR(MATCH($A21,'[1]Step 1-What is changing'!$J:$J,0)),\"\",INDEX('Étape 1 – Ce qui change'!$J:$J,MATCH($A21,'[1]Step 1-What is changing'!$J:$J,0)))","v":""},"","","",{"$f":"IF(ISERROR(MATCH($A21,'[1]Step 1-What is changing'!$J:$J,0)),\"\",INDEX('Étape 1 – Ce qui change'!$N:$N,MATCH($A21,'[1]Step 1-What is changing'!$J:$J,0)))","v":""},{"$f":"IF(ISERROR(MATCH($A21,'[1]Step 1-What is changing'!$J:$J,0)),\"\",INDEX('Étape 1 – Ce qui change'!$O:$O,MATCH($A21,'[1]Step 1-What is changing'!$J:$J,0)))","v":""},{"$f":"IF(ISERROR(MATCH($A21,'[1]Step 1-What is changing'!$J:$J,0)),\"\",INDEX('Étape 1 – Ce qui change'!$P:$P,MATCH($A21,'[1]Step 1-What is changing'!$J:$J,0)))","v":""},{"$f":"IF(ISERROR(MATCH($A21,'[1]Step 1-What is changing'!$J:$J,0)),\"\",INDEX('Étape 1 – Ce qui change'!$Q:$Q,MATCH($A21,'[1]Step 1-What is changing'!$J:$J,0)))","v":""},{"$f":"IF(ISERROR(MATCH($A21,'[1]Step 1-What is changing'!$J:$J,0)),\"\",INDEX('Étape 1 – Ce qui change'!$R:$R,MATCH($A21,'[1]Step 1-What is changing'!$J:$J,0)))","v":""},{"$f":"IF(ISERROR(MATCH($A21,'[1]Step 1-What is changing'!$J:$J,0)),\"\",INDEX('Étape 1 – Ce qui change'!$S:$S,MATCH($A21,'[1]Step 1-What is changing'!$J:$J,0)))","v":""},{"$f":"IF(ISERROR(MATCH($A21,'[1]Step 1-What is changing'!$J:$J,0)),\"\",INDEX('Étape 1 – Ce qui change'!$T:$T,MATCH($A21,'[1]Step 1-What is changing'!$J:$J,0)))","v":""},{"$f":"IF(ISERROR(MATCH($A21,'[1]Step 1-What is changing'!$J:$J,0)),\"\",INDEX('Étape 1 – Ce qui change'!$U:$U,MATCH($A21,'[1]Step 1-What is changing'!$J:$J,0)))","v":""},{"$f":"IF(ISERROR(MATCH($A21,'[1]Step 1-What is changing'!$J:$J,0)),\"\",INDEX('Étape 1 – Ce qui change'!$V:$V,MATCH($A21,'[1]Step 1-What is changing'!$J:$J,0)))","v":""},{"$f":"IF(ISERROR(MATCH($A21,'[1]Step 1-What is changing'!$J:$J,0)),\"\",INDEX('Étape 1 – Ce qui change'!$W:$W,MATCH($A21,'[1]Step 1-What is changing'!$J:$J,0)))","v":""},{"$f":"IF(ISERROR(MATCH($A21,'[1]Step 1-What is changing'!$J:$J,0)),\"\",INDEX('Étape 1 – Ce qui change'!$X:$X,MATCH($A21,'[1]Step 1-What is changing'!$J:$J,0)))","v":""},{"$f":"IF(ISERROR(MATCH($A21,'[1]Step 1-What is changing'!$J:$J,0)),\"\",INDEX('Étape 1 – Ce qui change'!$Y:$Y,MATCH($A21,'[1]Step 1-What is changing'!$J:$J,0)))","v":""},{"$f":"IF(ISERROR(MATCH($A21,'[1]Step 1-What is changing'!$J:$J,0)),\"\",INDEX('Étape 1 – Ce qui change'!$Z:$Z,MATCH($A21,'[1]Step 1-What is changing'!$J:$J,0)))","v":""},{"$f":"IF(ISERROR(MATCH($A21,'[1]Step 1-What is changing'!$J:$J,0)),\"\",INDEX('Étape 1 – Ce qui change'!$AA:$AA,MATCH($A21,'[1]Step 1-What is changing'!$J:$J,0)))","v":""}]
[18,{"$f":"IF(ISERROR(MATCH($A22,'[1]Step 1-What is changing'!$J:$J,0)),\"\",INDEX('Étape 1 – Ce qui change'!$D:$D,MATCH($A22,'[1]Step 1-What is changing'!$J:$J,0))&\" - \"&INDEX('Étape 1 – Ce qui change'!$G:$G,MATCH($A22,'[1]Step 1-What is changing'!$J:$J,0)))","v":""},0,{"$error":"#DIV/0!"},null,{"$f":"IF(ISERROR(MATCH($A22,'[1]Step 1-What is changing'!$J:$J,0)),\"\",INDEX('Étape 1 – Ce qui change'!$I:$I,MATCH($A22,'[1]Step 1-What is changing'!$J:$J,0)))","v":""},{"$f":"IF(ISERROR(MATCH($A22,'[1]Step 1-What is changing'!$J:$J,0)),\"\",INDEX('Étape 1 – Ce qui change'!$J:$J,MATCH($A22,'[1]Step 1-What is changing'!$J:$J,0)))","v":""},"","","",{"$f":"IF(ISERROR(MATCH($A22,'[1]Step 1-What is changing'!$J:$J,0)),\"\",INDEX('Étape 1 – Ce qui change'!$N:$N,MATCH($A22,'[1]Step 1-What is changing'!$J:$J,0)))","v":""},{"$f":"IF(ISERROR(MATCH($A22,'[1]Step 1-What is changing'!$J:$J,0)),\"\",INDEX('Étape 1 – Ce qui change'!$O:$O,MATCH($A22,'[1]Step 1-What is changing'!$J:$J,0)))","v":""},{"$f":"IF(ISERROR(MATCH($A22,'[1]Step 1-What is changing'!$J:$J,0)),\"\",INDEX('Étape 1 – Ce qui change'!$P:$P,MATCH($A22,'[1]Step 1-What is changing'!$J:$J,0)))","v":""},{"$f":"IF(ISERROR(MATCH($A22,'[1]Step 1-What is changing'!$J:$J,0)),\"\",INDEX('Étape 1 – Ce qui change'!$Q:$Q,MATCH($A22,'[1]Step 1-What is changing'!$J:$J,0)))","v":""},{"$f":"IF(ISERROR(MATCH($A22,'[1]Step 1-What is changing'!$J:$J,0)),\"\",INDEX('Étape 1 – Ce qui change'!$R:$R,MATCH($A22,'[1]Step 1-What is changing'!$J:$J,0)))","v":""},{"$f":"IF(ISERROR(MATCH($A22,'[1]Step 1-What is changing'!$J:$J,0)),\"\",INDEX('Étape 1 – Ce qui change'!$S:$S,MATCH($A22,'[1]Step 1-What is changing'!$J:$J,0)))","v":""},{"$f":"IF(ISERROR(MATCH($A22,'[1]Step 1-What is changing'!$J:$J,0)),\"\",INDEX('Étape 1 – Ce qui change'!$T:$T,MATCH($A22,'[1]Step 1-What is changing'!$J:$J,0)))","v":""},{"$f":"IF(ISERROR(MATCH($A22,'[1]Step 1-What is changing'!$J:$J,0)),\"\",INDEX('Étape 1 – Ce qui change'!$U:$U,MATCH($A22,'[1]Step 1-What is changing'!$J:$J,0)))","v":""},{"$f":"IF(ISERROR(MATCH($A22,'[1]Step 1-What is changing'!$J:$J,0)),\"\",INDEX('Étape 1 – Ce qui change'!$V:$V,MATCH($A22,'[1]Step 1-What is changing'!$J:$J,0)))","v":""},{"$f":"IF(ISERROR(MATCH($A22,'[1]Step 1-What is changing'!$J:$J,0)),\"\",INDEX('Étape 1 – Ce qui change'!$W:$W,MATCH($A22,'[1]Step 1-What is changing'!$J:$J,0)))","v":""},{"$f":"IF(ISERROR(MATCH($A22,'[1]Step 1-What is changing'!$J:$J,0)),\"\",INDEX('Étape 1 – Ce qui change'!$X:$X,MATCH($A22,'[1]Step 1-What is changing'!$J:$J,0)))","v":""},{"$f":"IF(ISERROR(MATCH($A22,'[1]Step 1-What is changing'!$J:$J,0)),\"\",INDEX('Étape 1 – Ce qui change'!$Y:$Y,MATCH($A22,'[1]Step 1-What is changing'!$J:$J,0)))","v":""},{"$f":"IF(ISERROR(MATCH($A22,'[1]Step 1-What is changing'!$J:$J,0)),\"\",INDEX('Étape 1 – Ce qui change'!$Z:$Z,MATCH($A22,'[1]Step 1-What is changing'!$J:$J,0)))","v":""},{"$f":"IF(ISERROR(MATCH($A22,'[1]Step 1-What is changing'!$J:$J,0)),\"\",INDEX('Étape 1 – Ce qui change'!$AA:$AA,MATCH($A22,'[1]Step 1-What is changing'!$J:$J,0)))","v":""}]
[19,{"$f":"IF(ISERROR(MATCH($A23,'[1]Step 1-What is changing'!$J:$J,0)),\"\",INDEX('Étape 1 – Ce qui change'!$D:$D,MATCH($A23,'[1]Step 1-What is changing'!$J:$J,0))&\" - \"&INDEX('Étape 1 – Ce qui change'!$G:$G,MATCH($A23,'[1]Step 1-What is changing'!$J:$J,0)))","v":""},0,{"$error":"#DIV/0!"},"",{"$f":"IF(ISERROR(MATCH($A23,'[1]Step 1-What is changing'!$J:$J,0)),\"\",INDEX('Étape 1 – Ce qui change'!$I:$I,MATCH($A23,'[1]Step 1-What is changing'!$J:$J,0)))","v":""},{"$f":"IF(ISERROR(MATCH($A23,'[1]Step 1-What is changing'!$J:$J,0)),\"\",INDEX('Étape 1 – Ce qui change'!$J:$J,MATCH($A23,'[1]Step 1-What is changing'!$J:$J,0)))","v":""},"","","",{"$f":"IF(ISERROR(MATCH($A23,'[1]Step 1-What is changing'!$J:$J,0)),\"\",INDEX('Étape 1 – Ce qui change'!$N:$N,MATCH($A23,'[1]Step 1-What is changing'!$J:$J,0)))","v":""},{"$f":"IF(ISERROR(MATCH($A23,'[1]Step 1-What is changing'!$J:$J,0)),\"\",INDEX('Étape 1 – Ce qui change'!$O:$O,MATCH($A23,'[1]Step 1-What is changing'!$J:$J,0)))","v":""},{"$f":"IF(ISERROR(MATCH($A23,'[1]Step 1-What is changing'!$J:$J,0)),\"\",INDEX('Étape 1 – Ce qui change'!$P:$P,MATCH($A23,'[1]Step 1-What is changing'!$J:$J,0)))","v":""},{"$f":"IF(ISERROR(MATCH($A23,'[1]Step 1-What is changing'!$J:$J,0)),\"\",INDEX('Étape 1 – Ce qui change'!$Q:$Q,MATCH($A23,'[1]Step 1-What is changing'!$J:$J,0)))","v":""},{"$f":"IF(ISERROR(MATCH($A23,'[1]Step 1-What is changing'!$J:$J,0)),\"\",INDEX('Étape 1 – Ce qui change'!$R:$R,MATCH($A23,'[1]Step 1-What is changing'!$J:$J,0)))","v":""},{"$f":"IF(ISERROR(MATCH($A23,'[1]Step 1-What is changing'!$J:$J,0)),\"\",INDEX('Étape 1 – Ce qui change'!$S:$S,MATCH($A23,'[1]Step 1-What is changing'!$J:$J,0)))","v":""},{"$f":"IF(ISERROR(MATCH($A23,'[1]Step 1-What is changing'!$J:$J,0)),\"\",INDEX('Étape 1 – Ce qui change'!$T:$T,MATCH($A23,'[1]Step 1-What is changing'!$J:$J,0)))","v":""},{"$f":"IF(ISERROR(MATCH($A23,'[1]Step 1-What is changing'!$J:$J,0)),\"\",INDEX('Étape 1 – Ce qui change'!$U:$U,MATCH($A23,'[1]Step 1-What is changing'!$J:$J,0)))","v":""},{"$f":"IF(ISERROR(MATCH($A23,'[1]Step 1-What is changing'!$J:$J,0)),\"\",INDEX('Étape 1 – Ce qui change'!$V:$V,MATCH($A23,'[1]Step 1-What is changing'!$J:$J,0)))","v":""},{"$f":"IF(ISERROR(MATCH($A23,'[1]Step 1-What is changing'!$J:$J,0)),\"\",INDEX('Étape 1 – Ce qui change'!$W:$W,MATCH($A23,'[1]Step 1-What is changing'!$J:$J,0)))","v":""},{"$f":"IF(ISERROR(MATCH($A23,'[1]Step 1-What is changing'!$J:$J,0)),\"\",INDEX('Étape 1 – Ce qui change'!$X:$X,MATCH($A23,'[1]Step 1-What is changing'!$J:$J,0)))","v":""},{"$f":"IF(ISERROR(MATCH($A23,'[1]Step 1-What is changing'!$J:$J,0)),\"\",INDEX('Étape 1 – Ce qui change'!$Y:$Y,MATCH($A23,'[1]Step 1-What is changing'!$J:$J,0)))","v":""},{"$f":"IF(ISERROR(MATCH($A23,'[1]Step 1-What is changing'!$J:$J,0)),\"\",INDEX('Étape 1 – Ce qui change'!$Z:$Z,MATCH($A23,'[1]Step 1-What is changing'!$J:$J,0)))","v":""},{"$f":"IF(ISERROR(MATCH($A23,'[1]Step 1-What is changing'!$J:$J,0)),\"\",INDEX('Étape 1 – Ce qui change'!$AA:$AA,MATCH($A23,'[1]Step 1-What is changing'!$J:$J,0)))","v":""}]
[20,{"$f":"IF(ISERROR(MATCH($A24,'[1]Step 1-What is changing'!$J:$J,0)),\"\",INDEX('Étape 1 – Ce qui change'!$D:$D,MATCH($A24,'[1]Step 1-What is changing'!$J:$J,0))&\" - \"&INDEX('Étape 1 – Ce qui change'!$G:$G,MATCH($A24,'[1]Step 1-What is changing'!$J:$J,0)))","v":""},0,{"$error":"#DIV/0!"},"",{"$f":"IF(ISERROR(MATCH($A24,'[1]Step 1-What is changing'!$J:$J,0)),\"\",INDEX('Étape 1 – Ce qui change'!$I:$I,MATCH($A24,'[1]Step 1-What is changing'!$J:$J,0)))","v":""},{"$f":"IF(ISERROR(MATCH($A24,'[1]Step 1-What is changing'!$J:$J,0)),\"\",INDEX('Étape 1 – Ce qui change'!$J:$J,MATCH($A24,'[1]Step 1-What is changing'!$J:$J,0)))","v":""},"","","",{"$f":"IF(ISERROR(MATCH($A24,'[1]Step 1-What is changing'!$J:$J,0)),\"\",INDEX('Étape 1 – Ce qui change'!$N:$N,MATCH($A24,'[1]Step 1-What is changing'!$J:$J,0)))","v":""},{"$f":"IF(ISERROR(MATCH($A24,'[1]Step 1-What is changing'!$J:$J,0)),\"\",INDEX('Étape 1 – Ce qui change'!$O:$O,MATCH($A24,'[1]Step 1-What is changing'!$J:$J,0)))","v":""},{"$f":"IF(ISERROR(MATCH($A24,'[1]Step 1-What is changing'!$J:$J,0)),\"\",INDEX('Étape 1 – Ce qui change'!$P:$P,MATCH($A24,'[1]Step 1-What is changing'!$J:$J,0)))","v":""},{"$f":"IF(ISERROR(MATCH($A24,'[1]Step 1-What is changing'!$J:$J,0)),\"\",INDEX('Étape 1 – Ce qui change'!$Q:$Q,MATCH($A24,'[1]Step 1-What is changing'!$J:$J,0)))","v":""},{"$f":"IF(ISERROR(MATCH($A24,'[1]Step 1-What is changing'!$J:$J,0)),\"\",INDEX('Étape 1 – Ce qui change'!$R:$R,MATCH($A24,'[1]Step 1-What is changing'!$J:$J,0)))","v":""},{"$f":"IF(ISERROR(MATCH($A24,'[1]Step 1-What is changing'!$J:$J,0)),\"\",INDEX('Étape 1 – Ce qui change'!$S:$S,MATCH($A24,'[1]Step 1-What is changing'!$J:$J,0)))","v":""},{"$f":"IF(ISERROR(MATCH($A24,'[1]Step 1-What is changing'!$J:$J,0)),\"\",INDEX('Étape 1 – Ce qui change'!$T:$T,MATCH($A24,'[1]Step 1-What is changing'!$J:$J,0)))","v":""},{"$f":"IF(ISERROR(MATCH($A24,'[1]Step 1-What is changing'!$J:$J,0)),\"\",INDEX('Étape 1 – Ce qui change'!$U:$U,MATCH($A24,'[1]Step 1-What is changing'!$J:$J,0)))","v":""},{"$f":"IF(ISERROR(MATCH($A24,'[1]Step 1-What is changing'!$J:$J,0)),\"\",INDEX('Étape 1 – Ce qui change'!$V:$V,MATCH($A24,'[1]Step 1-What is changing'!$J:$J,0)))","v":""},{"$f":"IF(ISERROR(MATCH($A24,'[1]Step 1-What is changing'!$J:$J,0)),\"\",INDEX('Étape 1 – Ce qui change'!$W:$W,MATCH($A24,'[1]Step 1-What is changing'!$J:$J,0)))","v":""},{"$f":"IF(ISERROR(MATCH($A24,'[1]Step 1-What is changing'!$J:$J,0)),\"\",INDEX('Étape 1 – Ce qui change'!$X:$X,MATCH($A24,'[1]Step 1-What is changing'!$J:$J,0)))","v":""},{"$f":"IF(ISERROR(MATCH($A24,'[1]Step 1-What is changing'!$J:$J,0)),\"\",INDEX('Étape 1 – Ce qui change'!$Y:$Y,MATCH($A24,'[1]Step 1-What is changing'!$J:$J,0)))","v":""},{"$f":"IF(ISERROR(MATCH($A24,'[1]Step 1-What is changing'!$J:$J,0)),\"\",INDEX('Étape 1 – Ce qui change'!$Z:$Z,MATCH($A24,'[1]Step 1-What is changing'!$J:$J,0)))","v":""},{"$f":"IF(ISERROR(MATCH($A24,'[1]Step 1-What is changing'!$J:$J,0)),\"\",INDEX('Étape 1 – Ce qui change'!$AA:$AA,MATCH($A24,'[1]Step 1-What is changing'!$J:$J,0)))","v":""}]
[21,{"$f":"IF(ISERROR(MATCH($A25,'[1]Step 1-What is changing'!$J:$J,0)),\"\",INDEX('Étape 1 – Ce qui change'!$D:$D,MATCH($A25,'[1]Step 1-What is changing'!$J:$J,0))&\" - \"&INDEX('Étape 1 – Ce qui change'!$G:$G,MATCH($A25,'[1]Step 1-What is changing'!$J:$J,0)))","v":""},0,{"$error":"#DIV/0!"},"",{"$f":"IF(ISERROR(MATCH($A25,'[1]Step 1-What is changing'!$J:$J,0)),\"\",INDEX('Étape 1 – Ce qui change'!$I:$I,MATCH($A25,'[1]Step 1-What is changing'!$J:$J,0)))","v":""},{"$f":"IF(ISERROR(MATCH($A25,'[1]Step 1-What is changing'!$J:$J,0)),\"\",INDEX('Étape 1 – Ce qui change'!$J:$J,MATCH($A25,'[1]Step 1-What is changing'!$J:$J,0)))","v":""},"","","",{"$f":"IF(ISERROR(MATCH($A25,'[1]Step 1-What is changing'!$J:$J,0)),\"\",INDEX('Étape 1 – Ce qui change'!$N:$N,MATCH($A25,'[1]Step 1-What is changing'!$J:$J,0)))","v":""},{"$f":"IF(ISERROR(MATCH($A25,'[1]Step 1-What is changing'!$J:$J,0)),\"\",INDEX('Étape 1 – Ce qui change'!$O:$O,MATCH($A25,'[1]Step 1-What is changing'!$J:$J,0)))","v":""},{"$f":"IF(ISERROR(MATCH($A25,'[1]Step 1-What is changing'!$J:$J,0)),\"\",INDEX('Étape 1 – Ce qui change'!$P:$P,MATCH($A25,'[1]Step 1-What is changing'!$J:$J,0)))","v":""},{"$f":"IF(ISERROR(MATCH($A25,'[1]Step 1-What is changing'!$J:$J,0)),\"\",INDEX('Étape 1 – Ce qui change'!$Q:$Q,MATCH($A25,'[1]Step 1-What is changing'!$J:$J,0)))","v":""},{"$f":"IF(ISERROR(MATCH($A25,'[1]Step 1-What is changing'!$J:$J,0)),\"\",INDEX('Étape 1 – Ce qui change'!$R:$R,MATCH($A25,'[1]Step 1-What is changing'!$J:$J,0)))","v":""},{"$f":"IF(ISERROR(MATCH($A25,'[1]Step 1-What is changing'!$J:$J,0)),\"\",INDEX('Étape 1 – Ce qui change'!$S:$S,MATCH($A25,'[1]Step 1-What is changing'!$J:$J,0)))","v":""},{"$f":"IF(ISERROR(MATCH($A25,'[1]Step 1-What is changing'!$J:$J,0)),\"\",INDEX('Étape 1 – Ce qui change'!$T:$T,MATCH($A25,'[1]Step 1-What is changing'!$J:$J,0)))","v":""},{"$f":"IF(ISERROR(MATCH($A25,'[1]Step 1-What is changing'!$J:$J,0)),\"\",INDEX('Étape 1 – Ce qui change'!$U:$U,MATCH($A25,'[1]Step 1-What is changing'!$J:$J,0)))","v":""},{"$f":"IF(ISERROR(MATCH($A25,'[1]Step 1-What is changing'!$J:$J,0)),\"\",INDEX('Étape 1 – Ce qui change'!$V:$V,MATCH($A25,'[1]Step 1-What is changing'!$J:$J,0)))","v":""},{"$f":"IF(ISERROR(MATCH($A25,'[1]Step 1-What is changing'!$J:$J,0)),\"\",INDEX('Étape 1 – Ce qui change'!$W:$W,MATCH($A25,'[1]Step 1-What is changing'!$J:$J,0)))","v":""},{"$f":"IF(ISERROR(MATCH($A25,'[1]Step 1-What is changing'!$J:$J,0)),\"\",INDEX('Étape 1 – Ce qui change'!$X:$X,MATCH($A25,'[1]Step 1-What is changing'!$J:$J,0)))","v":""},{"$f":"IF(ISERROR(MATCH($A25,'[1]Step 1-What is changing'!$J:$J,0)),\"\",INDEX('Étape 1 – Ce qui change'!$Y:$Y,MATCH($A25,'[1]Step 1-What is changing'!$J:$J,0)))","v":""},{"$f":"IF(ISERROR(MATCH($A25,'[1]Step 1-What is changing'!$J:$J,0)),\"\",INDEX('Étape 1 – Ce qui change'!$Z:$Z,MATCH($A25,'[1]Step 1-What is changing'!$J:$J,0)))","v":""},{"$f":"IF(ISERROR(MATCH($A25,'[1]Step 1-What is changing'!$J:$J,0)),\"\",INDEX('Étape 1 – Ce qui change'!$AA:$AA,MATCH($A25,'[1]Step 1-What is changing'!$J:$J,0)))","v":""}]
[22,{"$f":"IF(ISERROR(MATCH($A26,'[1]Step 1-What is changing'!$J:$J,0)),\"\",INDEX('Étape 1 – Ce qui change'!$D:$D,MATCH($A26,'[1]Step 1-What is changing'!$J:$J,0))&\" - \"&INDEX('Étape 1 – Ce qui change'!$G:$G,MATCH($A26,'[1]Step 1-What is changing'!$J:$J,0)))","v":""},0,{"$error":"#DIV/0!"},"",{"$f":"IF(ISERROR(MATCH($A26,'[1]Step 1-What is changing'!$J:$J,0)),\"\",INDEX('Étape 1 – Ce qui change'!$I:$I,MATCH($A26,'[1]Step 1-What is changing'!$J:$J,0)))","v":""},{"$f":"IF(ISERROR(MATCH($A26,'[1]Step 1-What is changing'!$J:$J,0)),\"\",INDEX('Étape 1 – Ce qui change'!$J:$J,MATCH($A26,'[1]Step 1-What is changing'!$J:$J,0)))","v":""},"","","",{"$f":"IF(ISERROR(MATCH($A26,'[1]Step 1-What is changing'!$J:$J,0)),\"\",INDEX('Étape 1 – Ce qui change'!$N:$N,MATCH($A26,'[1]Step 1-What is changing'!$J:$J,0)))","v":""},{"$f":"IF(ISERROR(MATCH($A26,'[1]Step 1-What is changing'!$J:$J,0)),\"\",INDEX('Étape 1 – Ce qui change'!$O:$O,MATCH($A26,'[1]Step 1-What is changing'!$J:$J,0)))","v":""},{"$f":"IF(ISERROR(MATCH($A26,'[1]Step 1-What is changing'!$J:$J,0)),\"\",INDEX('Étape 1 – Ce qui change'!$P:$P,MATCH($A26,'[1]Step 1-What is changing'!$J:$J,0)))","v":""},{"$f":"IF(ISERROR(MATCH($A26,'[1]Step 1-What is changing'!$J:$J,0)),\"\",INDEX('Étape 1 – Ce qui change'!$Q:$Q,MATCH($A26,'[1]Step 1-What is changing'!$J:$J,0)))","v":""},{"$f":"IF(ISERROR(MATCH($A26,'[1]Step 1-What is changing'!$J:$J,0)),\"\",INDEX('Étape 1 – Ce qui change'!$R:$R,MATCH($A26,'[1]Step 1-What is changing'!$J:$J,0)))","v":""},{"$f":"IF(ISERROR(MATCH($A26,'[1]Step 1-What is changing'!$J:$J,0)),\"\",INDEX('Étape 1 – Ce qui change'!$S:$S,MATCH($A26,'[1]Step 1-What is changing'!$J:$J,0)))","v":""},{"$f":"IF(ISERROR(MATCH($A26,'[1]Step 1-What is changing'!$J:$J,0)),\"\",INDEX('Étape 1 – Ce qui change'!$T:$T,MATCH($A26,'[1]Step 1-What is changing'!$J:$J,0)))","v":""},{"$f":"IF(ISERROR(MATCH($A26,'[1]Step 1-What is changing'!$J:$J,0)),\"\",INDEX('Étape 1 – Ce qui change'!$U:$U,MATCH($A26,'[1]Step 1-What is changing'!$J:$J,0)))","v":""},{"$f":"IF(ISERROR(MATCH($A26,'[1]Step 1-What is changing'!$J:$J,0)),\"\",INDEX('Étape 1 – Ce qui change'!$V:$V,MATCH($A26,'[1]Step 1-What is changing'!$J:$J,0)))","v":""},{"$f":"IF(ISERROR(MATCH($A26,'[1]Step 1-What is changing'!$J:$J,0)),\"\",INDEX('Étape 1 – Ce qui change'!$W:$W,MATCH($A26,'[1]Step 1-What is changing'!$J:$J,0)))","v":""},{"$f":"IF(ISERROR(MATCH($A26,'[1]Step 1-What is changing'!$J:$J,0)),\"\",INDEX('Étape 1 – Ce qui change'!$X:$X,MATCH($A26,'[1]Step 1-What is changing'!$J:$J,0)))","v":""},{"$f":"IF(ISERROR(MATCH($A26,'[1]Step 1-What is changing'!$J:$J,0)),\"\",INDEX('Étape 1 – Ce qui change'!$Y:$Y,MATCH($A26,'[1]Step 1-What is changing'!$J:$J,0)))","v":""},{"$f":"IF(ISERROR(MATCH($A26,'[1]Step 1-What is changing'!$J:$J,0)),\"\",INDEX('Étape 1 – Ce qui change'!$Z:$Z,MATCH($A26,'[1]Step 1-What is changing'!$J:$J,0)))","v":""},{"$f":"IF(ISERROR(MATCH($A26,'[1]Step 1-What is changing'!$J:$J,0)),\"\",INDEX('Étape 1 – Ce qui change'!$AA:$AA,MATCH($A26,'[1]Step 1-What is changing'!$J:$J,0)))","v":""}]
[23,{"$f":"IF(ISERROR(MATCH($A27,'[1]Step 1-What is changing'!$J:$J,0)),\"\",INDEX('Étape 1 – Ce qui change'!$D:$D,MATCH($A27,'[1]Step 1-What is changing'!$J:$J,0))&\" - \"&INDEX('Étape 1 – Ce qui change'!$G:$G,MATCH($A27,'[1]Step 1-What is changing'!$J:$J,0)))","v":""},0,{"$error":"#DIV/0!"},"",{"$f":"IF(ISERROR(MATCH($A27,'[1]Step 1-What is changing'!$J:$J,0)),\"\",INDEX('Étape 1 – Ce qui change'!$I:$I,MATCH($A27,'[1]Step 1-What is changing'!$J:$J,0)))","v":""},{"$f":"IF(ISERROR(MATCH($A27,'[1]Step 1-What is changing'!$J:$J,0)),\"\",INDEX('Étape 1 – Ce qui change'!$J:$J,MATCH($A27,'[1]Step 1-What is changing'!$J:$J,0)))","v":""},"","","",{"$f":"IF(ISERROR(MATCH($A27,'[1]Step 1-What is changing'!$J:$J,0)),\"\",INDEX('Étape 1 – Ce qui change'!$N:$N,MATCH($A27,'[1]Step 1-What is changing'!$J:$J,0)))","v":""},{"$f":"IF(ISERROR(MATCH($A27,'[1]Step 1-What is changing'!$J:$J,0)),\"\",INDEX('Étape 1 – Ce qui change'!$O:$O,MATCH($A27,'[1]Step 1-What is changing'!$J:$J,0)))","v":""},{"$f":"IF(ISERROR(MATCH($A27,'[1]Step 1-What is changing'!$J:$J,0)),\"\",INDEX('Étape 1 – Ce qui change'!$P:$P,MATCH($A27,'[1]Step 1-What is changing'!$J:$J,0)))","v":""},{"$f":"IF(ISERROR(MATCH($A27,'[1]Step 1-What is changing'!$J:$J,0)),\"\",INDEX('Étape 1 – Ce qui change'!$Q:$Q,MATCH($A27,'[1]Step 1-What is changing'!$J:$J,0)))","v":""},{"$f":"IF(ISERROR(MATCH($A27,'[1]Step 1-What is changing'!$J:$J,0)),\"\",INDEX('Étape 1 – Ce qui change'!$R:$R,MATCH($A27,'[1]Step 1-What is changing'!$J:$J,0)))","v":""},{"$f":"IF(ISERROR(MATCH($A27,'[1]Step 1-What is changing'!$J:$J,0)),\"\",INDEX('Étape 1 – Ce qui change'!$S:$S,MATCH($A27,'[1]Step 1-What is changing'!$J:$J,0)))","v":""},{"$f":"IF(ISERROR(MATCH($A27,'[1]Step 1-What is changing'!$J:$J,0)),\"\",INDEX('Étape 1 – Ce qui change'!$T:$T,MATCH($A27,'[1]Step 1-What is changing'!$J:$J,0)))","v":""},{"$f":"IF(ISERROR(MATCH($A27,'[1]Step 1-What is changing'!$J:$J,0)),\"\",INDEX('Étape 1 – Ce qui change'!$U:$U,MATCH($A27,'[1]Step 1-What is changing'!$J:$J,0)))","v":""},{"$f":"IF(ISERROR(MATCH($A27,'[1]Step 1-What is changing'!$J:$J,0)),\"\",INDEX('Étape 1 – Ce qui change'!$V:$V,MATCH($A27,'[1]Step 1-What is changing'!$J:$J,0)))","v":""},{"$f":"IF(ISERROR(MATCH($A27,'[1]Step 1-What is changing'!$J:$J,0)),\"\",INDEX('Étape 1 – Ce qui change'!$W:$W,MATCH($A27,'[1]Step 1-What is changing'!$J:$J,0)))","v":""},{"$f":"IF(ISERROR(MATCH($A27,'[1]Step 1-What is changing'!$J:$J,0)),\"\",INDEX('Étape 1 – Ce qui change'!$X:$X,MATCH($A27,'[1]Step 1-What is changing'!$J:$J,0)))","v":""},{"$f":"IF(ISERROR(MATCH($A27,'[1]Step 1-What is changing'!$J:$J,0)),\"\",INDEX('Étape 1 – Ce qui change'!$Y:$Y,MATCH($A27,'[1]Step 1-What is changing'!$J:$J,0)))","v":""},{"$f":"IF(ISERROR(MATCH($A27,'[1]Step 1-What is changing'!$J:$J,0)),\"\",INDEX('Étape 1 – Ce qui change'!$Z:$Z,MATCH($A27,'[1]Step 1-What is changing'!$J:$J,0)))","v":""},{"$f":"IF(ISERROR(MATCH($A27,'[1]Step 1-What is changing'!$J:$J,0)),\"\",INDEX('Étape 1 – Ce qui change'!$AA:$AA,MATCH($A27,'[1]Step 1-What is changing'!$J:$J,0)))","v":""}]
[24,{"$f":"IF(ISERROR(MATCH($A28,'[1]Step 1-What is changing'!$J:$J,0)),\"\",INDEX('Étape 1 – Ce qui change'!$D:$D,MATCH($A28,'[1]Step 1-What is changing'!$J:$J,0))&\" - \"&INDEX('Étape 1 – Ce qui change'!$G:$G,MATCH($A28,'[1]Step 1-What is changing'!$J:$J,0)))","v":""},0,{"$error":"#DIV/0!"},"",{"$f":"IF(ISERROR(MATCH($A28,'[1]Step 1-What is changing'!$J:$J,0)),\"\",INDEX('Étape 1 – Ce qui change'!$I:$I,MATCH($A28,'[1]Step 1-What is changing'!$J:$J,0)))","v":""},{"$f":"IF(ISERROR(MATCH($A28,'[1]Step 1-What is changing'!$J:$J,0)),\"\",INDEX('Étape 1 – Ce qui change'!$J:$J,MATCH($A28,'[1]Step 1-What is changing'!$J:$J,0)))","v":""},"","","",{"$f":"IF(ISERROR(MATCH($A28,'[1]Step 1-What is changing'!$J:$J,0)),\"\",INDEX('Étape 1 – Ce qui change'!$N:$N,MATCH($A28,'[1]Step 1-What is changing'!$J:$J,0)))","v":""},{"$f":"IF(ISERROR(MATCH($A28,'[1]Step 1-What is changing'!$J:$J,0)),\"\",INDEX('Étape 1 – Ce qui change'!$O:$O,MATCH($A28,'[1]Step 1-What is changing'!$J:$J,0)))","v":""},{"$f":"IF(ISERROR(MATCH($A28,'[1]Step 1-What is changing'!$J:$J,0)),\"\",INDEX('Étape 1 – Ce qui change'!$P:$P,MATCH($A28,'[1]Step 1-What is changing'!$J:$J,0)))","v":""},{"$f":"IF(ISERROR(MATCH($A28,'[1]Step 1-What is changing'!$J:$J,0)),\"\",INDEX('Étape 1 – Ce qui change'!$Q:$Q,MATCH($A28,'[1]Step 1-What is changing'!$J:$J,0)))","v":""},{"$f":"IF(ISERROR(MATCH($A28,'[1]Step 1-What is changing'!$J:$J,0)),\"\",INDEX('Étape 1 – Ce qui change'!$R:$R,MATCH($A28,'[1]Step 1-What is changing'!$J:$J,0)))","v":""},{"$f":"IF(ISERROR(MATCH($A28,'[1]Step 1-What is changing'!$J:$J,0)),\"\",INDEX('Étape 1 – Ce qui change'!$S:$S,MATCH($A28,'[1]Step 1-What is changing'!$J:$J,0)))","v":""},{"$f":"IF(ISERROR(MATCH($A28,'[1]Step 1-What is changing'!$J:$J,0)),\"\",INDEX('Étape 1 – Ce qui change'!$T:$T,MATCH($A28,'[1]Step 1-What is changing'!$J:$J,0)))","v":""},{"$f":"IF(ISERROR(MATCH($A28,'[1]Step 1-What is changing'!$J:$J,0)),\"\",INDEX('Étape 1 – Ce qui change'!$U:$U,MATCH($A28,'[1]Step 1-What is changing'!$J:$J,0)))","v":""},{"$f":"IF(ISERROR(MATCH($A28,'[1]Step 1-What is changing'!$J:$J,0)),\"\",INDEX('Étape 1 – Ce qui change'!$V:$V,MATCH($A28,'[1]Step 1-What is changing'!$J:$J,0)))","v":""},{"$f":"IF(ISERROR(MATCH($A28,'[1]Step 1-What is changing'!$J:$J,0)),\"\",INDEX('Étape 1 – Ce qui change'!$W:$W,MATCH($A28,'[1]Step 1-What is changing'!$J:$J,0)))","v":""},{"$f":"IF(ISERROR(MATCH($A28,'[1]Step 1-What is changing'!$J:$J,0)),\"\",INDEX('Étape 1 – Ce qui change'!$X:$X,MATCH($A28,'[1]Step 1-What is changing'!$J:$J,0)))","v":""},{"$f":"IF(ISERROR(MATCH($A28,'[1]Step 1-What is changing'!$J:$J,0)),\"\",INDEX('Étape 1 – Ce qui change'!$Y:$Y,MATCH($A28,'[1]Step 1-What is changing'!$J:$J,0)))","v":""},{"$f":"IF(ISERROR(MATCH($A28,'[1]Step 1-What is changing'!$J:$J,0)),\"\",INDEX('Étape 1 – Ce qui change'!$Z:$Z,MATCH($A28,'[1]Step 1-What is changing'!$J:$J,0)))","v":""},{"$f":"IF(ISERROR(MATCH($A28,'[1]Step 1-What is changing'!$J:$J,0)),\"\",INDEX('Étape 1 – Ce qui change'!$AA:$AA,MATCH($A28,'[1]Step 1-What is changing'!$J:$J,0)))","v":""}]
[25,{"$f":"IF(ISERROR(MATCH($A29,'[1]Step 1-What is changing'!$J:$J,0)),\"\",INDEX('Étape 1 – Ce qui change'!$D:$D,MATCH($A29,'[1]Step 1-What is changing'!$J:$J,0))&\" - \"&INDEX('Étape 1 – Ce qui change'!$G:$G,MATCH($A29,'[1]Step 1-What is changing'!$J:$J,0)))","v":""},0,{"$error":"#DIV/0!"},"",{"$f":"IF(ISERROR(MATCH($A29,'[1]Step 1-What is changing'!$J:$J,0)),\"\",INDEX('Étape 1 – Ce qui change'!$I:$I,MATCH($A29,'[1]Step 1-What is changing'!$J:$J,0)))","v":""},{"$f":"IF(ISERROR(MATCH($A29,'[1]Step 1-What is changing'!$J:$J,0)),\"\",INDEX('Étape 1 – Ce qui change'!$J:$J,MATCH($A29,'[1]Step 1-What is changing'!$J:$J,0)))","v":""},"","","",{"$f":"IF(ISERROR(MATCH($A29,'[1]Step 1-What is changing'!$J:$J,0)),\"\",INDEX('Étape 1 – Ce qui change'!$N:$N,MATCH($A29,'[1]Step 1-What is changing'!$J:$J,0)))","v":""},{"$f":"IF(ISERROR(MATCH($A29,'[1]Step 1-What is changing'!$J:$J,0)),\"\",INDEX('Étape 1 – Ce qui change'!$O:$O,MATCH($A29,'[1]Step 1-What is changing'!$J:$J,0)))","v":""},{"$f":"IF(ISERROR(MATCH($A29,'[1]Step 1-What is changing'!$J:$J,0)),\"\",INDEX('Étape 1 – Ce qui change'!$P:$P,MATCH($A29,'[1]Step 1-What is changing'!$J:$J,0)))","v":""},{"$f":"IF(ISERROR(MATCH($A29,'[1]Step 1-What is changing'!$J:$J,0)),\"\",INDEX('Étape 1 – Ce qui change'!$Q:$Q,MATCH($A29,'[1]Step 1-What is changing'!$J:$J,0)))","v":""},{"$f":"IF(ISERROR(MATCH($A29,'[1]Step 1-What is changing'!$J:$J,0)),\"\",INDEX('Étape 1 – Ce qui change'!$R:$R,MATCH($A29,'[1]Step 1-What is changing'!$J:$J,0)))","v":""},{"$f":"IF(ISERROR(MATCH($A29,'[1]Step 1-What is changing'!$J:$J,0)),\"\",INDEX('Étape 1 – Ce qui change'!$S:$S,MATCH($A29,'[1]Step 1-What is changing'!$J:$J,0)))","v":""},{"$f":"IF(ISERROR(MATCH($A29,'[1]Step 1-What is changing'!$J:$J,0)),\"\",INDEX('Étape 1 – Ce qui change'!$T:$T,MATCH($A29,'[1]Step 1-What is changing'!$J:$J,0)))","v":""},{"$f":"IF(ISERROR(MATCH($A29,'[1]Step 1-What is changing'!$J:$J,0)),\"\",INDEX('Étape 1 – Ce qui change'!$U:$U,MATCH($A29,'[1]Step 1-What is changing'!$J:$J,0)))","v":""},{"$f":"IF(ISERROR(MATCH($A29,'[1]Step 1-What is changing'!$J:$J,0)),\"\",INDEX('Étape 1 – Ce qui change'!$V:$V,MATCH($A29,'[1]Step 1-What is changing'!$J:$J,0)))","v":""},{"$f":"IF(ISERROR(MATCH($A29,'[1]Step 1-What is changing'!$J:$J,0)),\"\",INDEX('Étape 1 – Ce qui change'!$W:$W,MATCH($A29,'[1]Step 1-What is changing'!$J:$J,0)))","v":""},{"$f":"IF(ISERROR(MATCH($A29,'[1]Step 1-What is changing'!$J:$J,0)),\"\",INDEX('Étape 1 – Ce qui change'!$X:$X,MATCH($A29,'[1]Step 1-What is changing'!$J:$J,0)))","v":""},{"$f":"IF(ISERROR(MATCH($A29,'[1]Step 1-What is changing'!$J:$J,0)),\"\",INDEX('Étape 1 – Ce qui change'!$Y:$Y,MATCH($A29,'[1]Step 1-What is changing'!$J:$J,0)))","v":""},{"$f":"IF(ISERROR(MATCH($A29,'[1]Step 1-What is changing'!$J:$J,0)),\"\",INDEX('Étape 1 – Ce qui change'!$Z:$Z,MATCH($A29,'[1]Step 1-What is changing'!$J:$J,0)))","v":""},{"$f":"IF(ISERROR(MATCH($A29,'[1]Step 1-What is changing'!$J:$J,0)),\"\",INDEX('Étape 1 – Ce qui change'!$AA:$AA,MATCH($A29,'[1]Step 1-What is changing'!$J:$J,0)))","v":""}]
[26,{"$f":"IF(ISERROR(MATCH($A30,'[1]Step 1-What is changing'!$J:$J,0)),\"\",INDEX('Étape 1 – Ce qui change'!$D:$D,MATCH($A30,'[1]Step 1-What is changing'!$J:$J,0))&\" - \"&INDEX('Étape 1 – Ce qui change'!$G:$G,MATCH($A30,'[1]Step 1-What is changing'!$J:$J,0)))","v":""},0,{"$error":"#DIV/0!"},"",{"$f":"IF(ISERROR(MATCH($A30,'[1]Step 1-What is changing'!$J:$J,0)),\"\",INDEX('Étape 1 – Ce qui change'!$I:$I,MATCH($A30,'[1]Step 1-What is changing'!$J:$J,0)))","v":""},{"$f":"IF(ISERROR(MATCH($A30,'[1]Step 1-What is changing'!$J:$J,0)),\"\",INDEX('Étape 1 – Ce qui change'!$J:$J,MATCH($A30,'[1]Step 1-What is changing'!$J:$J,0)))","v":""},"","","",{"$f":"IF(ISERROR(MATCH($A30,'[1]Step 1-What is changing'!$J:$J,0)),\"\",INDEX('Étape 1 – Ce qui change'!$N:$N,MATCH($A30,'[1]Step 1-What is changing'!$J:$J,0)))","v":""},{"$f":"IF(ISERROR(MATCH($A30,'[1]Step 1-What is changing'!$J:$J,0)),\"\",INDEX('Étape 1 – Ce qui change'!$O:$O,MATCH($A30,'[1]Step 1-What is changing'!$J:$J,0)))","v":""},{"$f":"IF(ISERROR(MATCH($A30,'[1]Step 1-What is changing'!$J:$J,0)),\"\",INDEX('Étape 1 – Ce qui change'!$P:$P,MATCH($A30,'[1]Step 1-What is changing'!$J:$J,0)))","v":""},{"$f":"IF(ISERROR(MATCH($A30,'[1]Step 1-What is changing'!$J:$J,0)),\"\",INDEX('Étape 1 – Ce qui change'!$Q:$Q,MATCH($A30,'[1]Step 1-What is changing'!$J:$J,0)))","v":""},{"$f":"IF(ISERROR(MATCH($A30,'[1]Step 1-What is changing'!$J:$J,0)),\"\",INDEX('Étape 1 – Ce qui change'!$R:$R,MATCH($A30,'[1]Step 1-What is changing'!$J:$J,0)))","v":""},{"$f":"IF(ISERROR(MATCH($A30,'[1]Step 1-What is changing'!$J:$J,0)),\"\",INDEX('Étape 1 – Ce qui change'!$S:$S,MATCH($A30,'[1]Step 1-What is changing'!$J:$J,0)))","v":""},{"$f":"IF(ISERROR(MATCH($A30,'[1]Step 1-What is changing'!$J:$J,0)),\"\",INDEX('Étape 1 – Ce qui change'!$T:$T,MATCH($A30,'[1]Step 1-What is changing'!$J:$J,0)))","v":""},{"$f":"IF(ISERROR(MATCH($A30,'[1]Step 1-What is changing'!$J:$J,0)),\"\",INDEX('Étape 1 – Ce qui change'!$U:$U,MATCH($A30,'[1]Step 1-What is changing'!$J:$J,0)))","v":""},{"$f":"IF(ISERROR(MATCH($A30,'[1]Step 1-What is changing'!$J:$J,0)),\"\",INDEX('Étape 1 – Ce qui change'!$V:$V,MATCH($A30,'[1]Step 1-What is changing'!$J:$J,0)))","v":""},{"$f":"IF(ISERROR(MATCH($A30,'[1]Step 1-What is changing'!$J:$J,0)),\"\",INDEX('Étape 1 – Ce qui change'!$W:$W,MATCH($A30,'[1]Step 1-What is changing'!$J:$J,0)))","v":""},{"$f":"IF(ISERROR(MATCH($A30,'[1]Step 1-What is changing'!$J:$J,0)),\"\",INDEX('Étape 1 – Ce qui change'!$X:$X,MATCH($A30,'[1]Step 1-What is changing'!$J:$J,0)))","v":""},{"$f":"IF(ISERROR(MATCH($A30,'[1]Step 1-What is changing'!$J:$J,0)),\"\",INDEX('Étape 1 – Ce qui change'!$Y:$Y,MATCH($A30,'[1]Step 1-What is changing'!$J:$J,0)))","v":""},{"$f":"IF(ISERROR(MATCH($A30,'[1]Step 1-What is changing'!$J:$J,0)),\"\",INDEX('Étape 1 – Ce qui change'!$Z:$Z,MATCH($A30,'[1]Step 1-What is changing'!$J:$J,0)))","v":""},{"$f":"IF(ISERROR(MATCH($A30,'[1]Step 1-What is changing'!$J:$J,0)),\"\",INDEX('Étape 1 – Ce qui change'!$AA:$AA,MATCH($A30,'[1]Step 1-What is changing'!$J:$J,0)))","v":""}]
[27,{"$f":"IF(ISERROR(MATCH($A31,'[1]Step 1-What is changing'!$J:$J,0)),\"\",INDEX('Étape 1 – Ce qui change'!$D:$D,MATCH($A31,'[1]Step 1-What is changing'!$J:$J,0))&\" - \"&INDEX('Étape 1 – Ce qui change'!$G:$G,MATCH($A31,'[1]Step 1-What is changing'!$J:$J,0)))","v":""},0,{"$error":"#DIV/0!"},"",{"$f":"IF(ISERROR(MATCH($A31,'[1]Step 1-What is changing'!$J:$J,0)),\"\",INDEX('Étape 1 – Ce qui change'!$I:$I,MATCH($A31,'[1]Step 1-What is changing'!$J:$J,0)))","v":""},{"$f":"IF(ISERROR(MATCH($A31,'[1]Step 1-What is changing'!$J:$J,0)),\"\",INDEX('Étape 1 – Ce qui change'!$J:$J,MATCH($A31,'[1]Step 1-What is changing'!$J:$J,0)))","v":""},"","","",{"$f":"IF(ISERROR(MATCH($A31,'[1]Step 1-What is changing'!$J:$J,0)),\"\",INDEX('Étape 1 – Ce qui change'!$N:$N,MATCH($A31,'[1]Step 1-What is changing'!$J:$J,0)))","v":""},{"$f":"IF(ISERROR(MATCH($A31,'[1]Step 1-What is changing'!$J:$J,0)),\"\",INDEX('Étape 1 – Ce qui change'!$O:$O,MATCH($A31,'[1]Step 1-What is changing'!$J:$J,0)))","v":""},{"$f":"IF(ISERROR(MATCH($A31,'[1]Step 1-What is changing'!$J:$J,0)),\"\",INDEX('Étape 1 – Ce qui change'!$P:$P,MATCH($A31,'[1]Step 1-What is changing'!$J:$J,0)))","v":""},{"$f":"IF(ISERROR(MATCH($A31,'[1]Step 1-What is changing'!$J:$J,0)),\"\",INDEX('Étape 1 – Ce qui change'!$Q:$Q,MATCH($A31,'[1]Step 1-What is changing'!$J:$J,0)))","v":""},{"$f":"IF(ISERROR(MATCH($A31,'[1]Step 1-What is changing'!$J:$J,0)),\"\",INDEX('Étape 1 – Ce qui change'!$R:$R,MATCH($A31,'[1]Step 1-What is changing'!$J:$J,0)))","v":""},{"$f":"IF(ISERROR(MATCH($A31,'[1]Step 1-What is changing'!$J:$J,0)),\"\",INDEX('Étape 1 – Ce qui change'!$S:$S,MATCH($A31,'[1]Step 1-What is changing'!$J:$J,0)))","v":""},{"$f":"IF(ISERROR(MATCH($A31,'[1]Step 1-What is changing'!$J:$J,0)),\"\",INDEX('Étape 1 – Ce qui change'!$T:$T,MATCH($A31,'[1]Step 1-What is changing'!$J:$J,0)))","v":""},{"$f":"IF(ISERROR(MATCH($A31,'[1]Step 1-What is changing'!$J:$J,0)),\"\",INDEX('Étape 1 – Ce qui change'!$U:$U,MATCH($A31,'[1]Step 1-What is changing'!$J:$J,0)))","v":""},{"$f":"IF(ISERROR(MATCH($A31,'[1]Step 1-What is changing'!$J:$J,0)),\"\",INDEX('Étape 1 – Ce qui change'!$V:$V,MATCH($A31,'[1]Step 1-What is changing'!$J:$J,0)))","v":""},{"$f":"IF(ISERROR(MATCH($A31,'[1]Step 1-What is changing'!$J:$J,0)),\"\",INDEX('Étape 1 – Ce qui change'!$W:$W,MATCH($A31,'[1]Step 1-What is changing'!$J:$J,0)))","v":""},{"$f":"IF(ISERROR(MATCH($A31,'[1]Step 1-What is changing'!$J:$J,0)),\"\",INDEX('Étape 1 – Ce qui change'!$X:$X,MATCH($A31,'[1]Step 1-What is changing'!$J:$J,0)))","v":""},{"$f":"IF(ISERROR(MATCH($A31,'[1]Step 1-What is changing'!$J:$J,0)),\"\",INDEX('Étape 1 – Ce qui change'!$Y:$Y,MATCH($A31,'[1]Step 1-What is changing'!$J:$J,0)))","v":""},{"$f":"IF(ISERROR(MATCH($A31,'[1]Step 1-What is changing'!$J:$J,0)),\"\",INDEX('Étape 1 – Ce qui change'!$Z:$Z,MATCH($A31,'[1]Step 1-What is changing'!$J:$J,0)))","v":""},{"$f":"IF(ISERROR(MATCH($A31,'[1]Step 1-What is changing'!$J:$J,0)),\"\",INDEX('Étape 1 – Ce qui change'!$AA:$AA,MATCH($A31,'[1]Step 1-What is changing'!$J:$J,0)))","v":""}]
[28,{"$f":"IF(ISERROR(MATCH($A32,'[1]Step 1-What is changing'!$J:$J,0)),\"\",INDEX('Étape 1 – Ce qui change'!$D:$D,MATCH($A32,'[1]Step 1-What is changing'!$J:$J,0))&\" - \"&INDEX('Étape 1 – Ce qui change'!$G:$G,MATCH($A32,'[1]Step 1-What is changing'!$J:$J,0)))","v":""},0,{"$error":"#DIV/0!"},"",{"$f":"IF(ISERROR(MATCH($A32,'[1]Step 1-What is changing'!$J:$J,0)),\"\",INDEX('Étape 1 – Ce qui change'!$I:$I,MATCH($A32,'[1]Step 1-What is changing'!$J:$J,0)))","v":""},{"$f":"IF(ISERROR(MATCH($A32,'[1]Step 1-What is changing'!$J:$J,0)),\"\",INDEX('Étape 1 – Ce qui change'!$J:$J,MATCH($A32,'[1]Step 1-What is changing'!$J:$J,0)))","v":""},"","","",{"$f":"IF(ISERROR(MATCH($A32,'[1]Step 1-What is changing'!$J:$J,0)),\"\",INDEX('Étape 1 – Ce qui change'!$N:$N,MATCH($A32,'[1]Step 1-What is changing'!$J:$J,0)))","v":""},{"$f":"IF(ISERROR(MATCH($A32,'[1]Step 1-What is changing'!$J:$J,0)),\"\",INDEX('Étape 1 – Ce qui change'!$O:$O,MATCH($A32,'[1]Step 1-What is changing'!$J:$J,0)))","v":""},{"$f":"IF(ISERROR(MATCH($A32,'[1]Step 1-What is changing'!$J:$J,0)),\"\",INDEX('Étape 1 – Ce qui change'!$P:$P,MATCH($A32,'[1]Step 1-What is changing'!$J:$J,0)))","v":""},{"$f":"IF(ISERROR(MATCH($A32,'[1]Step 1-What is changing'!$J:$J,0)),\"\",INDEX('Étape 1 – Ce qui change'!$Q:$Q,MATCH($A32,'[1]Step 1-What is changing'!$J:$J,0)))","v":""},{"$f":"IF(ISERROR(MATCH($A32,'[1]Step 1-What is changing'!$J:$J,0)),\"\",INDEX('Étape 1 – Ce qui change'!$R:$R,MATCH($A32,'[1]Step 1-What is changing'!$J:$J,0)))","v":""},{"$f":"IF(ISERROR(MATCH($A32,'[1]Step 1-What is changing'!$J:$J,0)),\"\",INDEX('Étape 1 – Ce qui change'!$S:$S,MATCH($A32,'[1]Step 1-What is changing'!$J:$J,0)))","v":""},{"$f":"IF(ISERROR(MATCH($A32,'[1]Step 1-What is changing'!$J:$J,0)),\"\",INDEX('Étape 1 – Ce qui change'!$T:$T,MATCH($A32,'[1]Step 1-What is changing'!$J:$J,0)))","v":""},{"$f":"IF(ISERROR(MATCH($A32,'[1]Step 1-What is changing'!$J:$J,0)),\"\",INDEX('Étape 1 – Ce qui change'!$U:$U,MATCH($A32,'[1]Step 1-What is changing'!$J:$J,0)))","v":""},{"$f":"IF(ISERROR(MATCH($A32,'[1]Step 1-What is changing'!$J:$J,0)),\"\",INDEX('Étape 1 – Ce qui change'!$V:$V,MATCH($A32,'[1]Step 1-What is changing'!$J:$J,0)))","v":""},{"$f":"IF(ISERROR(MATCH($A32,'[1]Step 1-What is changing'!$J:$J,0)),\"\",INDEX('Étape 1 – Ce qui change'!$W:$W,MATCH($A32,'[1]Step 1-What is changing'!$J:$J,0)))","v":""},{"$f":"IF(ISERROR(MATCH($A32,'[1]Step 1-What is changing'!$J:$J,0)),\"\",INDEX('Étape 1 – Ce qui change'!$X:$X,MATCH($A32,'[1]Step 1-What is changing'!$J:$J,0)))","v":""},{"$f":"IF(ISERROR(MATCH($A32,'[1]Step 1-What is changing'!$J:$J,0)),\"\",INDEX('Étape 1 – Ce qui change'!$Y:$Y,MATCH($A32,'[1]Step 1-What is changing'!$J:$J,0)))","v":""},{"$f":"IF(ISERROR(MATCH($A32,'[1]Step 1-What is changing'!$J:$J,0)),\"\",INDEX('Étape 1 – Ce qui change'!$Z:$Z,MATCH($A32,'[1]Step 1-What is changing'!$J:$J,0)))","v":""},{"$f":"IF(ISERROR(MATCH($A32,'[1]Step 1-What is changing'!$J:$J,0)),\"\",INDEX('Étape 1 – Ce qui change'!$AA:$AA,MATCH($A32,'[1]Step 1-What is changing'!$J:$J,0)))","v":""}]
[29,{"$f":"IF(ISERROR(MATCH($A33,'[1]Step 1-What is changing'!$J:$J,0)),\"\",INDEX('Étape 1 – Ce qui change'!$D:$D,MATCH($A33,'[1]Step 1-What is changing'!$J:$J,0))&\" - \"&INDEX('Étape 1 – Ce qui change'!$G:$G,MATCH($A33,'[1]Step 1-What is changing'!$J:$J,0)))","v":""},0,{"$error":"#DIV/0!"},"",{"$f":"IF(ISERROR(MATCH($A33,'[1]Step 1-What is changing'!$J:$J,0)),\"\",INDEX('Étape 1 – Ce qui change'!$I:$I,MATCH($A33,'[1]Step 1-What is changing'!$J:$J,0)))","v":""},{"$f":"IF(ISERROR(MATCH($A33,'[1]Step 1-What is changing'!$J:$J,0)),\"\",INDEX('Étape 1 – Ce qui change'!$J:$J,MATCH($A33,'[1]Step 1-What is changing'!$J:$J,0)))","v":""},"","","",{"$f":"IF(ISERROR(MATCH($A33,'[1]Step 1-What is changing'!$J:$J,0)),\"\",INDEX('Étape 1 – Ce qui change'!$N:$N,MATCH($A33,'[1]Step 1-What is changing'!$J:$J,0)))","v":""},{"$f":"IF(ISERROR(MATCH($A33,'[1]Step 1-What is changing'!$J:$J,0)),\"\",INDEX('Étape 1 – Ce qui change'!$O:$O,MATCH($A33,'[1]Step 1-What is changing'!$J:$J,0)))","v":""},{"$f":"IF(ISERROR(MATCH($A33,'[1]Step 1-What is changing'!$J:$J,0)),\"\",INDEX('Étape 1 – Ce qui change'!$P:$P,MATCH($A33,'[1]Step 1-What is changing'!$J:$J,0)))","v":""},{"$f":"IF(ISERROR(MATCH($A33,'[1]Step 1-What is changing'!$J:$J,0)),\"\",INDEX('Étape 1 – Ce qui change'!$Q:$Q,MATCH($A33,'[1]Step 1-What is changing'!$J:$J,0)))","v":""},{"$f":"IF(ISERROR(MATCH($A33,'[1]Step 1-What is changing'!$J:$J,0)),\"\",INDEX('Étape 1 – Ce qui change'!$R:$R,MATCH($A33,'[1]Step 1-What is changing'!$J:$J,0)))","v":""},{"$f":"IF(ISERROR(MATCH($A33,'[1]Step 1-What is changing'!$J:$J,0)),\"\",INDEX('Étape 1 – Ce qui change'!$S:$S,MATCH($A33,'[1]Step 1-What is changing'!$J:$J,0)))","v":""},{"$f":"IF(ISERROR(MATCH($A33,'[1]Step 1-What is changing'!$J:$J,0)),\"\",INDEX('Étape 1 – Ce qui change'!$T:$T,MATCH($A33,'[1]Step 1-What is changing'!$J:$J,0)))","v":""},{"$f":"IF(ISERROR(MATCH($A33,'[1]Step 1-What is changing'!$J:$J,0)),\"\",INDEX('Étape 1 – Ce qui change'!$U:$U,MATCH($A33,'[1]Step 1-What is changing'!$J:$J,0)))","v":""},{"$f":"IF(ISERROR(MATCH($A33,'[1]Step 1-What is changing'!$J:$J,0)),\"\",INDEX('Étape 1 – Ce qui change'!$V:$V,MATCH($A33,'[1]Step 1-What is changing'!$J:$J,0)))","v":""},{"$f":"IF(ISERROR(MATCH($A33,'[1]Step 1-What is changing'!$J:$J,0)),\"\",INDEX('Étape 1 – Ce qui change'!$W:$W,MATCH($A33,'[1]Step 1-What is changing'!$J:$J,0)))","v":""},{"$f":"IF(ISERROR(MATCH($A33,'[1]Step 1-What is changing'!$J:$J,0)),\"\",INDEX('Étape 1 – Ce qui change'!$X:$X,MATCH($A33,'[1]Step 1-What is changing'!$J:$J,0)))","v":""},{"$f":"IF(ISERROR(MATCH($A33,'[1]Step 1-What is changing'!$J:$J,0)),\"\",INDEX('Étape 1 – Ce qui change'!$Y:$Y,MATCH($A33,'[1]Step 1-What is changing'!$J:$J,0)))","v":""},{"$f":"IF(ISERROR(MATCH($A33,'[1]Step 1-What is changing'!$J:$J,0)),\"\",INDEX('Étape 1 – Ce qui change'!$Z:$Z,MATCH($A33,'[1]Step 1-What is changing'!$J:$J,0)))","v":""},{"$f":"IF(ISERROR(MATCH($A33,'[1]Step 1-What is changing'!$J:$J,0)),\"\",INDEX('Étape 1 – Ce qui change'!$AA:$AA,MATCH($A33,'[1]Step 1-What is changing'!$J:$J,0)))","v":""}]
[30,{"$f":"IF(ISERROR(MATCH($A34,'[1]Step 1-What is changing'!$J:$J,0)),\"\",INDEX('Étape 1 – Ce qui change'!$D:$D,MATCH($A34,'[1]Step 1-What is changing'!$J:$J,0))&\" - \"&INDEX('Étape 1 – Ce qui change'!$G:$G,MATCH($A34,'[1]Step 1-What is changing'!$J:$J,0)))","v":""},0,{"$error":"#DIV/0!"},"",{"$f":"IF(ISERROR(MATCH($A34,'[1]Step 1-What is changing'!$J:$J,0)),\"\",INDEX('Étape 1 – Ce qui change'!$I:$I,MATCH($A34,'[1]Step 1-What is changing'!$J:$J,0)))","v":""},{"$f":"IF(ISERROR(MATCH($A34,'[1]Step 1-What is changing'!$J:$J,0)),\"\",INDEX('Étape 1 – Ce qui change'!$J:$J,MATCH($A34,'[1]Step 1-What is changing'!$J:$J,0)))","v":""},"","","",{"$f":"IF(ISERROR(MATCH($A34,'[1]Step 1-What is changing'!$J:$J,0)),\"\",INDEX('Étape 1 – Ce qui change'!$N:$N,MATCH($A34,'[1]Step 1-What is changing'!$J:$J,0)))","v":""},{"$f":"IF(ISERROR(MATCH($A34,'[1]Step 1-What is changing'!$J:$J,0)),\"\",INDEX('Étape 1 – Ce qui change'!$O:$O,MATCH($A34,'[1]Step 1-What is changing'!$J:$J,0)))","v":""},{"$f":"IF(ISERROR(MATCH($A34,'[1]Step 1-What is changing'!$J:$J,0)),\"\",INDEX('Étape 1 – Ce qui change'!$P:$P,MATCH($A34,'[1]Step 1-What is changing'!$J:$J,0)))","v":""},{"$f":"IF(ISERROR(MATCH($A34,'[1]Step 1-What is changing'!$J:$J,0)),\"\",INDEX('Étape 1 – Ce qui change'!$Q:$Q,MATCH($A34,'[1]Step 1-What is changing'!$J:$J,0)))","v":""},{"$f":"IF(ISERROR(MATCH($A34,'[1]Step 1-What is changing'!$J:$J,0)),\"\",INDEX('Étape 1 – Ce qui change'!$R:$R,MATCH($A34,'[1]Step 1-What is changing'!$J:$J,0)))","v":""},{"$f":"IF(ISERROR(MATCH($A34,'[1]Step 1-What is changing'!$J:$J,0)),\"\",INDEX('Étape 1 – Ce qui change'!$S:$S,MATCH($A34,'[1]Step 1-What is changing'!$J:$J,0)))","v":""},{"$f":"IF(ISERROR(MATCH($A34,'[1]Step 1-What is changing'!$J:$J,0)),\"\",INDEX('Étape 1 – Ce qui change'!$T:$T,MATCH($A34,'[1]Step 1-What is changing'!$J:$J,0)))","v":""},{"$f":"IF(ISERROR(MATCH($A34,'[1]Step 1-What is changing'!$J:$J,0)),\"\",INDEX('Étape 1 – Ce qui change'!$U:$U,MATCH($A34,'[1]Step 1-What is changing'!$J:$J,0)))","v":""},{"$f":"IF(ISERROR(MATCH($A34,'[1]Step 1-What is changing'!$J:$J,0)),\"\",INDEX('Étape 1 – Ce qui change'!$V:$V,MATCH($A34,'[1]Step 1-What is changing'!$J:$J,0)))","v":""},{"$f":"IF(ISERROR(MATCH($A34,'[1]Step 1-What is changing'!$J:$J,0)),\"\",INDEX('Étape 1 – Ce qui change'!$W:$W,MATCH($A34,'[1]Step 1-What is changing'!$J:$J,0)))","v":""},{"$f":"IF(ISERROR(MATCH($A34,'[1]Step 1-What is changing'!$J:$J,0)),\"\",INDEX('Étape 1 – Ce qui change'!$X:$X,MATCH($A34,'[1]Step 1-What is changing'!$J:$J,0)))","v":""},{"$f":"IF(ISERROR(MATCH($A34,'[1]Step 1-What is changing'!$J:$J,0)),\"\",INDEX('Étape 1 – Ce qui change'!$Y:$Y,MATCH($A34,'[1]Step 1-What is changing'!$J:$J,0)))","v":""},{"$f":"IF(ISERROR(MATCH($A34,'[1]Step 1-What is changing'!$J:$J,0)),\"\",INDEX('Étape 1 – Ce qui change'!$Z:$Z,MATCH($A34,'[1]Step 1-What is changing'!$J:$J,0)))","v":""},{"$f":"IF(ISERROR(MATCH($A34,'[1]Step 1-What is changing'!$J:$J,0)),\"\",INDEX('Étape 1 – Ce qui change'!$AA:$AA,MATCH($A34,'[1]Step 1-What is changing'!$J:$J,0)))","v":""}]
[31,{"$f":"IF(ISERROR(MATCH($A35,'[1]Step 1-What is changing'!$J:$J,0)),\"\",INDEX('Étape 1 – Ce qui change'!$D:$D,MATCH($A35,'[1]Step 1-What is changing'!$J:$J,0))&\" - \"&INDEX('Étape 1 – Ce qui change'!$G:$G,MATCH($A35,'[1]Step 1-What is changing'!$J:$J,0)))","v":""},0,{"$error":"#DIV/0!"},"",{"$f":"IF(ISERROR(MATCH($A35,'[1]Step 1-What is changing'!$J:$J,0)),\"\",INDEX('Étape 1 – Ce qui change'!$I:$I,MATCH($A35,'[1]Step 1-What is changing'!$J:$J,0)))","v":""},{"$f":"IF(ISERROR(MATCH($A35,'[1]Step 1-What is changing'!$J:$J,0)),\"\",INDEX('Étape 1 – Ce qui change'!$J:$J,MATCH($A35,'[1]Step 1-What is changing'!$J:$J,0)))","v":""},"","","",{"$f":"IF(ISERROR(MATCH($A35,'[1]Step 1-What is changing'!$J:$J,0)),\"\",INDEX('Étape 1 – Ce qui change'!$N:$N,MATCH($A35,'[1]Step 1-What is changing'!$J:$J,0)))","v":""},{"$f":"IF(ISERROR(MATCH($A35,'[1]Step 1-What is changing'!$J:$J,0)),\"\",INDEX('Étape 1 – Ce qui change'!$O:$O,MATCH($A35,'[1]Step 1-What is changing'!$J:$J,0)))","v":""},{"$f":"IF(ISERROR(MATCH($A35,'[1]Step 1-What is changing'!$J:$J,0)),\"\",INDEX('Étape 1 – Ce qui change'!$P:$P,MATCH($A35,'[1]Step 1-What is changing'!$J:$J,0)))","v":""},{"$f":"IF(ISERROR(MATCH($A35,'[1]Step 1-What is changing'!$J:$J,0)),\"\",INDEX('Étape 1 – Ce qui change'!$Q:$Q,MATCH($A35,'[1]Step 1-What is changing'!$J:$J,0)))","v":""},{"$f":"IF(ISERROR(MATCH($A35,'[1]Step 1-What is changing'!$J:$J,0)),\"\",INDEX('Étape 1 – Ce qui change'!$R:$R,MATCH($A35,'[1]Step 1-What is changing'!$J:$J,0)))","v":""},{"$f":"IF(ISERROR(MATCH($A35,'[1]Step 1-What is changing'!$J:$J,0)),\"\",INDEX('Étape 1 – Ce qui change'!$S:$S,MATCH($A35,'[1]Step 1-What is changing'!$J:$J,0)))","v":""},{"$f":"IF(ISERROR(MATCH($A35,'[1]Step 1-What is changing'!$J:$J,0)),\"\",INDEX('Étape 1 – Ce qui change'!$T:$T,MATCH($A35,'[1]Step 1-What is changing'!$J:$J,0)))","v":""},{"$f":"IF(ISERROR(MATCH($A35,'[1]Step 1-What is changing'!$J:$J,0)),\"\",INDEX('Étape 1 – Ce qui change'!$U:$U,MATCH($A35,'[1]Step 1-What is changing'!$J:$J,0)))","v":""},{"$f":"IF(ISERROR(MATCH($A35,'[1]Step 1-What is changing'!$J:$J,0)),\"\",INDEX('Étape 1 – Ce qui change'!$V:$V,MATCH($A35,'[1]Step 1-What is changing'!$J:$J,0)))","v":""},{"$f":"IF(ISERROR(MATCH($A35,'[1]Step 1-What is changing'!$J:$J,0)),\"\",INDEX('Étape 1 – Ce qui change'!$W:$W,MATCH($A35,'[1]Step 1-What is changing'!$J:$J,0)))","v":""},{"$f":"IF(ISERROR(MATCH($A35,'[1]Step 1-What is changing'!$J:$J,0)),\"\",INDEX('Étape 1 – Ce qui change'!$X:$X,MATCH($A35,'[1]Step 1-What is changing'!$J:$J,0)))","v":""},{"$f":"IF(ISERROR(MATCH($A35,'[1]Step 1-What is changing'!$J:$J,0)),\"\",INDEX('Étape 1 – Ce qui change'!$Y:$Y,MATCH($A35,'[1]Step 1-What is changing'!$J:$J,0)))","v":""},{"$f":"IF(ISERROR(MATCH($A35,'[1]Step 1-What is changing'!$J:$J,0)),\"\",INDEX('Étape 1 – Ce qui change'!$Z:$Z,MATCH($A35,'[1]Step 1-What is changing'!$J:$J,0)))","v":""},{"$f":"IF(ISERROR(MATCH($A35,'[1]Step 1-What is changing'!$J:$J,0)),\"\",INDEX('Étape 1 – Ce qui change'!$AA:$AA,MATCH($A35,'[1]Step 1-What is changing'!$J:$J,0)))","v":""}]
[32,{"$f":"IF(ISERROR(MATCH($A36,'[1]Step 1-What is changing'!$J:$J,0)),\"\",INDEX('Étape 1 – Ce qui change'!$D:$D,MATCH($A36,'[1]Step 1-What is changing'!$J:$J,0))&\" - \"&INDEX('Étape 1 – Ce qui change'!$G:$G,MATCH($A36,'[1]Step 1-What is changing'!$J:$J,0)))","v":""},0,{"$error":"#DIV/0!"},"",{"$f":"IF(ISERROR(MATCH($A36,'[1]Step 1-What is changing'!$J:$J,0)),\"\",INDEX('Étape 1 – Ce qui change'!$I:$I,MATCH($A36,'[1]Step 1-What is changing'!$J:$J,0)))","v":""},{"$f":"IF(ISERROR(MATCH($A36,'[1]Step 1-What is changing'!$J:$J,0)),\"\",INDEX('Étape 1 – Ce qui change'!$J:$J,MATCH($A36,'[1]Step 1-What is changing'!$J:$J,0)))","v":""},"","","",{"$f":"IF(ISERROR(MATCH($A36,'[1]Step 1-What is changing'!$J:$J,0)),\"\",INDEX('Étape 1 – Ce qui change'!$N:$N,MATCH($A36,'[1]Step 1-What is changing'!$J:$J,0)))","v":""},{"$f":"IF(ISERROR(MATCH($A36,'[1]Step 1-What is changing'!$J:$J,0)),\"\",INDEX('Étape 1 – Ce qui change'!$O:$O,MATCH($A36,'[1]Step 1-What is changing'!$J:$J,0)))","v":""},{"$f":"IF(ISERROR(MATCH($A36,'[1]Step 1-What is changing'!$J:$J,0)),\"\",INDEX('Étape 1 – Ce qui change'!$P:$P,MATCH($A36,'[1]Step 1-What is changing'!$J:$J,0)))","v":""},{"$f":"IF(ISERROR(MATCH($A36,'[1]Step 1-What is changing'!$J:$J,0)),\"\",INDEX('Étape 1 – Ce qui change'!$Q:$Q,MATCH($A36,'[1]Step 1-What is changing'!$J:$J,0)))","v":""},{"$f":"IF(ISERROR(MATCH($A36,'[1]Step 1-What is changing'!$J:$J,0)),\"\",INDEX('Étape 1 – Ce qui change'!$R:$R,MATCH($A36,'[1]Step 1-What is changing'!$J:$J,0)))","v":""},{"$f":"IF(ISERROR(MATCH($A36,'[1]Step 1-What is changing'!$J:$J,0)),\"\",INDEX('Étape 1 – Ce qui change'!$S:$S,MATCH($A36,'[1]Step 1-What is changing'!$J:$J,0)))","v":""},{"$f":"IF(ISERROR(MATCH($A36,'[1]Step 1-What is changing'!$J:$J,0)),\"\",INDEX('Étape 1 – Ce qui change'!$T:$T,MATCH($A36,'[1]Step 1-What is changing'!$J:$J,0)))","v":""},{"$f":"IF(ISERROR(MATCH($A36,'[1]Step 1-What is changing'!$J:$J,0)),\"\",INDEX('Étape 1 – Ce qui change'!$U:$U,MATCH($A36,'[1]Step 1-What is changing'!$J:$J,0)))","v":""},{"$f":"IF(ISERROR(MATCH($A36,'[1]Step 1-What is changing'!$J:$J,0)),\"\",INDEX('Étape 1 – Ce qui change'!$V:$V,MATCH($A36,'[1]Step 1-What is changing'!$J:$J,0)))","v":""},{"$f":"IF(ISERROR(MATCH($A36,'[1]Step 1-What is changing'!$J:$J,0)),\"\",INDEX('Étape 1 – Ce qui change'!$W:$W,MATCH($A36,'[1]Step 1-What is changing'!$J:$J,0)))","v":""},{"$f":"IF(ISERROR(MATCH($A36,'[1]Step 1-What is changing'!$J:$J,0)),\"\",INDEX('Étape 1 – Ce qui change'!$X:$X,MATCH($A36,'[1]Step 1-What is changing'!$J:$J,0)))","v":""},{"$f":"IF(ISERROR(MATCH($A36,'[1]Step 1-What is changing'!$J:$J,0)),\"\",INDEX('Étape 1 – Ce qui change'!$Y:$Y,MATCH($A36,'[1]Step 1-What is changing'!$J:$J,0)))","v":""},{"$f":"IF(ISERROR(MATCH($A36,'[1]Step 1-What is changing'!$J:$J,0)),\"\",INDEX('Étape 1 – Ce qui change'!$Z:$Z,MATCH($A36,'[1]Step 1-What is changing'!$J:$J,0)))","v":""},{"$f":"IF(ISERROR(MATCH($A36,'[1]Step 1-What is changing'!$J:$J,0)),\"\",INDEX('Étape 1 – Ce qui change'!$AA:$AA,MATCH($A36,'[1]Step 1-What is changing'!$J:$J,0)))","v":""}]
[33,{"$f":"IF(ISERROR(MATCH($A37,'[1]Step 1-What is changing'!$J:$J,0)),\"\",INDEX('Étape 1 – Ce qui change'!$D:$D,MATCH($A37,'[1]Step 1-What is changing'!$J:$J,0))&\" - \"&INDEX('Étape 1 – Ce qui change'!$G:$G,MATCH($A37,'[1]Step 1-What is changing'!$J:$J,0)))","v":""},0,{"$error":"#DIV/0!"},"",{"$f":"IF(ISERROR(MATCH($A37,'[1]Step 1-What is changing'!$J:$J,0)),\"\",INDEX('Étape 1 – Ce qui change'!$I:$I,MATCH($A37,'[1]Step 1-What is changing'!$J:$J,0)))","v":""},{"$f":"IF(ISERROR(MATCH($A37,'[1]Step 1-What is changing'!$J:$J,0)),\"\",INDEX('Étape 1 – Ce qui change'!$J:$J,MATCH($A37,'[1]Step 1-What is changing'!$J:$J,0)))","v":""},"","","",{"$f":"IF(ISERROR(MATCH($A37,'[1]Step 1-What is changing'!$J:$J,0)),\"\",INDEX('Étape 1 – Ce qui change'!$N:$N,MATCH($A37,'[1]Step 1-What is changing'!$J:$J,0)))","v":""},{"$f":"IF(ISERROR(MATCH($A37,'[1]Step 1-What is changing'!$J:$J,0)),\"\",INDEX('Étape 1 – Ce qui change'!$O:$O,MATCH($A37,'[1]Step 1-What is changing'!$J:$J,0)))","v":""},{"$f":"IF(ISERROR(MATCH($A37,'[1]Step 1-What is changing'!$J:$J,0)),\"\",INDEX('Étape 1 – Ce qui change'!$P:$P,MATCH($A37,'[1]Step 1-What is changing'!$J:$J,0)))","v":""},{"$f":"IF(ISERROR(MATCH($A37,'[1]Step 1-What is changing'!$J:$J,0)),\"\",INDEX('Étape 1 – Ce qui change'!$Q:$Q,MATCH($A37,'[1]Step 1-What is changing'!$J:$J,0)))","v":""},{"$f":"IF(ISERROR(MATCH($A37,'[1]Step 1-What is changing'!$J:$J,0)),\"\",INDEX('Étape 1 – Ce qui change'!$R:$R,MATCH($A37,'[1]Step 1-What is changing'!$J:$J,0)))","v":""},{"$f":"IF(ISERROR(MATCH($A37,'[1]Step 1-What is changing'!$J:$J,0)),\"\",INDEX('Étape 1 – Ce qui change'!$S:$S,MATCH($A37,'[1]Step 1-What is changing'!$J:$J,0)))","v":""},{"$f":"IF(ISERROR(MATCH($A37,'[1]Step 1-What is changing'!$J:$J,0)),\"\",INDEX('Étape 1 – Ce qui change'!$T:$T,MATCH($A37,'[1]Step 1-What is changing'!$J:$J,0)))","v":""},{"$f":"IF(ISERROR(MATCH($A37,'[1]Step 1-What is changing'!$J:$J,0)),\"\",INDEX('Étape 1 – Ce qui change'!$U:$U,MATCH($A37,'[1]Step 1-What is changing'!$J:$J,0)))","v":""},{"$f":"IF(ISERROR(MATCH($A37,'[1]Step 1-What is changing'!$J:$J,0)),\"\",INDEX('Étape 1 – Ce qui change'!$V:$V,MATCH($A37,'[1]Step 1-What is changing'!$J:$J,0)))","v":""},{"$f":"IF(ISERROR(MATCH($A37,'[1]Step 1-What is changing'!$J:$J,0)),\"\",INDEX('Étape 1 – Ce qui change'!$W:$W,MATCH($A37,'[1]Step 1-What is changing'!$J:$J,0)))","v":""},{"$f":"IF(ISERROR(MATCH($A37,'[1]Step 1-What is changing'!$J:$J,0)),\"\",INDEX('Étape 1 – Ce qui change'!$X:$X,MATCH($A37,'[1]Step 1-What is changing'!$J:$J,0)))","v":""},{"$f":"IF(ISERROR(MATCH($A37,'[1]Step 1-What is changing'!$J:$J,0)),\"\",INDEX('Étape 1 – Ce qui change'!$Y:$Y,MATCH($A37,'[1]Step 1-What is changing'!$J:$J,0)))","v":""},{"$f":"IF(ISERROR(MATCH($A37,'[1]Step 1-What is changing'!$J:$J,0)),\"\",INDEX('Étape 1 – Ce qui change'!$Z:$Z,MATCH($A37,'[1]Step 1-What is changing'!$J:$J,0)))","v":""},{"$f":"IF(ISERROR(MATCH($A37,'[1]Step 1-What is changing'!$J:$J,0)),\"\",INDEX('Étape 1 – Ce qui change'!$AA:$AA,MATCH($A37,'[1]Step 1-What is changing'!$J:$J,0)))","v":""}]
[34,{"$f":"IF(ISERROR(MATCH($A38,'[1]Step 1-What is changing'!$J:$J,0)),\"\",INDEX('Étape 1 – Ce qui change'!$D:$D,MATCH($A38,'[1]Step 1-What is changing'!$J:$J,0))&\" - \"&INDEX('Étape 1 – Ce qui change'!$G:$G,MATCH($A38,'[1]Step 1-What is changing'!$J:$J,0)))","v":""},0,{"$error":"#DIV/0!"},"",{"$f":"IF(ISERROR(MATCH($A38,'[1]Step 1-What is changing'!$J:$J,0)),\"\",INDEX('Étape 1 – Ce qui change'!$I:$I,MATCH($A38,'[1]Step 1-What is changing'!$J:$J,0)))","v":""},{"$f":"IF(ISERROR(MATCH($A38,'[1]Step 1-What is changing'!$J:$J,0)),\"\",INDEX('Étape 1 – Ce qui change'!$J:$J,MATCH($A38,'[1]Step 1-What is changing'!$J:$J,0)))","v":""},"","","",{"$f":"IF(ISERROR(MATCH($A38,'[1]Step 1-What is changing'!$J:$J,0)),\"\",INDEX('Étape 1 – Ce qui change'!$N:$N,MATCH($A38,'[1]Step 1-What is changing'!$J:$J,0)))","v":""},{"$f":"IF(ISERROR(MATCH($A38,'[1]Step 1-What is changing'!$J:$J,0)),\"\",INDEX('Étape 1 – Ce qui change'!$O:$O,MATCH($A38,'[1]Step 1-What is changing'!$J:$J,0)))","v":""},{"$f":"IF(ISERROR(MATCH($A38,'[1]Step 1-What is changing'!$J:$J,0)),\"\",INDEX('Étape 1 – Ce qui change'!$P:$P,MATCH($A38,'[1]Step 1-What is changing'!$J:$J,0)))","v":""},{"$f":"IF(ISERROR(MATCH($A38,'[1]Step 1-What is changing'!$J:$J,0)),\"\",INDEX('Étape 1 – Ce qui change'!$Q:$Q,MATCH($A38,'[1]Step 1-What is changing'!$J:$J,0)))","v":""},{"$f":"IF(ISERROR(MATCH($A38,'[1]Step 1-What is changing'!$J:$J,0)),\"\",INDEX('Étape 1 – Ce qui change'!$R:$R,MATCH($A38,'[1]Step 1-What is changing'!$J:$J,0)))","v":""},{"$f":"IF(ISERROR(MATCH($A38,'[1]Step 1-What is changing'!$J:$J,0)),\"\",INDEX('Étape 1 – Ce qui change'!$S:$S,MATCH($A38,'[1]Step 1-What is changing'!$J:$J,0)))","v":""},{"$f":"IF(ISERROR(MATCH($A38,'[1]Step 1-What is changing'!$J:$J,0)),\"\",INDEX('Étape 1 – Ce qui change'!$T:$T,MATCH($A38,'[1]Step 1-What is changing'!$J:$J,0)))","v":""},{"$f":"IF(ISERROR(MATCH($A38,'[1]Step 1-What is changing'!$J:$J,0)),\"\",INDEX('Étape 1 – Ce qui change'!$U:$U,MATCH($A38,'[1]Step 1-What is changing'!$J:$J,0)))","v":""},{"$f":"IF(ISERROR(MATCH($A38,'[1]Step 1-What is changing'!$J:$J,0)),\"\",INDEX('Étape 1 – Ce qui change'!$V:$V,MATCH($A38,'[1]Step 1-What is changing'!$J:$J,0)))","v":""},{"$f":"IF(ISERROR(MATCH($A38,'[1]Step 1-What is changing'!$J:$J,0)),\"\",INDEX('Étape 1 – Ce qui change'!$W:$W,MATCH($A38,'[1]Step 1-What is changing'!$J:$J,0)))","v":""},{"$f":"IF(ISERROR(MATCH($A38,'[1]Step 1-What is changing'!$J:$J,0)),\"\",INDEX('Étape 1 – Ce qui change'!$X:$X,MATCH($A38,'[1]Step 1-What is changing'!$J:$J,0)))","v":""},{"$f":"IF(ISERROR(MATCH($A38,'[1]Step 1-What is changing'!$J:$J,0)),\"\",INDEX('Étape 1 – Ce qui change'!$Y:$Y,MATCH($A38,'[1]Step 1-What is changing'!$J:$J,0)))","v":""},{"$f":"IF(ISERROR(MATCH($A38,'[1]Step 1-What is changing'!$J:$J,0)),\"\",INDEX('Étape 1 – Ce qui change'!$Z:$Z,MATCH($A38,'[1]Step 1-What is changing'!$J:$J,0)))","v":""},{"$f":"IF(ISERROR(MATCH($A38,'[1]Step 1-What is changing'!$J:$J,0)),\"\",INDEX('Étape 1 – Ce qui change'!$AA:$AA,MATCH($A38,'[1]Step 1-What is changing'!$J:$J,0)))","v":""}]
[35,{"$f":"IF(ISERROR(MATCH($A39,'[1]Step 1-What is changing'!$J:$J,0)),\"\",INDEX('Étape 1 – Ce qui change'!$D:$D,MATCH($A39,'[1]Step 1-What is changing'!$J:$J,0))&\" - \"&INDEX('Étape 1 – Ce qui change'!$G:$G,MATCH($A39,'[1]Step 1-What is changing'!$J:$J,0)))","v":""},0,{"$error":"#DIV/0!"},"",{"$f":"IF(ISERROR(MATCH($A39,'[1]Step 1-What is changing'!$J:$J,0)),\"\",INDEX('Étape 1 – Ce qui change'!$I:$I,MATCH($A39,'[1]Step 1-What is changing'!$J:$J,0)))","v":""},{"$f":"IF(ISERROR(MATCH($A39,'[1]Step 1-What is changing'!$J:$J,0)),\"\",INDEX('Étape 1 – Ce qui change'!$J:$J,MATCH($A39,'[1]Step 1-What is changing'!$J:$J,0)))","v":""},"","","",{"$f":"IF(ISERROR(MATCH($A39,'[1]Step 1-What is changing'!$J:$J,0)),\"\",INDEX('Étape 1 – Ce qui change'!$N:$N,MATCH($A39,'[1]Step 1-What is changing'!$J:$J,0)))","v":""},{"$f":"IF(ISERROR(MATCH($A39,'[1]Step 1-What is changing'!$J:$J,0)),\"\",INDEX('Étape 1 – Ce qui change'!$O:$O,MATCH($A39,'[1]Step 1-What is changing'!$J:$J,0)))","v":""},{"$f":"IF(ISERROR(MATCH($A39,'[1]Step 1-What is changing'!$J:$J,0)),\"\",INDEX('Étape 1 – Ce qui change'!$P:$P,MATCH($A39,'[1]Step 1-What is changing'!$J:$J,0)))","v":""},{"$f":"IF(ISERROR(MATCH($A39,'[1]Step 1-What is changing'!$J:$J,0)),\"\",INDEX('Étape 1 – Ce qui change'!$Q:$Q,MATCH($A39,'[1]Step 1-What is changing'!$J:$J,0)))","v":""},{"$f":"IF(ISERROR(MATCH($A39,'[1]Step 1-What is changing'!$J:$J,0)),\"\",INDEX('Étape 1 – Ce qui change'!$R:$R,MATCH($A39,'[1]Step 1-What is changing'!$J:$J,0)))","v":""},{"$f":"IF(ISERROR(MATCH($A39,'[1]Step 1-What is changing'!$J:$J,0)),\"\",INDEX('Étape 1 – Ce qui change'!$S:$S,MATCH($A39,'[1]Step 1-What is changing'!$J:$J,0)))","v":""},{"$f":"IF(ISERROR(MATCH($A39,'[1]Step 1-What is changing'!$J:$J,0)),\"\",INDEX('Étape 1 – Ce qui change'!$T:$T,MATCH($A39,'[1]Step 1-What is changing'!$J:$J,0)))","v":""},{"$f":"IF(ISERROR(MATCH($A39,'[1]Step 1-What is changing'!$J:$J,0)),\"\",INDEX('Étape 1 – Ce qui change'!$U:$U,MATCH($A39,'[1]Step 1-What is changing'!$J:$J,0)))","v":""},{"$f":"IF(ISERROR(MATCH($A39,'[1]Step 1-What is changing'!$J:$J,0)),\"\",INDEX('Étape 1 – Ce qui change'!$V:$V,MATCH($A39,'[1]Step 1-What is changing'!$J:$J,0)))","v":""},{"$f":"IF(ISERROR(MATCH($A39,'[1]Step 1-What is changing'!$J:$J,0)),\"\",INDEX('Étape 1 – Ce qui change'!$W:$W,MATCH($A39,'[1]Step 1-What is changing'!$J:$J,0)))","v":""},{"$f":"IF(ISERROR(MATCH($A39,'[1]Step 1-What is changing'!$J:$J,0)),\"\",INDEX('Étape 1 – Ce qui change'!$X:$X,MATCH($A39,'[1]Step 1-What is changing'!$J:$J,0)))","v":""},{"$f":"IF(ISERROR(MATCH($A39,'[1]Step 1-What is changing'!$J:$J,0)),\"\",INDEX('Étape 1 – Ce qui change'!$Y:$Y,MATCH($A39,'[1]Step 1-What is changing'!$J:$J,0)))","v":""},{"$f":"IF(ISERROR(MATCH($A39,'[1]Step 1-What is changing'!$J:$J,0)),\"\",INDEX('Étape 1 – Ce qui change'!$Z:$Z,MATCH($A39,'[1]Step 1-What is changing'!$J:$J,0)))","v":""},{"$f":"IF(ISERROR(MATCH($A39,'[1]Step 1-What is changing'!$J:$J,0)),\"\",INDEX('Étape 1 – Ce qui change'!$AA:$AA,MATCH($A39,'[1]Step 1-What is changing'!$J:$J,0)))","v":""}]
[36,{"$f":"IF(ISERROR(MATCH($A40,'[1]Step 1-What is changing'!$J:$J,0)),\"\",INDEX('Étape 1 – Ce qui change'!$D:$D,MATCH($A40,'[1]Step 1-What is changing'!$J:$J,0))&\" - \"&INDEX('Étape 1 – Ce qui change'!$G:$G,MATCH($A40,'[1]Step 1-What is changing'!$J:$J,0)))","v":""},0,{"$error":"#DIV/0!"},"",{"$f":"IF(ISERROR(MATCH($A40,'[1]Step 1-What is changing'!$J:$J,0)),\"\",INDEX('Étape 1 – Ce qui change'!$I:$I,MATCH($A40,'[1]Step 1-What is changing'!$J:$J,0)))","v":""},{"$f":"IF(ISERROR(MATCH($A40,'[1]Step 1-What is changing'!$J:$J,0)),\"\",INDEX('Étape 1 – Ce qui change'!$J:$J,MATCH($A40,'[1]Step 1-What is changing'!$J:$J,0)))","v":""},"","","",{"$f":"IF(ISERROR(MATCH($A40,'[1]Step 1-What is changing'!$J:$J,0)),\"\",INDEX('Étape 1 – Ce qui change'!$N:$N,MATCH($A40,'[1]Step 1-What is changing'!$J:$J,0)))","v":""},{"$f":"IF(ISERROR(MATCH($A40,'[1]Step 1-What is changing'!$J:$J,0)),\"\",INDEX('Étape 1 – Ce qui change'!$O:$O,MATCH($A40,'[1]Step 1-What is changing'!$J:$J,0)))","v":""},{"$f":"IF(ISERROR(MATCH($A40,'[1]Step 1-What is changing'!$J:$J,0)),\"\",INDEX('Étape 1 – Ce qui change'!$P:$P,MATCH($A40,'[1]Step 1-What is changing'!$J:$J,0)))","v":""},{"$f":"IF(ISERROR(MATCH($A40,'[1]Step 1-What is changing'!$J:$J,0)),\"\",INDEX('Étape 1 – Ce qui change'!$Q:$Q,MATCH($A40,'[1]Step 1-What is changing'!$J:$J,0)))","v":""},{"$f":"IF(ISERROR(MATCH($A40,'[1]Step 1-What is changing'!$J:$J,0)),\"\",INDEX('Étape 1 – Ce qui change'!$R:$R,MATCH($A40,'[1]Step 1-What is changing'!$J:$J,0)))","v":""},{"$f":"IF(ISERROR(MATCH($A40,'[1]Step 1-What is changing'!$J:$J,0)),\"\",INDEX('Étape 1 – Ce qui change'!$S:$S,MATCH($A40,'[1]Step 1-What is changing'!$J:$J,0)))","v":""},{"$f":"IF(ISERROR(MATCH($A40,'[1]Step 1-What is changing'!$J:$J,0)),\"\",INDEX('Étape 1 – Ce qui change'!$T:$T,MATCH($A40,'[1]Step 1-What is changing'!$J:$J,0)))","v":""},{"$f":"IF(ISERROR(MATCH($A40,'[1]Step 1-What is changing'!$J:$J,0)),\"\",INDEX('Étape 1 – Ce qui change'!$U:$U,MATCH($A40,'[1]Step 1-What is changing'!$J:$J,0)))","v":""},{"$f":"IF(ISERROR(MATCH($A40,'[1]Step 1-What is changing'!$J:$J,0)),\"\",INDEX('Étape 1 – Ce qui change'!$V:$V,MATCH($A40,'[1]Step 1-What is changing'!$J:$J,0)))","v":""},{"$f":"IF(ISERROR(MATCH($A40,'[1]Step 1-What is changing'!$J:$J,0)),\"\",INDEX('Étape 1 – Ce qui change'!$W:$W,MATCH($A40,'[1]Step 1-What is changing'!$J:$J,0)))","v":""},{"$f":"IF(ISERROR(MATCH($A40,'[1]Step 1-What is changing'!$J:$J,0)),\"\",INDEX('Étape 1 – Ce qui change'!$X:$X,MATCH($A40,'[1]Step 1-What is changing'!$J:$J,0)))","v":""},{"$f":"IF(ISERROR(MATCH($A40,'[1]Step 1-What is changing'!$J:$J,0)),\"\",INDEX('Étape 1 – Ce qui change'!$Y:$Y,MATCH($A40,'[1]Step 1-What is changing'!$J:$J,0)))","v":""},{"$f":"IF(ISERROR(MATCH($A40,'[1]Step 1-What is changing'!$J:$J,0)),\"\",INDEX('Étape 1 – Ce qui change'!$Z:$Z,MATCH($A40,'[1]Step 1-What is changing'!$J:$J,0)))","v":""},{"$f":"IF(ISERROR(MATCH($A40,'[1]Step 1-What is changing'!$J:$J,0)),\"\",INDEX('Étape 1 – Ce qui change'!$AA:$AA,MATCH($A40,'[1]Step 1-What is changing'!$J:$J,0)))","v":""}]
[37,{"$f":"IF(ISERROR(MATCH($A41,'[1]Step 1-What is changing'!$J:$J,0)),\"\",INDEX('Étape 1 – Ce qui change'!$D:$D,MATCH($A41,'[1]Step 1-What is changing'!$J:$J,0))&\" - \"&INDEX('Étape 1 – Ce qui change'!$G:$G,MATCH($A41,'[1]Step 1-What is changing'!$J:$J,0)))","v":""},0,{"$error":"#DIV/0!"},"",{"$f":"IF(ISERROR(MATCH($A41,'[1]Step 1-What is changing'!$J:$J,0)),\"\",INDEX('Étape 1 – Ce qui change'!$I:$I,MATCH($A41,'[1]Step 1-What is changing'!$J:$J,0)))","v":""},{"$f":"IF(ISERROR(MATCH($A41,'[1]Step 1-What is changing'!$J:$J,0)),\"\",INDEX('Étape 1 – Ce qui change'!$J:$J,MATCH($A41,'[1]Step 1-What is changing'!$J:$J,0)))","v":""},"","","",{"$f":"IF(ISERROR(MATCH($A41,'[1]Step 1-What is changing'!$J:$J,0)),\"\",INDEX('Étape 1 – Ce qui change'!$N:$N,MATCH($A41,'[1]Step 1-What is changing'!$J:$J,0)))","v":""},{"$f":"IF(ISERROR(MATCH($A41,'[1]Step 1-What is changing'!$J:$J,0)),\"\",INDEX('Étape 1 – Ce qui change'!$O:$O,MATCH($A41,'[1]Step 1-What is changing'!$J:$J,0)))","v":""},{"$f":"IF(ISERROR(MATCH($A41,'[1]Step 1-What is changing'!$J:$J,0)),\"\",INDEX('Étape 1 – Ce qui change'!$P:$P,MATCH($A41,'[1]Step 1-What is changing'!$J:$J,0)))","v":""},{"$f":"IF(ISERROR(MATCH($A41,'[1]Step 1-What is changing'!$J:$J,0)),\"\",INDEX('Étape 1 – Ce qui change'!$Q:$Q,MATCH($A41,'[1]Step 1-What is changing'!$J:$J,0)))","v":""},{"$f":"IF(ISERROR(MATCH($A41,'[1]Step 1-What is changing'!$J:$J,0)),\"\",INDEX('Étape 1 – Ce qui change'!$R:$R,MATCH($A41,'[1]Step 1-What is changing'!$J:$J,0)))","v":""},{"$f":"IF(ISERROR(MATCH($A41,'[1]Step 1-What is changing'!$J:$J,0)),\"\",INDEX('Étape 1 – Ce qui change'!$S:$S,MATCH($A41,'[1]Step 1-What is changing'!$J:$J,0)))","v":""},{"$f":"IF(ISERROR(MATCH($A41,'[1]Step 1-What is changing'!$J:$J,0)),\"\",INDEX('Étape 1 – Ce qui change'!$T:$T,MATCH($A41,'[1]Step 1-What is changing'!$J:$J,0)))","v":""},{"$f":"IF(ISERROR(MATCH($A41,'[1]Step 1-What is changing'!$J:$J,0)),\"\",INDEX('Étape 1 – Ce qui change'!$U:$U,MATCH($A41,'[1]Step 1-What is changing'!$J:$J,0)))","v":""},{"$f":"IF(ISERROR(MATCH($A41,'[1]Step 1-What is changing'!$J:$J,0)),\"\",INDEX('Étape 1 – Ce qui change'!$V:$V,MATCH($A41,'[1]Step 1-What is changing'!$J:$J,0)))","v":""},{"$f":"IF(ISERROR(MATCH($A41,'[1]Step 1-What is changing'!$J:$J,0)),\"\",INDEX('Étape 1 – Ce qui change'!$W:$W,MATCH($A41,'[1]Step 1-What is changing'!$J:$J,0)))","v":""},{"$f":"IF(ISERROR(MATCH($A41,'[1]Step 1-What is changing'!$J:$J,0)),\"\",INDEX('Étape 1 – Ce qui change'!$X:$X,MATCH($A41,'[1]Step 1-What is changing'!$J:$J,0)))","v":""},{"$f":"IF(ISERROR(MATCH($A41,'[1]Step 1-What is changing'!$J:$J,0)),\"\",INDEX('Étape 1 – Ce qui change'!$Y:$Y,MATCH($A41,'[1]Step 1-What is changing'!$J:$J,0)))","v":""},{"$f":"IF(ISERROR(MATCH($A41,'[1]Step 1-What is changing'!$J:$J,0)),\"\",INDEX('Étape 1 – Ce qui change'!$Z:$Z,MATCH($A41,'[1]Step 1-What is changing'!$J:$J,0)))","v":""},{"$f":"IF(ISERROR(MATCH($A41,'[1]Step 1-What is changing'!$J:$J,0)),\"\",INDEX('Étape 1 – Ce qui change'!$AA:$AA,MATCH($A41,'[1]Step 1-What is changing'!$J:$J,0)))","v":""}]
[38,{"$f":"IF(ISERROR(MATCH($A42,'[1]Step 1-What is changing'!$J:$J,0)),\"\",INDEX('Étape 1 – Ce qui change'!$D:$D,MATCH($A42,'[1]Step 1-What is changing'!$J:$J,0))&\" - \"&INDEX('Étape 1 – Ce qui change'!$G:$G,MATCH($A42,'[1]Step 1-What is changing'!$J:$J,0)))","v":""},0,{"$error":"#DIV/0!"},"",{"$f":"IF(ISERROR(MATCH($A42,'[1]Step 1-What is changing'!$J:$J,0)),\"\",INDEX('Étape 1 – Ce qui change'!$I:$I,MATCH($A42,'[1]Step 1-What is changing'!$J:$J,0)))","v":""},{"$f":"IF(ISERROR(MATCH($A42,'[1]Step 1-What is changing'!$J:$J,0)),\"\",INDEX('Étape 1 – Ce qui change'!$J:$J,MATCH($A42,'[1]Step 1-What is changing'!$J:$J,0)))","v":""},"","","",{"$f":"IF(ISERROR(MATCH($A42,'[1]Step 1-What is changing'!$J:$J,0)),\"\",INDEX('Étape 1 – Ce qui change'!$N:$N,MATCH($A42,'[1]Step 1-What is changing'!$J:$J,0)))","v":""},{"$f":"IF(ISERROR(MATCH($A42,'[1]Step 1-What is changing'!$J:$J,0)),\"\",INDEX('Étape 1 – Ce qui change'!$O:$O,MATCH($A42,'[1]Step 1-What is changing'!$J:$J,0)))","v":""},{"$f":"IF(ISERROR(MATCH($A42,'[1]Step 1-What is changing'!$J:$J,0)),\"\",INDEX('Étape 1 – Ce qui change'!$P:$P,MATCH($A42,'[1]Step 1-What is changing'!$J:$J,0)))","v":""},{"$f":"IF(ISERROR(MATCH($A42,'[1]Step 1-What is changing'!$J:$J,0)),\"\",INDEX('Étape 1 – Ce qui change'!$Q:$Q,MATCH($A42,'[1]Step 1-What is changing'!$J:$J,0)))","v":""},{"$f":"IF(ISERROR(MATCH($A42,'[1]Step 1-What is changing'!$J:$J,0)),\"\",INDEX('Étape 1 – Ce qui change'!$R:$R,MATCH($A42,'[1]Step 1-What is changing'!$J:$J,0)))","v":""},{"$f":"IF(ISERROR(MATCH($A42,'[1]Step 1-What is changing'!$J:$J,0)),\"\",INDEX('Étape 1 – Ce qui change'!$S:$S,MATCH($A42,'[1]Step 1-What is changing'!$J:$J,0)))","v":""},{"$f":"IF(ISERROR(MATCH($A42,'[1]Step 1-What is changing'!$J:$J,0)),\"\",INDEX('Étape 1 – Ce qui change'!$T:$T,MATCH($A42,'[1]Step 1-What is changing'!$J:$J,0)))","v":""},{"$f":"IF(ISERROR(MATCH($A42,'[1]Step 1-What is changing'!$J:$J,0)),\"\",INDEX('Étape 1 – Ce qui change'!$U:$U,MATCH($A42,'[1]Step 1-What is changing'!$J:$J,0)))","v":""},{"$f":"IF(ISERROR(MATCH($A42,'[1]Step 1-What is changing'!$J:$J,0)),\"\",INDEX('Étape 1 – Ce qui change'!$V:$V,MATCH($A42,'[1]Step 1-What is changing'!$J:$J,0)))","v":""},{"$f":"IF(ISERROR(MATCH($A42,'[1]Step 1-What is changing'!$J:$J,0)),\"\",INDEX('Étape 1 – Ce qui change'!$W:$W,MATCH($A42,'[1]Step 1-What is changing'!$J:$J,0)))","v":""},{"$f":"IF(ISERROR(MATCH($A42,'[1]Step 1-What is changing'!$J:$J,0)),\"\",INDEX('Étape 1 – Ce qui change'!$X:$X,MATCH($A42,'[1]Step 1-What is changing'!$J:$J,0)))","v":""},{"$f":"IF(ISERROR(MATCH($A42,'[1]Step 1-What is changing'!$J:$J,0)),\"\",INDEX('Étape 1 – Ce qui change'!$Y:$Y,MATCH($A42,'[1]Step 1-What is changing'!$J:$J,0)))","v":""},{"$f":"IF(ISERROR(MATCH($A42,'[1]Step 1-What is changing'!$J:$J,0)),\"\",INDEX('Étape 1 – Ce qui change'!$Z:$Z,MATCH($A42,'[1]Step 1-What is changing'!$J:$J,0)))","v":""},{"$f":"IF(ISERROR(MATCH($A42,'[1]Step 1-What is changing'!$J:$J,0)),\"\",INDEX('Étape 1 – Ce qui change'!$AA:$AA,MATCH($A42,'[1]Step 1-What is changing'!$J:$J,0)))","v":""}]
[39,{"$f":"IF(ISERROR(MATCH($A43,'[1]Step 1-What is changing'!$J:$J,0)),\"\",INDEX('Étape 1 – Ce qui change'!$D:$D,MATCH($A43,'[1]Step 1-What is changing'!$J:$J,0))&\" - \"&INDEX('Étape 1 – Ce qui change'!$G:$G,MATCH($A43,'[1]Step 1-What is changing'!$J:$J,0)))","v":""},0,{"$error":"#DIV/0!"},"",{"$f":"IF(ISERROR(MATCH($A43,'[1]Step 1-What is changing'!$J:$J,0)),\"\",INDEX('Étape 1 – Ce qui change'!$I:$I,MATCH($A43,'[1]Step 1-What is changing'!$J:$J,0)))","v":""},{"$f":"IF(ISERROR(MATCH($A43,'[1]Step 1-What is changing'!$J:$J,0)),\"\",INDEX('Étape 1 – Ce qui change'!$J:$J,MATCH($A43,'[1]Step 1-What is changing'!$J:$J,0)))","v":""},"","","",{"$f":"IF(ISERROR(MATCH($A43,'[1]Step 1-What is changing'!$J:$J,0)),\"\",INDEX('Étape 1 – Ce qui change'!$N:$N,MATCH($A43,'[1]Step 1-What is changing'!$J:$J,0)))","v":""},{"$f":"IF(ISERROR(MATCH($A43,'[1]Step 1-What is changing'!$J:$J,0)),\"\",INDEX('Étape 1 – Ce qui change'!$O:$O,MATCH($A43,'[1]Step 1-What is changing'!$J:$J,0)))","v":""},{"$f":"IF(ISERROR(MATCH($A43,'[1]Step 1-What is changing'!$J:$J,0)),\"\",INDEX('Étape 1 – Ce qui change'!$P:$P,MATCH($A43,'[1]Step 1-What is changing'!$J:$J,0)))","v":""},{"$f":"IF(ISERROR(MATCH($A43,'[1]Step 1-What is changing'!$J:$J,0)),\"\",INDEX('Étape 1 – Ce qui change'!$Q:$Q,MATCH($A43,'[1]Step 1-What is changing'!$J:$J,0)))","v":""},{"$f":"IF(ISERROR(MATCH($A43,'[1]Step 1-What is changing'!$J:$J,0)),\"\",INDEX('Étape 1 – Ce qui change'!$R:$R,MATCH($A43,'[1]Step 1-What is changing'!$J:$J,0)))","v":""},{"$f":"IF(ISERROR(MATCH($A43,'[1]Step 1-What is changing'!$J:$J,0)),\"\",INDEX('Étape 1 – Ce qui change'!$S:$S,MATCH($A43,'[1]Step 1-What is changing'!$J:$J,0)))","v":""},{"$f":"IF(ISERROR(MATCH($A43,'[1]Step 1-What is changing'!$J:$J,0)),\"\",INDEX('Étape 1 – Ce qui change'!$T:$T,MATCH($A43,'[1]Step 1-What is changing'!$J:$J,0)))","v":""},{"$f":"IF(ISERROR(MATCH($A43,'[1]Step 1-What is changing'!$J:$J,0)),\"\",INDEX('Étape 1 – Ce qui change'!$U:$U,MATCH($A43,'[1]Step 1-What is changing'!$J:$J,0)))","v":""},{"$f":"IF(ISERROR(MATCH($A43,'[1]Step 1-What is changing'!$J:$J,0)),\"\",INDEX('Étape 1 – Ce qui change'!$V:$V,MATCH($A43,'[1]Step 1-What is changing'!$J:$J,0)))","v":""},{"$f":"IF(ISERROR(MATCH($A43,'[1]Step 1-What is changing'!$J:$J,0)),\"\",INDEX('Étape 1 – Ce qui change'!$W:$W,MATCH($A43,'[1]Step 1-What is changing'!$J:$J,0)))","v":""},{"$f":"IF(ISERROR(MATCH($A43,'[1]Step 1-What is changing'!$J:$J,0)),\"\",INDEX('Étape 1 – Ce qui change'!$X:$X,MATCH($A43,'[1]Step 1-What is changing'!$J:$J,0)))","v":""},{"$f":"IF(ISERROR(MATCH($A43,'[1]Step 1-What is changing'!$J:$J,0)),\"\",INDEX('Étape 1 – Ce qui change'!$Y:$Y,MATCH($A43,'[1]Step 1-What is changing'!$J:$J,0)))","v":""},{"$f":"IF(ISERROR(MATCH($A43,'[1]Step 1-What is changing'!$J:$J,0)),\"\",INDEX('Étape 1 – Ce qui change'!$Z:$Z,MATCH($A43,'[1]Step 1-What is changing'!$J:$J,0)))","v":""},{"$f":"IF(ISERROR(MATCH($A43,'[1]Step 1-What is changing'!$J:$J,0)),\"\",INDEX('Étape 1 – Ce qui change'!$AA:$AA,MATCH($A43,'[1]Step 1-What is changing'!$J:$J,0)))","v":""}]
[40,{"$f":"IF(ISERROR(MATCH($A44,'[1]Step 1-What is changing'!$J:$J,0)),\"\",INDEX('Étape 1 – Ce qui change'!$D:$D,MATCH($A44,'[1]Step 1-What is changing'!$J:$J,0))&\" - \"&INDEX('Étape 1 – Ce qui change'!$G:$G,MATCH($A44,'[1]Step 1-What is changing'!$J:$J,0)))","v":""},0,{"$error":"#DIV/0!"},"",{"$f":"IF(ISERROR(MATCH($A44,'[1]Step 1-What is changing'!$J:$J,0)),\"\",INDEX('Étape 1 – Ce qui change'!$I:$I,MATCH($A44,'[1]Step 1-What is changing'!$J:$J,0)))","v":""},{"$f":"IF(ISERROR(MATCH($A44,'[1]Step 1-What is changing'!$J:$J,0)),\"\",INDEX('Étape 1 – Ce qui change'!$J:$J,MATCH($A44,'[1]Step 1-What is changing'!$J:$J,0)))","v":""},"","","",{"$f":"IF(ISERROR(MATCH($A44,'[1]Step 1-What is changing'!$J:$J,0)),\"\",INDEX('Étape 1 – Ce qui change'!$N:$N,MATCH($A44,'[1]Step 1-What is changing'!$J:$J,0)))","v":""},{"$f":"IF(ISERROR(MATCH($A44,'[1]Step 1-What is changing'!$J:$J,0)),\"\",INDEX('Étape 1 – Ce qui change'!$O:$O,MATCH($A44,'[1]Step 1-What is changing'!$J:$J,0)))","v":""},{"$f":"IF(ISERROR(MATCH($A44,'[1]Step 1-What is changing'!$J:$J,0)),\"\",INDEX('Étape 1 – Ce qui change'!$P:$P,MATCH($A44,'[1]Step 1-What is changing'!$J:$J,0)))","v":""},{"$f":"IF(ISERROR(MATCH($A44,'[1]Step 1-What is changing'!$J:$J,0)),\"\",INDEX('Étape 1 – Ce qui change'!$Q:$Q,MATCH($A44,'[1]Step 1-What is changing'!$J:$J,0)))","v":""},{"$f":"IF(ISERROR(MATCH($A44,'[1]Step 1-What is changing'!$J:$J,0)),\"\",INDEX('Étape 1 – Ce qui change'!$R:$R,MATCH($A44,'[1]Step 1-What is changing'!$J:$J,0)))","v":""},{"$f":"IF(ISERROR(MATCH($A44,'[1]Step 1-What is changing'!$J:$J,0)),\"\",INDEX('Étape 1 – Ce qui change'!$S:$S,MATCH($A44,'[1]Step 1-What is changing'!$J:$J,0)))","v":""},{"$f":"IF(ISERROR(MATCH($A44,'[1]Step 1-What is changing'!$J:$J,0)),\"\",INDEX('Étape 1 – Ce qui change'!$T:$T,MATCH($A44,'[1]Step 1-What is changing'!$J:$J,0)))","v":""},{"$f":"IF(ISERROR(MATCH($A44,'[1]Step 1-What is changing'!$J:$J,0)),\"\",INDEX('Étape 1 – Ce qui change'!$U:$U,MATCH($A44,'[1]Step 1-What is changing'!$J:$J,0)))","v":""},{"$f":"IF(ISERROR(MATCH($A44,'[1]Step 1-What is changing'!$J:$J,0)),\"\",INDEX('Étape 1 – Ce qui change'!$V:$V,MATCH($A44,'[1]Step 1-What is changing'!$J:$J,0)))","v":""},{"$f":"IF(ISERROR(MATCH($A44,'[1]Step 1-What is changing'!$J:$J,0)),\"\",INDEX('Étape 1 – Ce qui change'!$W:$W,MATCH($A44,'[1]Step 1-What is changing'!$J:$J,0)))","v":""},{"$f":"IF(ISERROR(MATCH($A44,'[1]Step 1-What is changing'!$J:$J,0)),\"\",INDEX('Étape 1 – Ce qui change'!$X:$X,MATCH($A44,'[1]Step 1-What is changing'!$J:$J,0)))","v":""},{"$f":"IF(ISERROR(MATCH($A44,'[1]Step 1-What is changing'!$J:$J,0)),\"\",INDEX('Étape 1 – Ce qui change'!$Y:$Y,MATCH($A44,'[1]Step 1-What is changing'!$J:$J,0)))","v":""},{"$f":"IF(ISERROR(MATCH($A44,'[1]Step 1-What is changing'!$J:$J,0)),\"\",INDEX('Étape 1 – Ce qui change'!$Z:$Z,MATCH($A44,'[1]Step 1-What is changing'!$J:$J,0)))","v":""},{"$f":"IF(ISERROR(MATCH($A44,'[1]Step 1-What is changing'!$J:$J,0)),\"\",INDEX('Étape 1 – Ce qui change'!$AA:$AA,MATCH($A44,'[1]Step 1-What is changing'!$J:$J,0)))","v":""}]
[41,{"$f":"IF(ISERROR(MATCH($A45,'[1]Step 1-What is changing'!$J:$J,0)),\"\",INDEX('Étape 1 – Ce qui change'!$D:$D,MATCH($A45,'[1]Step 1-What is changing'!$J:$J,0))&\" - \"&INDEX('Étape 1 – Ce qui change'!$G:$G,MATCH($A45,'[1]Step 1-What is changing'!$J:$J,0)))","v":""},0,{"$error":"#DIV/0!"},"",{"$f":"IF(ISERROR(MATCH($A45,'[1]Step 1-What is changing'!$J:$J,0)),\"\",INDEX('Étape 1 – Ce qui change'!$I:$I,MATCH($A45,'[1]Step 1-What is changing'!$J:$J,0)))","v":""},{"$f":"IF(ISERROR(MATCH($A45,'[1]Step 1-What is changing'!$J:$J,0)),\"\",INDEX('Étape 1 – Ce qui change'!$J:$J,MATCH($A45,'[1]Step 1-What is changing'!$J:$J,0)))","v":""},"","","",{"$f":"IF(ISERROR(MATCH($A45,'[1]Step 1-What is changing'!$J:$J,0)),\"\",INDEX('Étape 1 – Ce qui change'!$N:$N,MATCH($A45,'[1]Step 1-What is changing'!$J:$J,0)))","v":""},{"$f":"IF(ISERROR(MATCH($A45,'[1]Step 1-What is changing'!$J:$J,0)),\"\",INDEX('Étape 1 – Ce qui change'!$O:$O,MATCH($A45,'[1]Step 1-What is changing'!$J:$J,0)))","v":""},{"$f":"IF(ISERROR(MATCH($A45,'[1]Step 1-What is changing'!$J:$J,0)),\"\",INDEX('Étape 1 – Ce qui change'!$P:$P,MATCH($A45,'[1]Step 1-What is changing'!$J:$J,0)))","v":""},{"$f":"IF(ISERROR(MATCH($A45,'[1]Step 1-What is changing'!$J:$J,0)),\"\",INDEX('Étape 1 – Ce qui change'!$Q:$Q,MATCH($A45,'[1]Step 1-What is changing'!$J:$J,0)))","v":""},{"$f":"IF(ISERROR(MATCH($A45,'[1]Step 1-What is changing'!$J:$J,0)),\"\",INDEX('Étape 1 – Ce qui change'!$R:$R,MATCH($A45,'[1]Step 1-What is changing'!$J:$J,0)))","v":""},{"$f":"IF(ISERROR(MATCH($A45,'[1]Step 1-What is changing'!$J:$J,0)),\"\",INDEX('Étape 1 – Ce qui change'!$S:$S,MATCH($A45,'[1]Step 1-What is changing'!$J:$J,0)))","v":""},{"$f":"IF(ISERROR(MATCH($A45,'[1]Step 1-What is changing'!$J:$J,0)),\"\",INDEX('Étape 1 – Ce qui change'!$T:$T,MATCH($A45,'[1]Step 1-What is changing'!$J:$J,0)))","v":""},{"$f":"IF(ISERROR(MATCH($A45,'[1]Step 1-What is changing'!$J:$J,0)),\"\",INDEX('Étape 1 – Ce qui change'!$U:$U,MATCH($A45,'[1]Step 1-What is changing'!$J:$J,0)))","v":""},{"$f":"IF(ISERROR(MATCH($A45,'[1]Step 1-What is changing'!$J:$J,0)),\"\",INDEX('Étape 1 – Ce qui change'!$V:$V,MATCH($A45,'[1]Step 1-What is changing'!$J:$J,0)))","v":""},{"$f":"IF(ISERROR(MATCH($A45,'[1]Step 1-What is changing'!$J:$J,0)),\"\",INDEX('Étape 1 – Ce qui change'!$W:$W,MATCH($A45,'[1]Step 1-What is changing'!$J:$J,0)))","v":""},{"$f":"IF(ISERROR(MATCH($A45,'[1]Step 1-What is changing'!$J:$J,0)),\"\",INDEX('Étape 1 – Ce qui change'!$X:$X,MATCH($A45,'[1]Step 1-What is changing'!$J:$J,0)))","v":""},{"$f":"IF(ISERROR(MATCH($A45,'[1]Step 1-What is changing'!$J:$J,0)),\"\",INDEX('Étape 1 – Ce qui change'!$Y:$Y,MATCH($A45,'[1]Step 1-What is changing'!$J:$J,0)))","v":""},{"$f":"IF(ISERROR(MATCH($A45,'[1]Step 1-What is changing'!$J:$J,0)),\"\",INDEX('Étape 1 – Ce qui change'!$Z:$Z,MATCH($A45,'[1]Step 1-What is changing'!$J:$J,0)))","v":""},{"$f":"IF(ISERROR(MATCH($A45,'[1]Step 1-What is changing'!$J:$J,0)),\"\",INDEX('Étape 1 – Ce qui change'!$AA:$AA,MATCH($A45,'[1]Step 1-What is changing'!$J:$J,0)))","v":""}]
[42,{"$f":"IF(ISERROR(MATCH($A46,'[1]Step 1-What is changing'!$J:$J,0)),\"\",INDEX('Étape 1 – Ce qui change'!$D:$D,MATCH($A46,'[1]Step 1-What is changing'!$J:$J,0))&\" - \"&INDEX('Étape 1 – Ce qui change'!$G:$G,MATCH($A46,'[1]Step 1-What is changing'!$J:$J,0)))","v":""},0,{"$error":"#DIV/0!"},"",{"$f":"IF(ISERROR(MATCH($A46,'[1]Step 1-What is changing'!$J:$J,0)),\"\",INDEX('Étape 1 – Ce qui change'!$I:$I,MATCH($A46,'[1]Step 1-What is changing'!$J:$J,0)))","v":""},{"$f":"IF(ISERROR(MATCH($A46,'[1]Step 1-What is changing'!$J:$J,0)),\"\",INDEX('Étape 1 – Ce qui change'!$J:$J,MATCH($A46,'[1]Step 1-What is changing'!$J:$J,0)))","v":""},"","","",{"$f":"IF(ISERROR(MATCH($A46,'[1]Step 1-What is changing'!$J:$J,0)),\"\",INDEX('Étape 1 – Ce qui change'!$N:$N,MATCH($A46,'[1]Step 1-What is changing'!$J:$J,0)))","v":""},{"$f":"IF(ISERROR(MATCH($A46,'[1]Step 1-What is changing'!$J:$J,0)),\"\",INDEX('Étape 1 – Ce qui change'!$O:$O,MATCH($A46,'[1]Step 1-What is changing'!$J:$J,0)))","v":""},{"$f":"IF(ISERROR(MATCH($A46,'[1]Step 1-What is changing'!$J:$J,0)),\"\",INDEX('Étape 1 – Ce qui change'!$P:$P,MATCH($A46,'[1]Step 1-What is changing'!$J:$J,0)))","v":""},{"$f":"IF(ISERROR(MATCH($A46,'[1]Step 1-What is changing'!$J:$J,0)),\"\",INDEX('Étape 1 – Ce qui change'!$Q:$Q,MATCH($A46,'[1]Step 1-What is changing'!$J:$J,0)))","v":""},{"$f":"IF(ISERROR(MATCH($A46,'[1]Step 1-What is changing'!$J:$J,0)),\"\",INDEX('Étape 1 – Ce qui change'!$R:$R,MATCH($A46,'[1]Step 1-What is changing'!$J:$J,0)))","v":""},{"$f":"IF(ISERROR(MATCH($A46,'[1]Step 1-What is changing'!$J:$J,0)),\"\",INDEX('Étape 1 – Ce qui change'!$S:$S,MATCH($A46,'[1]Step 1-What is changing'!$J:$J,0)))","v":""},{"$f":"IF(ISERROR(MATCH($A46,'[1]Step 1-What is changing'!$J:$J,0)),\"\",INDEX('Étape 1 – Ce qui change'!$T:$T,MATCH($A46,'[1]Step 1-What is changing'!$J:$J,0)))","v":""},{"$f":"IF(ISERROR(MATCH($A46,'[1]Step 1-What is changing'!$J:$J,0)),\"\",INDEX('Étape 1 – Ce qui change'!$U:$U,MATCH($A46,'[1]Step 1-What is changing'!$J:$J,0)))","v":""},{"$f":"IF(ISERROR(MATCH($A46,'[1]Step 1-What is changing'!$J:$J,0)),\"\",INDEX('Étape 1 – Ce qui change'!$V:$V,MATCH($A46,'[1]Step 1-What is changing'!$J:$J,0)))","v":""},{"$f":"IF(ISERROR(MATCH($A46,'[1]Step 1-What is changing'!$J:$J,0)),\"\",INDEX('Étape 1 – Ce qui change'!$W:$W,MATCH($A46,'[1]Step 1-What is changing'!$J:$J,0)))","v":""},{"$f":"IF(ISERROR(MATCH($A46,'[1]Step 1-What is changing'!$J:$J,0)),\"\",INDEX('Étape 1 – Ce qui change'!$X:$X,MATCH($A46,'[1]Step 1-What is changing'!$J:$J,0)))","v":""},{"$f":"IF(ISERROR(MATCH($A46,'[1]Step 1-What is changing'!$J:$J,0)),\"\",INDEX('Étape 1 – Ce qui change'!$Y:$Y,MATCH($A46,'[1]Step 1-What is changing'!$J:$J,0)))","v":""},{"$f":"IF(ISERROR(MATCH($A46,'[1]Step 1-What is changing'!$J:$J,0)),\"\",INDEX('Étape 1 – Ce qui change'!$Z:$Z,MATCH($A46,'[1]Step 1-What is changing'!$J:$J,0)))","v":""},{"$f":"IF(ISERROR(MATCH($A46,'[1]Step 1-What is changing'!$J:$J,0)),\"\",INDEX('Étape 1 – Ce qui change'!$AA:$AA,MATCH($A46,'[1]Step 1-What is changing'!$J:$J,0)))","v":""}]
[43,{"$f":"IF(ISERROR(MATCH($A47,'[1]Step 1-What is changing'!$J:$J,0)),\"\",INDEX('Étape 1 – Ce qui change'!$D:$D,MATCH($A47,'[1]Step 1-What is changing'!$J:$J,0))&\" - \"&INDEX('Étape 1 – Ce qui change'!$G:$G,MATCH($A47,'[1]Step 1-What is changing'!$J:$J,0)))","v":""},0,{"$error":"#DIV/0!"},"",{"$f":"IF(ISERROR(MATCH($A47,'[1]Step 1-What is changing'!$J:$J,0)),\"\",INDEX('Étape 1 – Ce qui change'!$I:$I,MATCH($A47,'[1]Step 1-What is changing'!$J:$J,0)))","v":""},{"$f":"IF(ISERROR(MATCH($A47,'[1]Step 1-What is changing'!$J:$J,0)),\"\",INDEX('Étape 1 – Ce qui change'!$J:$J,MATCH($A47,'[1]Step 1-What is changing'!$J:$J,0)))","v":""},"","","",{"$f":"IF(ISERROR(MATCH($A47,'[1]Step 1-What is changing'!$J:$J,0)),\"\",INDEX('Étape 1 – Ce qui change'!$N:$N,MATCH($A47,'[1]Step 1-What is changing'!$J:$J,0)))","v":""},{"$f":"IF(ISERROR(MATCH($A47,'[1]Step 1-What is changing'!$J:$J,0)),\"\",INDEX('Étape 1 – Ce qui change'!$O:$O,MATCH($A47,'[1]Step 1-What is changing'!$J:$J,0)))","v":""},{"$f":"IF(ISERROR(MATCH($A47,'[1]Step 1-What is changing'!$J:$J,0)),\"\",INDEX('Étape 1 – Ce qui change'!$P:$P,MATCH($A47,'[1]Step 1-What is changing'!$J:$J,0)))","v":""},{"$f":"IF(ISERROR(MATCH($A47,'[1]Step 1-What is changing'!$J:$J,0)),\"\",INDEX('Étape 1 – Ce qui change'!$Q:$Q,MATCH($A47,'[1]Step 1-What is changing'!$J:$J,0)))","v":""},{"$f":"IF(ISERROR(MATCH($A47,'[1]Step 1-What is changing'!$J:$J,0)),\"\",INDEX('Étape 1 – Ce qui change'!$R:$R,MATCH($A47,'[1]Step 1-What is changing'!$J:$J,0)))","v":""},{"$f":"IF(ISERROR(MATCH($A47,'[1]Step 1-What is changing'!$J:$J,0)),\"\",INDEX('Étape 1 – Ce qui change'!$S:$S,MATCH($A47,'[1]Step 1-What is changing'!$J:$J,0)))","v":""},{"$f":"IF(ISERROR(MATCH($A47,'[1]Step 1-What is changing'!$J:$J,0)),\"\",INDEX('Étape 1 – Ce qui change'!$T:$T,MATCH($A47,'[1]Step 1-What is changing'!$J:$J,0)))","v":""},{"$f":"IF(ISERROR(MATCH($A47,'[1]Step 1-What is changing'!$J:$J,0)),\"\",INDEX('Étape 1 – Ce qui change'!$U:$U,MATCH($A47,'[1]Step 1-What is changing'!$J:$J,0)))","v":""},{"$f":"IF(ISERROR(MATCH($A47,'[1]Step 1-What is changing'!$J:$J,0)),\"\",INDEX('Étape 1 – Ce qui change'!$V:$V,MATCH($A47,'[1]Step 1-What is changing'!$J:$J,0)))","v":""},{"$f":"IF(ISERROR(MATCH($A47,'[1]Step 1-What is changing'!$J:$J,0)),\"\",INDEX('Étape 1 – Ce qui change'!$W:$W,MATCH($A47,'[1]Step 1-What is changing'!$J:$J,0)))","v":""},{"$f":"IF(ISERROR(MATCH($A47,'[1]Step 1-What is changing'!$J:$J,0)),\"\",INDEX('Étape 1 – Ce qui change'!$X:$X,MATCH($A47,'[1]Step 1-What is changing'!$J:$J,0)))","v":""},{"$f":"IF(ISERROR(MATCH($A47,'[1]Step 1-What is changing'!$J:$J,0)),\"\",INDEX('Étape 1 – Ce qui change'!$Y:$Y,MATCH($A47,'[1]Step 1-What is changing'!$J:$J,0)))","v":""},{"$f":"IF(ISERROR(MATCH($A47,'[1]Step 1-What is changing'!$J:$J,0)),\"\",INDEX('Étape 1 – Ce qui change'!$Z:$Z,MATCH($A47,'[1]Step 1-What is changing'!$J:$J,0)))","v":""},{"$f":"IF(ISERROR(MATCH($A47,'[1]Step 1-What is changing'!$J:$J,0)),\"\",INDEX('Étape 1 – Ce qui change'!$AA:$AA,MATCH($A47,'[1]Step 1-What is changing'!$J:$J,0)))","v":""}]
[44,{"$f":"IF(ISERROR(MATCH($A48,'[1]Step 1-What is changing'!$J:$J,0)),\"\",INDEX('Étape 1 – Ce qui change'!$D:$D,MATCH($A48,'[1]Step 1-What is changing'!$J:$J,0))&\" - \"&INDEX('Étape 1 – Ce qui change'!$G:$G,MATCH($A48,'[1]Step 1-What is changing'!$J:$J,0)))","v":""},0,{"$error":"#DIV/0!"},"",{"$f":"IF(ISERROR(MATCH($A48,'[1]Step 1-What is changing'!$J:$J,0)),\"\",INDEX('Étape 1 – Ce qui change'!$I:$I,MATCH($A48,'[1]Step 1-What is changing'!$J:$J,0)))","v":""},{"$f":"IF(ISERROR(MATCH($A48,'[1]Step 1-What is changing'!$J:$J,0)),\"\",INDEX('Étape 1 – Ce qui change'!$J:$J,MATCH($A48,'[1]Step 1-What is changing'!$J:$J,0)))","v":""},"","","",{"$f":"IF(ISERROR(MATCH($A48,'[1]Step 1-What is changing'!$J:$J,0)),\"\",INDEX('Étape 1 – Ce qui change'!$N:$N,MATCH($A48,'[1]Step 1-What is changing'!$J:$J,0)))","v":""},{"$f":"IF(ISERROR(MATCH($A48,'[1]Step 1-What is changing'!$J:$J,0)),\"\",INDEX('Étape 1 – Ce qui change'!$O:$O,MATCH($A48,'[1]Step 1-What is changing'!$J:$J,0)))","v":""},{"$f":"IF(ISERROR(MATCH($A48,'[1]Step 1-What is changing'!$J:$J,0)),\"\",INDEX('Étape 1 – Ce qui change'!$P:$P,MATCH($A48,'[1]Step 1-What is changing'!$J:$J,0)))","v":""},{"$f":"IF(ISERROR(MATCH($A48,'[1]Step 1-What is changing'!$J:$J,0)),\"\",INDEX('Étape 1 – Ce qui change'!$Q:$Q,MATCH($A48,'[1]Step 1-What is changing'!$J:$J,0)))","v":""},{"$f":"IF(ISERROR(MATCH($A48,'[1]Step 1-What is changing'!$J:$J,0)),\"\",INDEX('Étape 1 – Ce qui change'!$R:$R,MATCH($A48,'[1]Step 1-What is changing'!$J:$J,0)))","v":""},{"$f":"IF(ISERROR(MATCH($A48,'[1]Step 1-What is changing'!$J:$J,0)),\"\",INDEX('Étape 1 – Ce qui change'!$S:$S,MATCH($A48,'[1]Step 1-What is changing'!$J:$J,0)))","v":""},{"$f":"IF(ISERROR(MATCH($A48,'[1]Step 1-What is changing'!$J:$J,0)),\"\",INDEX('Étape 1 – Ce qui change'!$T:$T,MATCH($A48,'[1]Step 1-What is changing'!$J:$J,0)))","v":""},{"$f":"IF(ISERROR(MATCH($A48,'[1]Step 1-What is changing'!$J:$J,0)),\"\",INDEX('Étape 1 – Ce qui change'!$U:$U,MATCH($A48,'[1]Step 1-What is changing'!$J:$J,0)))","v":""},{"$f":"IF(ISERROR(MATCH($A48,'[1]Step 1-What is changing'!$J:$J,0)),\"\",INDEX('Étape 1 – Ce qui change'!$V:$V,MATCH($A48,'[1]Step 1-What is changing'!$J:$J,0)))","v":""},{"$f":"IF(ISERROR(MATCH($A48,'[1]Step 1-What is changing'!$J:$J,0)),\"\",INDEX('Étape 1 – Ce qui change'!$W:$W,MATCH($A48,'[1]Step 1-What is changing'!$J:$J,0)))","v":""},{"$f":"IF(ISERROR(MATCH($A48,'[1]Step 1-What is changing'!$J:$J,0)),\"\",INDEX('Étape 1 – Ce qui change'!$X:$X,MATCH($A48,'[1]Step 1-What is changing'!$J:$J,0)))","v":""},{"$f":"IF(ISERROR(MATCH($A48,'[1]Step 1-What is changing'!$J:$J,0)),\"\",INDEX('Étape 1 – Ce qui change'!$Y:$Y,MATCH($A48,'[1]Step 1-What is changing'!$J:$J,0)))","v":""},{"$f":"IF(ISERROR(MATCH($A48,'[1]Step 1-What is changing'!$J:$J,0)),\"\",INDEX('Étape 1 – Ce qui change'!$Z:$Z,MATCH($A48,'[1]Step 1-What is changing'!$J:$J,0)))","v":""},{"$f":"IF(ISERROR(MATCH($A48,'[1]Step 1-What is changing'!$J:$J,0)),\"\",INDEX('Étape 1 – Ce qui change'!$AA:$AA,MATCH($A48,'[1]Step 1-What is changing'!$J:$J,0)))","v":""}]
[45,{"$f":"IF(ISERROR(MATCH($A49,'[1]Step 1-What is changing'!$J:$J,0)),\"\",INDEX('Étape 1 – Ce qui change'!$D:$D,MATCH($A49,'[1]Step 1-What is changing'!$J:$J,0))&\" - \"&INDEX('Étape 1 – Ce qui change'!$G:$G,MATCH($A49,'[1]Step 1-What is changing'!$J:$J,0)))","v":""},0,{"$error":"#DIV/0!"},"",{"$f":"IF(ISERROR(MATCH($A49,'[1]Step 1-What is changing'!$J:$J,0)),\"\",INDEX('Étape 1 – Ce qui change'!$I:$I,MATCH($A49,'[1]Step 1-What is changing'!$J:$J,0)))","v":""},{"$f":"IF(ISERROR(MATCH($A49,'[1]Step 1-What is changing'!$J:$J,0)),\"\",INDEX('Étape 1 – Ce qui change'!$J:$J,MATCH($A49,'[1]Step 1-What is changing'!$J:$J,0)))","v":""},"","","",{"$f":"IF(ISERROR(MATCH($A49,'[1]Step 1-What is changing'!$J:$J,0)),\"\",INDEX('Étape 1 – Ce qui change'!$N:$N,MATCH($A49,'[1]Step 1-What is changing'!$J:$J,0)))","v":""},{"$f":"IF(ISERROR(MATCH($A49,'[1]Step 1-What is changing'!$J:$J,0)),\"\",INDEX('Étape 1 – Ce qui change'!$O:$O,MATCH($A49,'[1]Step 1-What is changing'!$J:$J,0)))","v":""},{"$f":"IF(ISERROR(MATCH($A49,'[1]Step 1-What is changing'!$J:$J,0)),\"\",INDEX('Étape 1 – Ce qui change'!$P:$P,MATCH($A49,'[1]Step 1-What is changing'!$J:$J,0)))","v":""},{"$f":"IF(ISERROR(MATCH($A49,'[1]Step 1-What is changing'!$J:$J,0)),\"\",INDEX('Étape 1 – Ce qui change'!$Q:$Q,MATCH($A49,'[1]Step 1-What is changing'!$J:$J,0)))","v":""},{"$f":"IF(ISERROR(MATCH($A49,'[1]Step 1-What is changing'!$J:$J,0)),\"\",INDEX('Étape 1 – Ce qui change'!$R:$R,MATCH($A49,'[1]Step 1-What is changing'!$J:$J,0)))","v":""},{"$f":"IF(ISERROR(MATCH($A49,'[1]Step 1-What is changing'!$J:$J,0)),\"\",INDEX('Étape 1 – Ce qui change'!$S:$S,MATCH($A49,'[1]Step 1-What is changing'!$J:$J,0)))","v":""},{"$f":"IF(ISERROR(MATCH($A49,'[1]Step 1-What is changing'!$J:$J,0)),\"\",INDEX('Étape 1 – Ce qui change'!$T:$T,MATCH($A49,'[1]Step 1-What is changing'!$J:$J,0)))","v":""},{"$f":"IF(ISERROR(MATCH($A49,'[1]Step 1-What is changing'!$J:$J,0)),\"\",INDEX('Étape 1 – Ce qui change'!$U:$U,MATCH($A49,'[1]Step 1-What is changing'!$J:$J,0)))","v":""},{"$f":"IF(ISERROR(MATCH($A49,'[1]Step 1-What is changing'!$J:$J,0)),\"\",INDEX('Étape 1 – Ce qui change'!$V:$V,MATCH($A49,'[1]Step 1-What is changing'!$J:$J,0)))","v":""},{"$f":"IF(ISERROR(MATCH($A49,'[1]Step 1-What is changing'!$J:$J,0)),\"\",INDEX('Étape 1 – Ce qui change'!$W:$W,MATCH($A49,'[1]Step 1-What is changing'!$J:$J,0)))","v":""},{"$f":"IF(ISERROR(MATCH($A49,'[1]Step 1-What is changing'!$J:$J,0)),\"\",INDEX('Étape 1 – Ce qui change'!$X:$X,MATCH($A49,'[1]Step 1-What is changing'!$J:$J,0)))","v":""},{"$f":"IF(ISERROR(MATCH($A49,'[1]Step 1-What is changing'!$J:$J,0)),\"\",INDEX('Étape 1 – Ce qui change'!$Y:$Y,MATCH($A49,'[1]Step 1-What is changing'!$J:$J,0)))","v":""},{"$f":"IF(ISERROR(MATCH($A49,'[1]Step 1-What is changing'!$J:$J,0)),\"\",INDEX('Étape 1 – Ce qui change'!$Z:$Z,MATCH($A49,'[1]Step 1-What is changing'!$J:$J,0)))","v":""},{"$f":"IF(ISERROR(MATCH($A49,'[1]Step 1-What is changing'!$J:$J,0)),\"\",INDEX('Étape 1 – Ce qui change'!$AA:$AA,MATCH($A49,'[1]Step 1-What is changing'!$J:$J,0)))","v":""}]
[46,{"$f":"IF(ISERROR(MATCH($A50,'[1]Step 1-What is changing'!$J:$J,0)),\"\",INDEX('Étape 1 – Ce qui change'!$D:$D,MATCH($A50,'[1]Step 1-What is changing'!$J:$J,0))&\" - \"&INDEX('Étape 1 – Ce qui change'!$G:$G,MATCH($A50,'[1]Step 1-What is changing'!$J:$J,0)))","v":""},0,{"$error":"#DIV/0!"},"",{"$f":"IF(ISERROR(MATCH($A50,'[1]Step 1-What is changing'!$J:$J,0)),\"\",INDEX('Étape 1 – Ce qui change'!$I:$I,MATCH($A50,'[1]Step 1-What is changing'!$J:$J,0)))","v":""},{"$f":"IF(ISERROR(MATCH($A50,'[1]Step 1-What is changing'!$J:$J,0)),\"\",INDEX('Étape 1 – Ce qui change'!$J:$J,MATCH($A50,'[1]Step 1-What is changing'!$J:$J,0)))","v":""},"","","",{"$f":"IF(ISERROR(MATCH($A50,'[1]Step 1-What is changing'!$J:$J,0)),\"\",INDEX('Étape 1 – Ce qui change'!$N:$N,MATCH($A50,'[1]Step 1-What is changing'!$J:$J,0)))","v":""},{"$f":"IF(ISERROR(MATCH($A50,'[1]Step 1-What is changing'!$J:$J,0)),\"\",INDEX('Étape 1 – Ce qui change'!$O:$O,MATCH($A50,'[1]Step 1-What is changing'!$J:$J,0)))","v":""},{"$f":"IF(ISERROR(MATCH($A50,'[1]Step 1-What is changing'!$J:$J,0)),\"\",INDEX('Étape 1 – Ce qui change'!$P:$P,MATCH($A50,'[1]Step 1-What is changing'!$J:$J,0)))","v":""},{"$f":"IF(ISERROR(MATCH($A50,'[1]Step 1-What is changing'!$J:$J,0)),\"\",INDEX('Étape 1 – Ce qui change'!$Q:$Q,MATCH($A50,'[1]Step 1-What is changing'!$J:$J,0)))","v":""},{"$f":"IF(ISERROR(MATCH($A50,'[1]Step 1-What is changing'!$J:$J,0)),\"\",INDEX('Étape 1 – Ce qui change'!$R:$R,MATCH($A50,'[1]Step 1-What is changing'!$J:$J,0)))","v":""},{"$f":"IF(ISERROR(MATCH($A50,'[1]Step 1-What is changing'!$J:$J,0)),\"\",INDEX('Étape 1 – Ce qui change'!$S:$S,MATCH($A50,'[1]Step 1-What is changing'!$J:$J,0)))","v":""},{"$f":"IF(ISERROR(MATCH($A50,'[1]Step 1-What is changing'!$J:$J,0)),\"\",INDEX('Étape 1 – Ce qui change'!$T:$T,MATCH($A50,'[1]Step 1-What is changing'!$J:$J,0)))","v":""},{"$f":"IF(ISERROR(MATCH($A50,'[1]Step 1-What is changing'!$J:$J,0)),\"\",INDEX('Étape 1 – Ce qui change'!$U:$U,MATCH($A50,'[1]Step 1-What is changing'!$J:$J,0)))","v":""},{"$f":"IF(ISERROR(MATCH($A50,'[1]Step 1-What is changing'!$J:$J,0)),\"\",INDEX('Étape 1 – Ce qui change'!$V:$V,MATCH($A50,'[1]Step 1-What is changing'!$J:$J,0)))","v":""},{"$f":"IF(ISERROR(MATCH($A50,'[1]Step 1-What is changing'!$J:$J,0)),\"\",INDEX('Étape 1 – Ce qui change'!$W:$W,MATCH($A50,'[1]Step 1-What is changing'!$J:$J,0)))","v":""},{"$f":"IF(ISERROR(MATCH($A50,'[1]Step 1-What is changing'!$J:$J,0)),\"\",INDEX('Étape 1 – Ce qui change'!$X:$X,MATCH($A50,'[1]Step 1-What is changing'!$J:$J,0)))","v":""},{"$f":"IF(ISERROR(MATCH($A50,'[1]Step 1-What is changing'!$J:$J,0)),\"\",INDEX('Étape 1 – Ce qui change'!$Y:$Y,MATCH($A50,'[1]Step 1-What is changing'!$J:$J,0)))","v":""},{"$f":"IF(ISERROR(MATCH($A50,'[1]Step 1-What is changing'!$J:$J,0)),\"\",INDEX('Étape 1 – Ce qui change'!$Z:$Z,MATCH($A50,'[1]Step 1-What is changing'!$J:$J,0)))","v":""},{"$f":"IF(ISERROR(MATCH($A50,'[1]Step 1-What is changing'!$J:$J,0)),\"\",INDEX('Étape 1 – Ce qui change'!$AA:$AA,MATCH($A50,'[1]Step 1-What is changing'!$J:$J,0)))","v":""}]
[47,{"$f":"IF(ISERROR(MATCH($A51,'[1]Step 1-What is changing'!$J:$J,0)),\"\",INDEX('Étape 1 – Ce qui change'!$D:$D,MATCH($A51,'[1]Step 1-What is changing'!$J:$J,0))&\" - \"&INDEX('Étape 1 – Ce qui change'!$G:$G,MATCH($A51,'[1]Step 1-What is changing'!$J:$J,0)))","v":""},0,{"$error":"#DIV/0!"},"",{"$f":"IF(ISERROR(MATCH($A51,'[1]Step 1-What is changing'!$J:$J,0)),\"\",INDEX('Étape 1 – Ce qui change'!$I:$I,MATCH($A51,'[1]Step 1-What is changing'!$J:$J,0)))","v":""},{"$f":"IF(ISERROR(MATCH($A51,'[1]Step 1-What is changing'!$J:$J,0)),\"\",INDEX('Étape 1 – Ce qui change'!$J:$J,MATCH($A51,'[1]Step 1-What is changing'!$J:$J,0)))","v":""},"","","",{"$f":"IF(ISERROR(MATCH($A51,'[1]Step 1-What is changing'!$J:$J,0)),\"\",INDEX('Étape 1 – Ce qui change'!$N:$N,MATCH($A51,'[1]Step 1-What is changing'!$J:$J,0)))","v":""},{"$f":"IF(ISERROR(MATCH($A51,'[1]Step 1-What is changing'!$J:$J,0)),\"\",INDEX('Étape 1 – Ce qui change'!$O:$O,MATCH($A51,'[1]Step 1-What is changing'!$J:$J,0)))","v":""},{"$f":"IF(ISERROR(MATCH($A51,'[1]Step 1-What is changing'!$J:$J,0)),\"\",INDEX('Étape 1 – Ce qui change'!$P:$P,MATCH($A51,'[1]Step 1-What is changing'!$J:$J,0)))","v":""},{"$f":"IF(ISERROR(MATCH($A51,'[1]Step 1-What is changing'!$J:$J,0)),\"\",INDEX('Étape 1 – Ce qui change'!$Q:$Q,MATCH($A51,'[1]Step 1-What is changing'!$J:$J,0)))","v":""},{"$f":"IF(ISERROR(MATCH($A51,'[1]Step 1-What is changing'!$J:$J,0)),\"\",INDEX('Étape 1 – Ce qui change'!$R:$R,MATCH($A51,'[1]Step 1-What is changing'!$J:$J,0)))","v":""},{"$f":"IF(ISERROR(MATCH($A51,'[1]Step 1-What is changing'!$J:$J,0)),\"\",INDEX('Étape 1 – Ce qui change'!$S:$S,MATCH($A51,'[1]Step 1-What is changing'!$J:$J,0)))","v":""},{"$f":"IF(ISERROR(MATCH($A51,'[1]Step 1-What is changing'!$J:$J,0)),\"\",INDEX('Étape 1 – Ce qui change'!$T:$T,MATCH($A51,'[1]Step 1-What is changing'!$J:$J,0)))","v":""},{"$f":"IF(ISERROR(MATCH($A51,'[1]Step 1-What is changing'!$J:$J,0)),\"\",INDEX('Étape 1 – Ce qui change'!$U:$U,MATCH($A51,'[1]Step 1-What is changing'!$J:$J,0)))","v":""},{"$f":"IF(ISERROR(MATCH($A51,'[1]Step 1-What is changing'!$J:$J,0)),\"\",INDEX('Étape 1 – Ce qui change'!$V:$V,MATCH($A51,'[1]Step 1-What is changing'!$J:$J,0)))","v":""},{"$f":"IF(ISERROR(MATCH($A51,'[1]Step 1-What is changing'!$J:$J,0)),\"\",INDEX('Étape 1 – Ce qui change'!$W:$W,MATCH($A51,'[1]Step 1-What is changing'!$J:$J,0)))","v":""},{"$f":"IF(ISERROR(MATCH($A51,'[1]Step 1-What is changing'!$J:$J,0)),\"\",INDEX('Étape 1 – Ce qui change'!$X:$X,MATCH($A51,'[1]Step 1-What is changing'!$J:$J,0)))","v":""},{"$f":"IF(ISERROR(MATCH($A51,'[1]Step 1-What is changing'!$J:$J,0)),\"\",INDEX('Étape 1 – Ce qui change'!$Y:$Y,MATCH($A51,'[1]Step 1-What is changing'!$J:$J,0)))","v":""},{"$f":"IF(ISERROR(MATCH($A51,'[1]Step 1-What is changing'!$J:$J,0)),\"\",INDEX('Étape 1 – Ce qui change'!$Z:$Z,MATCH($A51,'[1]Step 1-What is changing'!$J:$J,0)))","v":""},{"$f":"IF(ISERROR(MATCH($A51,'[1]Step 1-What is changing'!$J:$J,0)),\"\",INDEX('Étape 1 – Ce qui change'!$AA:$AA,MATCH($A51,'[1]Step 1-What is changing'!$J:$J,0)))","v":""}]
[48,{"$f":"IF(ISERROR(MATCH($A52,'[1]Step 1-What is changing'!$J:$J,0)),\"\",INDEX('Étape 1 – Ce qui change'!$D:$D,MATCH($A52,'[1]Step 1-What is changing'!$J:$J,0))&\" - \"&INDEX('Étape 1 – Ce qui change'!$G:$G,MATCH($A52,'[1]Step 1-What is changing'!$J:$J,0)))","v":""},0,{"$error":"#DIV/0!"},"",{"$f":"IF(ISERROR(MATCH($A52,'[1]Step 1-What is changing'!$J:$J,0)),\"\",INDEX('Étape 1 – Ce qui change'!$I:$I,MATCH($A52,'[1]Step 1-What is changing'!$J:$J,0)))","v":""},{"$f":"IF(ISERROR(MATCH($A52,'[1]Step 1-What is changing'!$J:$J,0)),\"\",INDEX('Étape 1 – Ce qui change'!$J:$J,MATCH($A52,'[1]Step 1-What is changing'!$J:$J,0)))","v":""},"","","",{"$f":"IF(ISERROR(MATCH($A52,'[1]Step 1-What is changing'!$J:$J,0)),\"\",INDEX('Étape 1 – Ce qui change'!$N:$N,MATCH($A52,'[1]Step 1-What is changing'!$J:$J,0)))","v":""},{"$f":"IF(ISERROR(MATCH($A52,'[1]Step 1-What is changing'!$J:$J,0)),\"\",INDEX('Étape 1 – Ce qui change'!$O:$O,MATCH($A52,'[1]Step 1-What is changing'!$J:$J,0)))","v":""},{"$f":"IF(ISERROR(MATCH($A52,'[1]Step 1-What is changing'!$J:$J,0)),\"\",INDEX('Étape 1 – Ce qui change'!$P:$P,MATCH($A52,'[1]Step 1-What is changing'!$J:$J,0)))","v":""},{"$f":"IF(ISERROR(MATCH($A52,'[1]Step 1-What is changing'!$J:$J,0)),\"\",INDEX('Étape 1 – Ce qui change'!$Q:$Q,MATCH($A52,'[1]Step 1-What is changing'!$J:$J,0)))","v":""},{"$f":"IF(ISERROR(MATCH($A52,'[1]Step 1-What is changing'!$J:$J,0)),\"\",INDEX('Étape 1 – Ce qui change'!$R:$R,MATCH($A52,'[1]Step 1-What is changing'!$J:$J,0)))","v":""},{"$f":"IF(ISERROR(MATCH($A52,'[1]Step 1-What is changing'!$J:$J,0)),\"\",INDEX('Étape 1 – Ce qui change'!$S:$S,MATCH($A52,'[1]Step 1-What is changing'!$J:$J,0)))","v":""},{"$f":"IF(ISERROR(MATCH($A52,'[1]Step 1-What is changing'!$J:$J,0)),\"\",INDEX('Étape 1 – Ce qui change'!$T:$T,MATCH($A52,'[1]Step 1-What is changing'!$J:$J,0)))","v":""},{"$f":"IF(ISERROR(MATCH($A52,'[1]Step 1-What is changing'!$J:$J,0)),\"\",INDEX('Étape 1 – Ce qui change'!$U:$U,MATCH($A52,'[1]Step 1-What is changing'!$J:$J,0)))","v":""},{"$f":"IF(ISERROR(MATCH($A52,'[1]Step 1-What is changing'!$J:$J,0)),\"\",INDEX('Étape 1 – Ce qui change'!$V:$V,MATCH($A52,'[1]Step 1-What is changing'!$J:$J,0)))","v":""},{"$f":"IF(ISERROR(MATCH($A52,'[1]Step 1-What is changing'!$J:$J,0)),\"\",INDEX('Étape 1 – Ce qui change'!$W:$W,MATCH($A52,'[1]Step 1-What is changing'!$J:$J,0)))","v":""},{"$f":"IF(ISERROR(MATCH($A52,'[1]Step 1-What is changing'!$J:$J,0)),\"\",INDEX('Étape 1 – Ce qui change'!$X:$X,MATCH($A52,'[1]Step 1-What is changing'!$J:$J,0)))","v":""},{"$f":"IF(ISERROR(MATCH($A52,'[1]Step 1-What is changing'!$J:$J,0)),\"\",INDEX('Étape 1 – Ce qui change'!$Y:$Y,MATCH($A52,'[1]Step 1-What is changing'!$J:$J,0)))","v":""},{"$f":"IF(ISERROR(MATCH($A52,'[1]Step 1-What is changing'!$J:$J,0)),\"\",INDEX('Étape 1 – Ce qui change'!$Z:$Z,MATCH($A52,'[1]Step 1-What is changing'!$J:$J,0)))","v":""},{"$f":"IF(ISERROR(MATCH($A52,'[1]Step 1-What is changing'!$J:$J,0)),\"\",INDEX('Étape 1 – Ce qui change'!$AA:$AA,MATCH($A52,'[1]Step 1-What is changing'!$J:$J,0)))","v":""}]
[49,{"$f":"IF(ISERROR(MATCH($A53,'[1]Step 1-What is changing'!$J:$J,0)),\"\",INDEX('Étape 1 – Ce qui change'!$D:$D,MATCH($A53,'[1]Step 1-What is changing'!$J:$J,0))&\" - \"&INDEX('Étape 1 – Ce qui change'!$G:$G,MATCH($A53,'[1]Step 1-What is changing'!$J:$J,0)))","v":""},0,{"$error":"#DIV/0!"},"",{"$f":"IF(ISERROR(MATCH($A53,'[1]Step 1-What is changing'!$J:$J,0)),\"\",INDEX('Étape 1 – Ce qui change'!$I:$I,MATCH($A53,'[1]Step 1-What is changing'!$J:$J,0)))","v":""},{"$f":"IF(ISERROR(MATCH($A53,'[1]Step 1-What is changing'!$J:$J,0)),\"\",INDEX('Étape 1 – Ce qui change'!$J:$J,MATCH($A53,'[1]Step 1-What is changing'!$J:$J,0)))","v":""},"","","",{"$f":"IF(ISERROR(MATCH($A53,'[1]Step 1-What is changing'!$J:$J,0)),\"\",INDEX('Étape 1 – Ce qui change'!$N:$N,MATCH($A53,'[1]Step 1-What is changing'!$J:$J,0)))","v":""},{"$f":"IF(ISERROR(MATCH($A53,'[1]Step 1-What is changing'!$J:$J,0)),\"\",INDEX('Étape 1 – Ce qui change'!$O:$O,MATCH($A53,'[1]Step 1-What is changing'!$J:$J,0)))","v":""},{"$f":"IF(ISERROR(MATCH($A53,'[1]Step 1-What is changing'!$J:$J,0)),\"\",INDEX('Étape 1 – Ce qui change'!$P:$P,MATCH($A53,'[1]Step 1-What is changing'!$J:$J,0)))","v":""},{"$f":"IF(ISERROR(MATCH($A53,'[1]Step 1-What is changing'!$J:$J,0)),\"\",INDEX('Étape 1 – Ce qui change'!$Q:$Q,MATCH($A53,'[1]Step 1-What is changing'!$J:$J,0)))","v":""},{"$f":"IF(ISERROR(MATCH($A53,'[1]Step 1-What is changing'!$J:$J,0)),\"\",INDEX('Étape 1 – Ce qui change'!$R:$R,MATCH($A53,'[1]Step 1-What is changing'!$J:$J,0)))","v":""},{"$f":"IF(ISERROR(MATCH($A53,'[1]Step 1-What is changing'!$J:$J,0)),\"\",INDEX('Étape 1 – Ce qui change'!$S:$S,MATCH($A53,'[1]Step 1-What is changing'!$J:$J,0)))","v":""},{"$f":"IF(ISERROR(MATCH($A53,'[1]Step 1-What is changing'!$J:$J,0)),\"\",INDEX('Étape 1 – Ce qui change'!$T:$T,MATCH($A53,'[1]Step 1-What is changing'!$J:$J,0)))","v":""},{"$f":"IF(ISERROR(MATCH($A53,'[1]Step 1-What is changing'!$J:$J,0)),\"\",INDEX('Étape 1 – Ce qui change'!$U:$U,MATCH($A53,'[1]Step 1-What is changing'!$J:$J,0)))","v":""},{"$f":"IF(ISERROR(MATCH($A53,'[1]Step 1-What is changing'!$J:$J,0)),\"\",INDEX('Étape 1 – Ce qui change'!$V:$V,MATCH($A53,'[1]Step 1-What is changing'!$J:$J,0)))","v":""},{"$f":"IF(ISERROR(MATCH($A53,'[1]Step 1-What is changing'!$J:$J,0)),\"\",INDEX('Étape 1 – Ce qui change'!$W:$W,MATCH($A53,'[1]Step 1-What is changing'!$J:$J,0)))","v":""},{"$f":"IF(ISERROR(MATCH($A53,'[1]Step 1-What is changing'!$J:$J,0)),\"\",INDEX('Étape 1 – Ce qui change'!$X:$X,MATCH($A53,'[1]Step 1-What is changing'!$J:$J,0)))","v":""},{"$f":"IF(ISERROR(MATCH($A53,'[1]Step 1-What is changing'!$J:$J,0)),\"\",INDEX('Étape 1 – Ce qui change'!$Y:$Y,MATCH($A53,'[1]Step 1-What is changing'!$J:$J,0)))","v":""},{"$f":"IF(ISERROR(MATCH($A53,'[1]Step 1-What is changing'!$J:$J,0)),\"\",INDEX('Étape 1 – Ce qui change'!$Z:$Z,MATCH($A53,'[1]Step 1-What is changing'!$J:$J,0)))","v":""},{"$f":"IF(ISERROR(MATCH($A53,'[1]Step 1-What is changing'!$J:$J,0)),\"\",INDEX('Étape 1 – Ce qui change'!$AA:$AA,MATCH($A53,'[1]Step 1-What is changing'!$J:$J,0)))","v":""}]
[50,{"$f":"IF(ISERROR(MATCH($A54,'[1]Step 1-What is changing'!$J:$J,0)),\"\",INDEX('Étape 1 – Ce qui change'!$D:$D,MATCH($A54,'[1]Step 1-What is changing'!$J:$J,0))&\" - \"&INDEX('Étape 1 – Ce qui change'!$G:$G,MATCH($A54,'[1]Step 1-What is changing'!$J:$J,0)))","v":""},0,{"$error":"#DIV/0!"},"",{"$f":"IF(ISERROR(MATCH($A54,'[1]Step 1-What is changing'!$J:$J,0)),\"\",INDEX('Étape 1 – Ce qui change'!$I:$I,MATCH($A54,'[1]Step 1-What is changing'!$J:$J,0)))","v":""},{"$f":"IF(ISERROR(MATCH($A54,'[1]Step 1-What is changing'!$J:$J,0)),\"\",INDEX('Étape 1 – Ce qui change'!$J:$J,MATCH($A54,'[1]Step 1-What is changing'!$J:$J,0)))","v":""},"","","",{"$f":"IF(ISERROR(MATCH($A54,'[1]Step 1-What is changing'!$J:$J,0)),\"\",INDEX('Étape 1 – Ce qui change'!$N:$N,MATCH($A54,'[1]Step 1-What is changing'!$J:$J,0)))","v":""},{"$f":"IF(ISERROR(MATCH($A54,'[1]Step 1-What is changing'!$J:$J,0)),\"\",INDEX('Étape 1 – Ce qui change'!$O:$O,MATCH($A54,'[1]Step 1-What is changing'!$J:$J,0)))","v":""},{"$f":"IF(ISERROR(MATCH($A54,'[1]Step 1-What is changing'!$J:$J,0)),\"\",INDEX('Étape 1 – Ce qui change'!$P:$P,MATCH($A54,'[1]Step 1-What is changing'!$J:$J,0)))","v":""},{"$f":"IF(ISERROR(MATCH($A54,'[1]Step 1-What is changing'!$J:$J,0)),\"\",INDEX('Étape 1 – Ce qui change'!$Q:$Q,MATCH($A54,'[1]Step 1-What is changing'!$J:$J,0)))","v":""},{"$f":"IF(ISERROR(MATCH($A54,'[1]Step 1-What is changing'!$J:$J,0)),\"\",INDEX('Étape 1 – Ce qui change'!$R:$R,MATCH($A54,'[1]Step 1-What is changing'!$J:$J,0)))","v":""},{"$f":"IF(ISERROR(MATCH($A54,'[1]Step 1-What is changing'!$J:$J,0)),\"\",INDEX('Étape 1 – Ce qui change'!$S:$S,MATCH($A54,'[1]Step 1-What is changing'!$J:$J,0)))","v":""},{"$f":"IF(ISERROR(MATCH($A54,'[1]Step 1-What is changing'!$J:$J,0)),\"\",INDEX('Étape 1 – Ce qui change'!$T:$T,MATCH($A54,'[1]Step 1-What is changing'!$J:$J,0)))","v":""},{"$f":"IF(ISERROR(MATCH($A54,'[1]Step 1-What is changing'!$J:$J,0)),\"\",INDEX('Étape 1 – Ce qui change'!$U:$U,MATCH($A54,'[1]Step 1-What is changing'!$J:$J,0)))","v":""},{"$f":"IF(ISERROR(MATCH($A54,'[1]Step 1-What is changing'!$J:$J,0)),\"\",INDEX('Étape 1 – Ce qui change'!$V:$V,MATCH($A54,'[1]Step 1-What is changing'!$J:$J,0)))","v":""},{"$f":"IF(ISERROR(MATCH($A54,'[1]Step 1-What is changing'!$J:$J,0)),\"\",INDEX('Étape 1 – Ce qui change'!$W:$W,MATCH($A54,'[1]Step 1-What is changing'!$J:$J,0)))","v":""},{"$f":"IF(ISERROR(MATCH($A54,'[1]Step 1-What is changing'!$J:$J,0)),\"\",INDEX('Étape 1 – Ce qui change'!$X:$X,MATCH($A54,'[1]Step 1-What is changing'!$J:$J,0)))","v":""},{"$f":"IF(ISERROR(MATCH($A54,'[1]Step 1-What is changing'!$J:$J,0)),\"\",INDEX('Étape 1 – Ce qui change'!$Y:$Y,MATCH($A54,'[1]Step 1-What is changing'!$J:$J,0)))","v":""},{"$f":"IF(ISERROR(MATCH($A54,'[1]Step 1-What is changing'!$J:$J,0)),\"\",INDEX('Étape 1 – Ce qui change'!$Z:$Z,MATCH($A54,'[1]Step 1-What is changing'!$J:$J,0)))","v":""},{"$f":"IF(ISERROR(MATCH($A54,'[1]Step 1-What is changing'!$J:$J,0)),\"\",INDEX('Étape 1 – Ce qui change'!$AA:$AA,MATCH($A54,'[1]Step 1-What is changing'!$J:$J,0)))","v":""}]
[51,{"$f":"IF(ISERROR(MATCH($A55,'[1]Step 1-What is changing'!$J:$J,0)),\"\",INDEX('Étape 1 – Ce qui change'!$D:$D,MATCH($A55,'[1]Step 1-What is changing'!$J:$J,0))&\" - \"&INDEX('Étape 1 – Ce qui change'!$G:$G,MATCH($A55,'[1]Step 1-What is changing'!$J:$J,0)))","v":""},0,{"$error":"#DIV/0!"},"",{"$f":"IF(ISERROR(MATCH($A55,'[1]Step 1-What is changing'!$J:$J,0)),\"\",INDEX('Étape 1 – Ce qui change'!$I:$I,MATCH($A55,'[1]Step 1-What is changing'!$J:$J,0)))","v":""},{"$f":"IF(ISERROR(MATCH($A55,'[1]Step 1-What is changing'!$J:$J,0)),\"\",INDEX('Étape 1 – Ce qui change'!$J:$J,MATCH($A55,'[1]Step 1-What is changing'!$J:$J,0)))","v":""},"","","",{"$f":"IF(ISERROR(MATCH($A55,'[1]Step 1-What is changing'!$J:$J,0)),\"\",INDEX('Étape 1 – Ce qui change'!$N:$N,MATCH($A55,'[1]Step 1-What is changing'!$J:$J,0)))","v":""},{"$f":"IF(ISERROR(MATCH($A55,'[1]Step 1-What is changing'!$J:$J,0)),\"\",INDEX('Étape 1 – Ce qui change'!$O:$O,MATCH($A55,'[1]Step 1-What is changing'!$J:$J,0)))","v":""},{"$f":"IF(ISERROR(MATCH($A55,'[1]Step 1-What is changing'!$J:$J,0)),\"\",INDEX('Étape 1 – Ce qui change'!$P:$P,MATCH($A55,'[1]Step 1-What is changing'!$J:$J,0)))","v":""},{"$f":"IF(ISERROR(MATCH($A55,'[1]Step 1-What is changing'!$J:$J,0)),\"\",INDEX('Étape 1 – Ce qui change'!$Q:$Q,MATCH($A55,'[1]Step 1-What is changing'!$J:$J,0)))","v":""},{"$f":"IF(ISERROR(MATCH($A55,'[1]Step 1-What is changing'!$J:$J,0)),\"\",INDEX('Étape 1 – Ce qui change'!$R:$R,MATCH($A55,'[1]Step 1-What is changing'!$J:$J,0)))","v":""},{"$f":"IF(ISERROR(MATCH($A55,'[1]Step 1-What is changing'!$J:$J,0)),\"\",INDEX('Étape 1 – Ce qui change'!$S:$S,MATCH($A55,'[1]Step 1-What is changing'!$J:$J,0)))","v":""},{"$f":"IF(ISERROR(MATCH($A55,'[1]Step 1-What is changing'!$J:$J,0)),\"\",INDEX('Étape 1 – Ce qui change'!$T:$T,MATCH($A55,'[1]Step 1-What is changing'!$J:$J,0)))","v":""},{"$f":"IF(ISERROR(MATCH($A55,'[1]Step 1-What is changing'!$J:$J,0)),\"\",INDEX('Étape 1 – Ce qui change'!$U:$U,MATCH($A55,'[1]Step 1-What is changing'!$J:$J,0)))","v":""},{"$f":"IF(ISERROR(MATCH($A55,'[1]Step 1-What is changing'!$J:$J,0)),\"\",INDEX('Étape 1 – Ce qui change'!$V:$V,MATCH($A55,'[1]Step 1-What is changing'!$J:$J,0)))","v":""},{"$f":"IF(ISERROR(MATCH($A55,'[1]Step 1-What is changing'!$J:$J,0)),\"\",INDEX('Étape 1 – Ce qui change'!$W:$W,MATCH($A55,'[1]Step 1-What is changing'!$J:$J,0)))","v":""},{"$f":"IF(ISERROR(MATCH($A55,'[1]Step 1-What is changing'!$J:$J,0)),\"\",INDEX('Étape 1 – Ce qui change'!$X:$X,MATCH($A55,'[1]Step 1-What is changing'!$J:$J,0)))","v":""},{"$f":"IF(ISERROR(MATCH($A55,'[1]Step 1-What is changing'!$J:$J,0)),\"\",INDEX('Étape 1 – Ce qui change'!$Y:$Y,MATCH($A55,'[1]Step 1-What is changing'!$J:$J,0)))","v":""},{"$f":"IF(ISERROR(MATCH($A55,'[1]Step 1-What is changing'!$J:$J,0)),\"\",INDEX('Étape 1 – Ce qui change'!$Z:$Z,MATCH($A55,'[1]Step 1-What is changing'!$J:$J,0)))","v":""},{"$f":"IF(ISERROR(MATCH($A55,'[1]Step 1-What is changing'!$J:$J,0)),\"\",INDEX('Étape 1 – Ce qui change'!$AA:$AA,MATCH($A55,'[1]Step 1-What is changing'!$J:$J,0)))","v":""}]
[52,{"$f":"IF(ISERROR(MATCH($A56,'[1]Step 1-What is changing'!$J:$J,0)),\"\",INDEX('Étape 1 – Ce qui change'!$D:$D,MATCH($A56,'[1]Step 1-What is changing'!$J:$J,0))&\" - \"&INDEX('Étape 1 – Ce qui change'!$G:$G,MATCH($A56,'[1]Step 1-What is changing'!$J:$J,0)))","v":""},0,{"$error":"#DIV/0!"},"",{"$f":"IF(ISERROR(MATCH($A56,'[1]Step 1-What is changing'!$J:$J,0)),\"\",INDEX('Étape 1 – Ce qui change'!$I:$I,MATCH($A56,'[1]Step 1-What is changing'!$J:$J,0)))","v":""},{"$f":"IF(ISERROR(MATCH($A56,'[1]Step 1-What is changing'!$J:$J,0)),\"\",INDEX('Étape 1 – Ce qui change'!$J:$J,MATCH($A56,'[1]Step 1-What is changing'!$J:$J,0)))","v":""},"","","",{"$f":"IF(ISERROR(MATCH($A56,'[1]Step 1-What is changing'!$J:$J,0)),\"\",INDEX('Étape 1 – Ce qui change'!$N:$N,MATCH($A56,'[1]Step 1-What is changing'!$J:$J,0)))","v":""},{"$f":"IF(ISERROR(MATCH($A56,'[1]Step 1-What is changing'!$J:$J,0)),\"\",INDEX('Étape 1 – Ce qui change'!$O:$O,MATCH($A56,'[1]Step 1-What is changing'!$J:$J,0)))","v":""},{"$f":"IF(ISERROR(MATCH($A56,'[1]Step 1-What is changing'!$J:$J,0)),\"\",INDEX('Étape 1 – Ce qui change'!$P:$P,MATCH($A56,'[1]Step 1-What is changing'!$J:$J,0)))","v":""},{"$f":"IF(ISERROR(MATCH($A56,'[1]Step 1-What is changing'!$J:$J,0)),\"\",INDEX('Étape 1 – Ce qui change'!$Q:$Q,MATCH($A56,'[1]Step 1-What is changing'!$J:$J,0)))","v":""},{"$f":"IF(ISERROR(MATCH($A56,'[1]Step 1-What is changing'!$J:$J,0)),\"\",INDEX('Étape 1 – Ce qui change'!$R:$R,MATCH($A56,'[1]Step 1-What is changing'!$J:$J,0)))","v":""},{"$f":"IF(ISERROR(MATCH($A56,'[1]Step 1-What is changing'!$J:$J,0)),\"\",INDEX('Étape 1 – Ce qui change'!$S:$S,MATCH($A56,'[1]Step 1-What is changing'!$J:$J,0)))","v":""},{"$f":"IF(ISERROR(MATCH($A56,'[1]Step 1-What is changing'!$J:$J,0)),\"\",INDEX('Étape 1 – Ce qui change'!$T:$T,MATCH($A56,'[1]Step 1-What is changing'!$J:$J,0)))","v":""},{"$f":"IF(ISERROR(MATCH($A56,'[1]Step 1-What is changing'!$J:$J,0)),\"\",INDEX('Étape 1 – Ce qui change'!$U:$U,MATCH($A56,'[1]Step 1-What is changing'!$J:$J,0)))","v":""},{"$f":"IF(ISERROR(MATCH($A56,'[1]Step 1-What is changing'!$J:$J,0)),\"\",INDEX('Étape 1 – Ce qui change'!$V:$V,MATCH($A56,'[1]Step 1-What is changing'!$J:$J,0)))","v":""},{"$f":"IF(ISERROR(MATCH($A56,'[1]Step 1-What is changing'!$J:$J,0)),\"\",INDEX('Étape 1 – Ce qui change'!$W:$W,MATCH($A56,'[1]Step 1-What is changing'!$J:$J,0)))","v":""},{"$f":"IF(ISERROR(MATCH($A56,'[1]Step 1-What is changing'!$J:$J,0)),\"\",INDEX('Étape 1 – Ce qui change'!$X:$X,MATCH($A56,'[1]Step 1-What is changing'!$J:$J,0)))","v":""},{"$f":"IF(ISERROR(MATCH($A56,'[1]Step 1-What is changing'!$J:$J,0)),\"\",INDEX('Étape 1 – Ce qui change'!$Y:$Y,MATCH($A56,'[1]Step 1-What is changing'!$J:$J,0)))","v":""},{"$f":"IF(ISERROR(MATCH($A56,'[1]Step 1-What is changing'!$J:$J,0)),\"\",INDEX('Étape 1 – Ce qui change'!$Z:$Z,MATCH($A56,'[1]Step 1-What is changing'!$J:$J,0)))","v":""},{"$f":"IF(ISERROR(MATCH($A56,'[1]Step 1-What is changing'!$J:$J,0)),\"\",INDEX('Étape 1 – Ce qui change'!$AA:$AA,MATCH($A56,'[1]Step 1-What is changing'!$J:$J,0)))","v":""}]
[53,{"$f":"IF(ISERROR(MATCH($A57,'[1]Step 1-What is changing'!$J:$J,0)),\"\",INDEX('Étape 1 – Ce qui change'!$D:$D,MATCH($A57,'[1]Step 1-What is changing'!$J:$J,0))&\" - \"&INDEX('Étape 1 – Ce qui change'!$G:$G,MATCH($A57,'[1]Step 1-What is changing'!$J:$J,0)))","v":""},0,{"$error":"#DIV/0!"},"",{"$f":"IF(ISERROR(MATCH($A57,'[1]Step 1-What is changing'!$J:$J,0)),\"\",INDEX('Étape 1 – Ce qui change'!$I:$I,MATCH($A57,'[1]Step 1-What is changing'!$J:$J,0)))","v":""},{"$f":"IF(ISERROR(MATCH($A57,'[1]Step 1-What is changing'!$J:$J,0)),\"\",INDEX('Étape 1 – Ce qui change'!$J:$J,MATCH($A57,'[1]Step 1-What is changing'!$J:$J,0)))","v":""},"","","",{"$f":"IF(ISERROR(MATCH($A57,'[1]Step 1-What is changing'!$J:$J,0)),\"\",INDEX('Étape 1 – Ce qui change'!$N:$N,MATCH($A57,'[1]Step 1-What is changing'!$J:$J,0)))","v":""},{"$f":"IF(ISERROR(MATCH($A57,'[1]Step 1-What is changing'!$J:$J,0)),\"\",INDEX('Étape 1 – Ce qui change'!$O:$O,MATCH($A57,'[1]Step 1-What is changing'!$J:$J,0)))","v":""},{"$f":"IF(ISERROR(MATCH($A57,'[1]Step 1-What is changing'!$J:$J,0)),\"\",INDEX('Étape 1 – Ce qui change'!$P:$P,MATCH($A57,'[1]Step 1-What is changing'!$J:$J,0)))","v":""},{"$f":"IF(ISERROR(MATCH($A57,'[1]Step 1-What is changing'!$J:$J,0)),\"\",INDEX('Étape 1 – Ce qui change'!$Q:$Q,MATCH($A57,'[1]Step 1-What is changing'!$J:$J,0)))","v":""},{"$f":"IF(ISERROR(MATCH($A57,'[1]Step 1-What is changing'!$J:$J,0)),\"\",INDEX('Étape 1 – Ce qui change'!$R:$R,MATCH($A57,'[1]Step 1-What is changing'!$J:$J,0)))","v":""},{"$f":"IF(ISERROR(MATCH($A57,'[1]Step 1-What is changing'!$J:$J,0)),\"\",INDEX('Étape 1 – Ce qui change'!$S:$S,MATCH($A57,'[1]Step 1-What is changing'!$J:$J,0)))","v":""},{"$f":"IF(ISERROR(MATCH($A57,'[1]Step 1-What is changing'!$J:$J,0)),\"\",INDEX('Étape 1 – Ce qui change'!$T:$T,MATCH($A57,'[1]Step 1-What is changing'!$J:$J,0)))","v":""},{"$f":"IF(ISERROR(MATCH($A57,'[1]Step 1-What is changing'!$J:$J,0)),\"\",INDEX('Étape 1 – Ce qui change'!$U:$U,MATCH($A57,'[1]Step 1-What is changing'!$J:$J,0)))","v":""},{"$f":"IF(ISERROR(MATCH($A57,'[1]Step 1-What is changing'!$J:$J,0)),\"\",INDEX('Étape 1 – Ce qui change'!$V:$V,MATCH($A57,'[1]Step 1-What is changing'!$J:$J,0)))","v":""},{"$f":"IF(ISERROR(MATCH($A57,'[1]Step 1-What is changing'!$J:$J,0)),\"\",INDEX('Étape 1 – Ce qui change'!$W:$W,MATCH($A57,'[1]Step 1-What is changing'!$J:$J,0)))","v":""},{"$f":"IF(ISERROR(MATCH($A57,'[1]Step 1-What is changing'!$J:$J,0)),\"\",INDEX('Étape 1 – Ce qui change'!$X:$X,MATCH($A57,'[1]Step 1-What is changing'!$J:$J,0)))","v":""},{"$f":"IF(ISERROR(MATCH($A57,'[1]Step 1-What is changing'!$J:$J,0)),\"\",INDEX('Étape 1 – Ce qui change'!$Y:$Y,MATCH($A57,'[1]Step 1-What is changing'!$J:$J,0)))","v":""},{"$f":"IF(ISERROR(MATCH($A57,'[1]Step 1-What is changing'!$J:$J,0)),\"\",INDEX('Étape 1 – Ce qui change'!$Z:$Z,MATCH($A57,'[1]Step 1-What is changing'!$J:$J,0)))","v":""},{"$f":"IF(ISERROR(MATCH($A57,'[1]Step 1-What is changing'!$J:$J,0)),\"\",INDEX('Étape 1 – Ce qui change'!$AA:$AA,MATCH($A57,'[1]Step 1-What is changing'!$J:$J,0)))","v":""}]
[54,{"$f":"IF(ISERROR(MATCH($A58,'[1]Step 1-What is changing'!$J:$J,0)),\"\",INDEX('Étape 1 – Ce qui change'!$D:$D,MATCH($A58,'[1]Step 1-What is changing'!$J:$J,0))&\" - \"&INDEX('Étape 1 – Ce qui change'!$G:$G,MATCH($A58,'[1]Step 1-What is changing'!$J:$J,0)))","v":""},0,{"$error":"#DIV/0!"},"",{"$f":"IF(ISERROR(MATCH($A58,'[1]Step 1-What is changing'!$J:$J,0)),\"\",INDEX('Étape 1 – Ce qui change'!$I:$I,MATCH($A58,'[1]Step 1-What is changing'!$J:$J,0)))","v":""},{"$f":"IF(ISERROR(MATCH($A58,'[1]Step 1-What is changing'!$J:$J,0)),\"\",INDEX('Étape 1 – Ce qui change'!$J:$J,MATCH($A58,'[1]Step 1-What is changing'!$J:$J,0)))","v":""},"","","",{"$f":"IF(ISERROR(MATCH($A58,'[1]Step 1-What is changing'!$J:$J,0)),\"\",INDEX('Étape 1 – Ce qui change'!$N:$N,MATCH($A58,'[1]Step 1-What is changing'!$J:$J,0)))","v":""},{"$f":"IF(ISERROR(MATCH($A58,'[1]Step 1-What is changing'!$J:$J,0)),\"\",INDEX('Étape 1 – Ce qui change'!$O:$O,MATCH($A58,'[1]Step 1-What is changing'!$J:$J,0)))","v":""},{"$f":"IF(ISERROR(MATCH($A58,'[1]Step 1-What is changing'!$J:$J,0)),\"\",INDEX('Étape 1 – Ce qui change'!$P:$P,MATCH($A58,'[1]Step 1-What is changing'!$J:$J,0)))","v":""},{"$f":"IF(ISERROR(MATCH($A58,'[1]Step 1-What is changing'!$J:$J,0)),\"\",INDEX('Étape 1 – Ce qui change'!$Q:$Q,MATCH($A58,'[1]Step 1-What is changing'!$J:$J,0)))","v":""},{"$f":"IF(ISERROR(MATCH($A58,'[1]Step 1-What is changing'!$J:$J,0)),\"\",INDEX('Étape 1 – Ce qui change'!$R:$R,MATCH($A58,'[1]Step 1-What is changing'!$J:$J,0)))","v":""},{"$f":"IF(ISERROR(MATCH($A58,'[1]Step 1-What is changing'!$J:$J,0)),\"\",INDEX('Étape 1 – Ce qui change'!$S:$S,MATCH($A58,'[1]Step 1-What is changing'!$J:$J,0)))","v":""},{"$f":"IF(ISERROR(MATCH($A58,'[1]Step 1-What is changing'!$J:$J,0)),\"\",INDEX('Étape 1 – Ce qui change'!$T:$T,MATCH($A58,'[1]Step 1-What is changing'!$J:$J,0)))","v":""},{"$f":"IF(ISERROR(MATCH($A58,'[1]Step 1-What is changing'!$J:$J,0)),\"\",INDEX('Étape 1 – Ce qui change'!$U:$U,MATCH($A58,'[1]Step 1-What is changing'!$J:$J,0)))","v":""},{"$f":"IF(ISERROR(MATCH($A58,'[1]Step 1-What is changing'!$J:$J,0)),\"\",INDEX('Étape 1 – Ce qui change'!$V:$V,MATCH($A58,'[1]Step 1-What is changing'!$J:$J,0)))","v":""},{"$f":"IF(ISERROR(MATCH($A58,'[1]Step 1-What is changing'!$J:$J,0)),\"\",INDEX('Étape 1 – Ce qui change'!$W:$W,MATCH($A58,'[1]Step 1-What is changing'!$J:$J,0)))","v":""},{"$f":"IF(ISERROR(MATCH($A58,'[1]Step 1-What is changing'!$J:$J,0)),\"\",INDEX('Étape 1 – Ce qui change'!$X:$X,MATCH($A58,'[1]Step 1-What is changing'!$J:$J,0)))","v":""},{"$f":"IF(ISERROR(MATCH($A58,'[1]Step 1-What is changing'!$J:$J,0)),\"\",INDEX('Étape 1 – Ce qui change'!$Y:$Y,MATCH($A58,'[1]Step 1-What is changing'!$J:$J,0)))","v":""},{"$f":"IF(ISERROR(MATCH($A58,'[1]Step 1-What is changing'!$J:$J,0)),\"\",INDEX('Étape 1 – Ce qui change'!$Z:$Z,MATCH($A58,'[1]Step 1-What is changing'!$J:$J,0)))","v":""},{"$f":"IF(ISERROR(MATCH($A58,'[1]Step 1-What is changing'!$J:$J,0)),\"\",INDEX('Étape 1 – Ce qui change'!$AA:$AA,MATCH($A58,'[1]Step 1-What is changing'!$J:$J,0)))","v":""}]
[55,{"$f":"IF(ISERROR(MATCH($A59,'[1]Step 1-What is changing'!$J:$J,0)),\"\",INDEX('Étape 1 – Ce qui change'!$D:$D,MATCH($A59,'[1]Step 1-What is changing'!$J:$J,0))&\" - \"&INDEX('Étape 1 – Ce qui change'!$G:$G,MATCH($A59,'[1]Step 1-What is changing'!$J:$J,0)))","v":""},0,{"$error":"#DIV/0!"},"",{"$f":"IF(ISERROR(MATCH($A59,'[1]Step 1-What is changing'!$J:$J,0)),\"\",INDEX('Étape 1 – Ce qui change'!$I:$I,MATCH($A59,'[1]Step 1-What is changing'!$J:$J,0)))","v":""},{"$f":"IF(ISERROR(MATCH($A59,'[1]Step 1-What is changing'!$J:$J,0)),\"\",INDEX('Étape 1 – Ce qui change'!$J:$J,MATCH($A59,'[1]Step 1-What is changing'!$J:$J,0)))","v":""},"","","",{"$f":"IF(ISERROR(MATCH($A59,'[1]Step 1-What is changing'!$J:$J,0)),\"\",INDEX('Étape 1 – Ce qui change'!$N:$N,MATCH($A59,'[1]Step 1-What is changing'!$J:$J,0)))","v":""},{"$f":"IF(ISERROR(MATCH($A59,'[1]Step 1-What is changing'!$J:$J,0)),\"\",INDEX('Étape 1 – Ce qui change'!$O:$O,MATCH($A59,'[1]Step 1-What is changing'!$J:$J,0)))","v":""},{"$f":"IF(ISERROR(MATCH($A59,'[1]Step 1-What is changing'!$J:$J,0)),\"\",INDEX('Étape 1 – Ce qui change'!$P:$P,MATCH($A59,'[1]Step 1-What is changing'!$J:$J,0)))","v":""},{"$f":"IF(ISERROR(MATCH($A59,'[1]Step 1-What is changing'!$J:$J,0)),\"\",INDEX('Étape 1 – Ce qui change'!$Q:$Q,MATCH($A59,'[1]Step 1-What is changing'!$J:$J,0)))","v":""},{"$f":"IF(ISERROR(MATCH($A59,'[1]Step 1-What is changing'!$J:$J,0)),\"\",INDEX('Étape 1 – Ce qui change'!$R:$R,MATCH($A59,'[1]Step 1-What is changing'!$J:$J,0)))","v":""},{"$f":"IF(ISERROR(MATCH($A59,'[1]Step 1-What is changing'!$J:$J,0)),\"\",INDEX('Étape 1 – Ce qui change'!$S:$S,MATCH($A59,'[1]Step 1-What is changing'!$J:$J,0)))","v":""},{"$f":"IF(ISERROR(MATCH($A59,'[1]Step 1-What is changing'!$J:$J,0)),\"\",INDEX('Étape 1 – Ce qui change'!$T:$T,MATCH($A59,'[1]Step 1-What is changing'!$J:$J,0)))","v":""},{"$f":"IF(ISERROR(MATCH($A59,'[1]Step 1-What is changing'!$J:$J,0)),\"\",INDEX('Étape 1 – Ce qui change'!$U:$U,MATCH($A59,'[1]Step 1-What is changing'!$J:$J,0)))","v":""},{"$f":"IF(ISERROR(MATCH($A59,'[1]Step 1-What is changing'!$J:$J,0)),\"\",INDEX('Étape 1 – Ce qui change'!$V:$V,MATCH($A59,'[1]Step 1-What is changing'!$J:$J,0)))","v":""},{"$f":"IF(ISERROR(MATCH($A59,'[1]Step 1-What is changing'!$J:$J,0)),\"\",INDEX('Étape 1 – Ce qui change'!$W:$W,MATCH($A59,'[1]Step 1-What is changing'!$J:$J,0)))","v":""},{"$f":"IF(ISERROR(MATCH($A59,'[1]Step 1-What is changing'!$J:$J,0)),\"\",INDEX('Étape 1 – Ce qui change'!$X:$X,MATCH($A59,'[1]Step 1-What is changing'!$J:$J,0)))","v":""},{"$f":"IF(ISERROR(MATCH($A59,'[1]Step 1-What is changing'!$J:$J,0)),\"\",INDEX('Étape 1 – Ce qui change'!$Y:$Y,MATCH($A59,'[1]Step 1-What is changing'!$J:$J,0)))","v":""},{"$f":"IF(ISERROR(MATCH($A59,'[1]Step 1-What is changing'!$J:$J,0)),\"\",INDEX('Étape 1 – Ce qui change'!$Z:$Z,MATCH($A59,'[1]Step 1-What is changing'!$J:$J,0)))","v":""},{"$f":"IF(ISERROR(MATCH($A59,'[1]Step 1-What is changing'!$J:$J,0)),\"\",INDEX('Étape 1 – Ce qui change'!$AA:$AA,MATCH($A59,'[1]Step 1-What is changing'!$J:$J,0)))","v":""}]
[56,{"$f":"IF(ISERROR(MATCH($A60,'[1]Step 1-What is changing'!$J:$J,0)),\"\",INDEX('Étape 1 – Ce qui change'!$D:$D,MATCH($A60,'[1]Step 1-What is changing'!$J:$J,0))&\" - \"&INDEX('Étape 1 – Ce qui change'!$G:$G,MATCH($A60,'[1]Step 1-What is changing'!$J:$J,0)))","v":""},0,{"$error":"#DIV/0!"},"",{"$f":"IF(ISERROR(MATCH($A60,'[1]Step 1-What is changing'!$J:$J,0)),\"\",INDEX('Étape 1 – Ce qui change'!$I:$I,MATCH($A60,'[1]Step 1-What is changing'!$J:$J,0)))","v":""},{"$f":"IF(ISERROR(MATCH($A60,'[1]Step 1-What is changing'!$J:$J,0)),\"\",INDEX('Étape 1 – Ce qui change'!$J:$J,MATCH($A60,'[1]Step 1-What is changing'!$J:$J,0)))","v":""},"","","",{"$f":"IF(ISERROR(MATCH($A60,'[1]Step 1-What is changing'!$J:$J,0)),\"\",INDEX('Étape 1 – Ce qui change'!$N:$N,MATCH($A60,'[1]Step 1-What is changing'!$J:$J,0)))","v":""},{"$f":"IF(ISERROR(MATCH($A60,'[1]Step 1-What is changing'!$J:$J,0)),\"\",INDEX('Étape 1 – Ce qui change'!$O:$O,MATCH($A60,'[1]Step 1-What is changing'!$J:$J,0)))","v":""},{"$f":"IF(ISERROR(MATCH($A60,'[1]Step 1-What is changing'!$J:$J,0)),\"\",INDEX('Étape 1 – Ce qui change'!$P:$P,MATCH($A60,'[1]Step 1-What is changing'!$J:$J,0)))","v":""},{"$f":"IF(ISERROR(MATCH($A60,'[1]Step 1-What is changing'!$J:$J,0)),\"\",INDEX('Étape 1 – Ce qui change'!$Q:$Q,MATCH($A60,'[1]Step 1-What is changing'!$J:$J,0)))","v":""},{"$f":"IF(ISERROR(MATCH($A60,'[1]Step 1-What is changing'!$J:$J,0)),\"\",INDEX('Étape 1 – Ce qui change'!$R:$R,MATCH($A60,'[1]Step 1-What is changing'!$J:$J,0)))","v":""},{"$f":"IF(ISERROR(MATCH($A60,'[1]Step 1-What is changing'!$J:$J,0)),\"\",INDEX('Étape 1 – Ce qui change'!$S:$S,MATCH($A60,'[1]Step 1-What is changing'!$J:$J,0)))","v":""},{"$f":"IF(ISERROR(MATCH($A60,'[1]Step 1-What is changing'!$J:$J,0)),\"\",INDEX('Étape 1 – Ce qui change'!$T:$T,MATCH($A60,'[1]Step 1-What is changing'!$J:$J,0)))","v":""},{"$f":"IF(ISERROR(MATCH($A60,'[1]Step 1-What is changing'!$J:$J,0)),\"\",INDEX('Étape 1 – Ce qui change'!$U:$U,MATCH($A60,'[1]Step 1-What is changing'!$J:$J,0)))","v":""},{"$f":"IF(ISERROR(MATCH($A60,'[1]Step 1-What is changing'!$J:$J,0)),\"\",INDEX('Étape 1 – Ce qui change'!$V:$V,MATCH($A60,'[1]Step 1-What is changing'!$J:$J,0)))","v":""},{"$f":"IF(ISERROR(MATCH($A60,'[1]Step 1-What is changing'!$J:$J,0)),\"\",INDEX('Étape 1 – Ce qui change'!$W:$W,MATCH($A60,'[1]Step 1-What is changing'!$J:$J,0)))","v":""},{"$f":"IF(ISERROR(MATCH($A60,'[1]Step 1-What is changing'!$J:$J,0)),\"\",INDEX('Étape 1 – Ce qui change'!$X:$X,MATCH($A60,'[1]Step 1-What is changing'!$J:$J,0)))","v":""},{"$f":"IF(ISERROR(MATCH($A60,'[1]Step 1-What is changing'!$J:$J,0)),\"\",INDEX('Étape 1 – Ce qui change'!$Y:$Y,MATCH($A60,'[1]Step 1-What is changing'!$J:$J,0)))","v":""},{"$f":"IF(ISERROR(MATCH($A60,'[1]Step 1-What is changing'!$J:$J,0)),\"\",INDEX('Étape 1 – Ce qui change'!$Z:$Z,MATCH($A60,'[1]Step 1-What is changing'!$J:$J,0)))","v":""},{"$f":"IF(ISERROR(MATCH($A60,'[1]Step 1-What is changing'!$J:$J,0)),\"\",INDEX('Étape 1 – Ce qui change'!$AA:$AA,MATCH($A60,'[1]Step 1-What is changing'!$J:$J,0)))","v":""}]
[57,{"$f":"IF(ISERROR(MATCH($A61,'[1]Step 1-What is changing'!$J:$J,0)),\"\",INDEX('Étape 1 – Ce qui change'!$D:$D,MATCH($A61,'[1]Step 1-What is changing'!$J:$J,0))&\" - \"&INDEX('Étape 1 – Ce qui change'!$G:$G,MATCH($A61,'[1]Step 1-What is changing'!$J:$J,0)))","v":""},0,{"$error":"#DIV/0!"},"",{"$f":"IF(ISERROR(MATCH($A61,'[1]Step 1-What is changing'!$J:$J,0)),\"\",INDEX('Étape 1 – Ce qui change'!$I:$I,MATCH($A61,'[1]Step 1-What is changing'!$J:$J,0)))","v":""},{"$f":"IF(ISERROR(MATCH($A61,'[1]Step 1-What is changing'!$J:$J,0)),\"\",INDEX('Étape 1 – Ce qui change'!$J:$J,MATCH($A61,'[1]Step 1-What is changing'!$J:$J,0)))","v":""},"","","",{"$f":"IF(ISERROR(MATCH($A61,'[1]Step 1-What is changing'!$J:$J,0)),\"\",INDEX('Étape 1 – Ce qui change'!$N:$N,MATCH($A61,'[1]Step 1-What is changing'!$J:$J,0)))","v":""},{"$f":"IF(ISERROR(MATCH($A61,'[1]Step 1-What is changing'!$J:$J,0)),\"\",INDEX('Étape 1 – Ce qui change'!$O:$O,MATCH($A61,'[1]Step 1-What is changing'!$J:$J,0)))","v":""},{"$f":"IF(ISERROR(MATCH($A61,'[1]Step 1-What is changing'!$J:$J,0)),\"\",INDEX('Étape 1 – Ce qui change'!$P:$P,MATCH($A61,'[1]Step 1-What is changing'!$J:$J,0)))","v":""},{"$f":"IF(ISERROR(MATCH($A61,'[1]Step 1-What is changing'!$J:$J,0)),\"\",INDEX('Étape 1 – Ce qui change'!$Q:$Q,MATCH($A61,'[1]Step 1-What is changing'!$J:$J,0)))","v":""},{"$f":"IF(ISERROR(MATCH($A61,'[1]Step 1-What is changing'!$J:$J,0)),\"\",INDEX('Étape 1 – Ce qui change'!$R:$R,MATCH($A61,'[1]Step 1-What is changing'!$J:$J,0)))","v":""},{"$f":"IF(ISERROR(MATCH($A61,'[1]Step 1-What is changing'!$J:$J,0)),\"\",INDEX('Étape 1 – Ce qui change'!$S:$S,MATCH($A61,'[1]Step 1-What is changing'!$J:$J,0)))","v":""},{"$f":"IF(ISERROR(MATCH($A61,'[1]Step 1-What is changing'!$J:$J,0)),\"\",INDEX('Étape 1 – Ce qui change'!$T:$T,MATCH($A61,'[1]Step 1-What is changing'!$J:$J,0)))","v":""},{"$f":"IF(ISERROR(MATCH($A61,'[1]Step 1-What is changing'!$J:$J,0)),\"\",INDEX('Étape 1 – Ce qui change'!$U:$U,MATCH($A61,'[1]Step 1-What is changing'!$J:$J,0)))","v":""},{"$f":"IF(ISERROR(MATCH($A61,'[1]Step 1-What is changing'!$J:$J,0)),\"\",INDEX('Étape 1 – Ce qui change'!$V:$V,MATCH($A61,'[1]Step 1-What is changing'!$J:$J,0)))","v":""},{"$f":"IF(ISERROR(MATCH($A61,'[1]Step 1-What is changing'!$J:$J,0)),\"\",INDEX('Étape 1 – Ce qui change'!$W:$W,MATCH($A61,'[1]Step 1-What is changing'!$J:$J,0)))","v":""},{"$f":"IF(ISERROR(MATCH($A61,'[1]Step 1-What is changing'!$J:$J,0)),\"\",INDEX('Étape 1 – Ce qui change'!$X:$X,MATCH($A61,'[1]Step 1-What is changing'!$J:$J,0)))","v":""},{"$f":"IF(ISERROR(MATCH($A61,'[1]Step 1-What is changing'!$J:$J,0)),\"\",INDEX('Étape 1 – Ce qui change'!$Y:$Y,MATCH($A61,'[1]Step 1-What is changing'!$J:$J,0)))","v":""},{"$f":"IF(ISERROR(MATCH($A61,'[1]Step 1-What is changing'!$J:$J,0)),\"\",INDEX('Étape 1 – Ce qui change'!$Z:$Z,MATCH($A61,'[1]Step 1-What is changing'!$J:$J,0)))","v":""},{"$f":"IF(ISERROR(MATCH($A61,'[1]Step 1-What is changing'!$J:$J,0)),\"\",INDEX('Étape 1 – Ce qui change'!$AA:$AA,MATCH($A61,'[1]Step 1-What is changing'!$J:$J,0)))","v":""}]
[58,{"$f":"IF(ISERROR(MATCH($A62,'[1]Step 1-What is changing'!$J:$J,0)),\"\",INDEX('Étape 1 – Ce qui change'!$D:$D,MATCH($A62,'[1]Step 1-What is changing'!$J:$J,0))&\" - \"&INDEX('Étape 1 – Ce qui change'!$G:$G,MATCH($A62,'[1]Step 1-What is changing'!$J:$J,0)))","v":""},0,{"$error":"#DIV/0!"},"",{"$f":"IF(ISERROR(MATCH($A62,'[1]Step 1-What is changing'!$J:$J,0)),\"\",INDEX('Étape 1 – Ce qui change'!$I:$I,MATCH($A62,'[1]Step 1-What is changing'!$J:$J,0)))","v":""},{"$f":"IF(ISERROR(MATCH($A62,'[1]Step 1-What is changing'!$J:$J,0)),\"\",INDEX('Étape 1 – Ce qui change'!$J:$J,MATCH($A62,'[1]Step 1-What is changing'!$J:$J,0)))","v":""},"","","",{"$f":"IF(ISERROR(MATCH($A62,'[1]Step 1-What is changing'!$J:$J,0)),\"\",INDEX('Étape 1 – Ce qui change'!$N:$N,MATCH($A62,'[1]Step 1-What is changing'!$J:$J,0)))","v":""},{"$f":"IF(ISERROR(MATCH($A62,'[1]Step 1-What is changing'!$J:$J,0)),\"\",INDEX('Étape 1 – Ce qui change'!$O:$O,MATCH($A62,'[1]Step 1-What is changing'!$J:$J,0)))","v":""},{"$f":"IF(ISERROR(MATCH($A62,'[1]Step 1-What is changing'!$J:$J,0)),\"\",INDEX('Étape 1 – Ce qui change'!$P:$P,MATCH($A62,'[1]Step 1-What is changing'!$J:$J,0)))","v":""},{"$f":"IF(ISERROR(MATCH($A62,'[1]Step 1-What is changing'!$J:$J,0)),\"\",INDEX('Étape 1 – Ce qui change'!$Q:$Q,MATCH($A62,'[1]Step 1-What is changing'!$J:$J,0)))","v":""},{"$f":"IF(ISERROR(MATCH($A62,'[1]Step 1-What is changing'!$J:$J,0)),\"\",INDEX('Étape 1 – Ce qui change'!$R:$R,MATCH($A62,'[1]Step 1-What is changing'!$J:$J,0)))","v":""},{"$f":"IF(ISERROR(MATCH($A62,'[1]Step 1-What is changing'!$J:$J,0)),\"\",INDEX('Étape 1 – Ce qui change'!$S:$S,MATCH($A62,'[1]Step 1-What is changing'!$J:$J,0)))","v":""},{"$f":"IF(ISERROR(MATCH($A62,'[1]Step 1-What is changing'!$J:$J,0)),\"\",INDEX('Étape 1 – Ce qui change'!$T:$T,MATCH($A62,'[1]Step 1-What is changing'!$J:$J,0)))","v":""},{"$f":"IF(ISERROR(MATCH($A62,'[1]Step 1-What is changing'!$J:$J,0)),\"\",INDEX('Étape 1 – Ce qui change'!$U:$U,MATCH($A62,'[1]Step 1-What is changing'!$J:$J,0)))","v":""},{"$f":"IF(ISERROR(MATCH($A62,'[1]Step 1-What is changing'!$J:$J,0)),\"\",INDEX('Étape 1 – Ce qui change'!$V:$V,MATCH($A62,'[1]Step 1-What is changing'!$J:$J,0)))","v":""},{"$f":"IF(ISERROR(MATCH($A62,'[1]Step 1-What is changing'!$J:$J,0)),\"\",INDEX('Étape 1 – Ce qui change'!$W:$W,MATCH($A62,'[1]Step 1-What is changing'!$J:$J,0)))","v":""},{"$f":"IF(ISERROR(MATCH($A62,'[1]Step 1-What is changing'!$J:$J,0)),\"\",INDEX('Étape 1 – Ce qui change'!$X:$X,MATCH($A62,'[1]Step 1-What is changing'!$J:$J,0)))","v":""},{"$f":"IF(ISERROR(MATCH($A62,'[1]Step 1-What is changing'!$J:$J,0)),\"\",INDEX('Étape 1 – Ce qui change'!$Y:$Y,MATCH($A62,'[1]Step 1-What is changing'!$J:$J,0)))","v":""},{"$f":"IF(ISERROR(MATCH($A62,'[1]Step 1-What is changing'!$J:$J,0)),\"\",INDEX('Étape 1 – Ce qui change'!$Z:$Z,MATCH($A62,'[1]Step 1-What is changing'!$J:$J,0)))","v":""},{"$f":"IF(ISERROR(MATCH($A62,'[1]Step 1-What is changing'!$J:$J,0)),\"\",INDEX('Étape 1 – Ce qui change'!$AA:$AA,MATCH($A62,'[1]Step 1-What is changing'!$J:$J,0)))","v":""}]
[59,{"$f":"IF(ISERROR(MATCH($A63,'[1]Step 1-What is changing'!$J:$J,0)),\"\",INDEX('Étape 1 – Ce qui change'!$D:$D,MATCH($A63,'[1]Step 1-What is changing'!$J:$J,0))&\" - \"&INDEX('Étape 1 – Ce qui change'!$G:$G,MATCH($A63,'[1]Step 1-What is changing'!$J:$J,0)))","v":""},0,{"$error":"#DIV/0!"},"",{"$f":"IF(ISERROR(MATCH($A63,'[1]Step 1-What is changing'!$J:$J,0)),\"\",INDEX('Étape 1 – Ce qui change'!$I:$I,MATCH($A63,'[1]Step 1-What is changing'!$J:$J,0)))","v":""},{"$f":"IF(ISERROR(MATCH($A63,'[1]Step 1-What is changing'!$J:$J,0)),\"\",INDEX('Étape 1 – Ce qui change'!$J:$J,MATCH($A63,'[1]Step 1-What is changing'!$J:$J,0)))","v":""},"","","",{"$f":"IF(ISERROR(MATCH($A63,'[1]Step 1-What is changing'!$J:$J,0)),\"\",INDEX('Étape 1 – Ce qui change'!$N:$N,MATCH($A63,'[1]Step 1-What is changing'!$J:$J,0)))","v":""},{"$f":"IF(ISERROR(MATCH($A63,'[1]Step 1-What is changing'!$J:$J,0)),\"\",INDEX('Étape 1 – Ce qui change'!$O:$O,MATCH($A63,'[1]Step 1-What is changing'!$J:$J,0)))","v":""},{"$f":"IF(ISERROR(MATCH($A63,'[1]Step 1-What is changing'!$J:$J,0)),\"\",INDEX('Étape 1 – Ce qui change'!$P:$P,MATCH($A63,'[1]Step 1-What is changing'!$J:$J,0)))","v":""},{"$f":"IF(ISERROR(MATCH($A63,'[1]Step 1-What is changing'!$J:$J,0)),\"\",INDEX('Étape 1 – Ce qui change'!$Q:$Q,MATCH($A63,'[1]Step 1-What is changing'!$J:$J,0)))","v":""},{"$f":"IF(ISERROR(MATCH($A63,'[1]Step 1-What is changing'!$J:$J,0)),\"\",INDEX('Étape 1 – Ce qui change'!$R:$R,MATCH($A63,'[1]Step 1-What is changing'!$J:$J,0)))","v":""},{"$f":"IF(ISERROR(MATCH($A63,'[1]Step 1-What is changing'!$J:$J,0)),\"\",INDEX('Étape 1 – Ce qui change'!$S:$S,MATCH($A63,'[1]Step 1-What is changing'!$J:$J,0)))","v":""},{"$f":"IF(ISERROR(MATCH($A63,'[1]Step 1-What is changing'!$J:$J,0)),\"\",INDEX('Étape 1 – Ce qui change'!$T:$T,MATCH($A63,'[1]Step 1-What is changing'!$J:$J,0)))","v":""},{"$f":"IF(ISERROR(MATCH($A63,'[1]Step 1-What is changing'!$J:$J,0)),\"\",INDEX('Étape 1 – Ce qui change'!$U:$U,MATCH($A63,'[1]Step 1-What is changing'!$J:$J,0)))","v":""},{"$f":"IF(ISERROR(MATCH($A63,'[1]Step 1-What is changing'!$J:$J,0)),\"\",INDEX('Étape 1 – Ce qui change'!$V:$V,MATCH($A63,'[1]Step 1-What is changing'!$J:$J,0)))","v":""},{"$f":"IF(ISERROR(MATCH($A63,'[1]Step 1-What is changing'!$J:$J,0)),\"\",INDEX('Étape 1 – Ce qui change'!$W:$W,MATCH($A63,'[1]Step 1-What is changing'!$J:$J,0)))","v":""},{"$f":"IF(ISERROR(MATCH($A63,'[1]Step 1-What is changing'!$J:$J,0)),\"\",INDEX('Étape 1 – Ce qui change'!$X:$X,MATCH($A63,'[1]Step 1-What is changing'!$J:$J,0)))","v":""},{"$f":"IF(ISERROR(MATCH($A63,'[1]Step 1-What is changing'!$J:$J,0)),\"\",INDEX('Étape 1 – Ce qui change'!$Y:$Y,MATCH($A63,'[1]Step 1-What is changing'!$J:$J,0)))","v":""},{"$f":"IF(ISERROR(MATCH($A63,'[1]Step 1-What is changing'!$J:$J,0)),\"\",INDEX('Étape 1 – Ce qui change'!$Z:$Z,MATCH($A63,'[1]Step 1-What is changing'!$J:$J,0)))","v":""},{"$f":"IF(ISERROR(MATCH($A63,'[1]Step 1-What is changing'!$J:$J,0)),\"\",INDEX('Étape 1 – Ce qui change'!$AA:$AA,MATCH($A63,'[1]Step 1-What is changing'!$J:$J,0)))","v":""}]
[60,{"$f":"IF(ISERROR(MATCH($A64,'[1]Step 1-What is changing'!$J:$J,0)),\"\",INDEX('Étape 1 – Ce qui change'!$D:$D,MATCH($A64,'[1]Step 1-What is changing'!$J:$J,0))&\" - \"&INDEX('Étape 1 – Ce qui change'!$G:$G,MATCH($A64,'[1]Step 1-What is changing'!$J:$J,0)))","v":""},0,{"$error":"#DIV/0!"},"",{"$f":"IF(ISERROR(MATCH($A64,'[1]Step 1-What is changing'!$J:$J,0)),\"\",INDEX('Étape 1 – Ce qui change'!$I:$I,MATCH($A64,'[1]Step 1-What is changing'!$J:$J,0)))","v":""},{"$f":"IF(ISERROR(MATCH($A64,'[1]Step 1-What is changing'!$J:$J,0)),\"\",INDEX('Étape 1 – Ce qui change'!$J:$J,MATCH($A64,'[1]Step 1-What is changing'!$J:$J,0)))","v":""},"","","",{"$f":"IF(ISERROR(MATCH($A64,'[1]Step 1-What is changing'!$J:$J,0)),\"\",INDEX('Étape 1 – Ce qui change'!$N:$N,MATCH($A64,'[1]Step 1-What is changing'!$J:$J,0)))","v":""},{"$f":"IF(ISERROR(MATCH($A64,'[1]Step 1-What is changing'!$J:$J,0)),\"\",INDEX('Étape 1 – Ce qui change'!$O:$O,MATCH($A64,'[1]Step 1-What is changing'!$J:$J,0)))","v":""},{"$f":"IF(ISERROR(MATCH($A64,'[1]Step 1-What is changing'!$J:$J,0)),\"\",INDEX('Étape 1 – Ce qui change'!$P:$P,MATCH($A64,'[1]Step 1-What is changing'!$J:$J,0)))","v":""},{"$f":"IF(ISERROR(MATCH($A64,'[1]Step 1-What is changing'!$J:$J,0)),\"\",INDEX('Étape 1 – Ce qui change'!$Q:$Q,MATCH($A64,'[1]Step 1-What is changing'!$J:$J,0)))","v":""},{"$f":"IF(ISERROR(MATCH($A64,'[1]Step 1-What is changing'!$J:$J,0)),\"\",INDEX('Étape 1 – Ce qui change'!$R:$R,MATCH($A64,'[1]Step 1-What is changing'!$J:$J,0)))","v":""},{"$f":"IF(ISERROR(MATCH($A64,'[1]Step 1-What is changing'!$J:$J,0)),\"\",INDEX('Étape 1 – Ce qui change'!$S:$S,MATCH($A64,'[1]Step 1-What is changing'!$J:$J,0)))","v":""},{"$f":"IF(ISERROR(MATCH($A64,'[1]Step 1-What is changing'!$J:$J,0)),\"\",INDEX('Étape 1 – Ce qui change'!$T:$T,MATCH($A64,'[1]Step 1-What is changing'!$J:$J,0)))","v":""},{"$f":"IF(ISERROR(MATCH($A64,'[1]Step 1-What is changing'!$J:$J,0)),\"\",INDEX('Étape 1 – Ce qui change'!$U:$U,MATCH($A64,'[1]Step 1-What is changing'!$J:$J,0)))","v":""},{"$f":"IF(ISERROR(MATCH($A64,'[1]Step 1-What is changing'!$J:$J,0)),\"\",INDEX('Étape 1 – Ce qui change'!$V:$V,MATCH($A64,'[1]Step 1-What is changing'!$J:$J,0)))","v":""},{"$f":"IF(ISERROR(MATCH($A64,'[1]Step 1-What is changing'!$J:$J,0)),\"\",INDEX('Étape 1 – Ce qui change'!$W:$W,MATCH($A64,'[1]Step 1-What is changing'!$J:$J,0)))","v":""},{"$f":"IF(ISERROR(MATCH($A64,'[1]Step 1-What is changing'!$J:$J,0)),\"\",INDEX('Étape 1 – Ce qui change'!$X:$X,MATCH($A64,'[1]Step 1-What is changing'!$J:$J,0)))","v":""},{"$f":"IF(ISERROR(MATCH($A64,'[1]Step 1-What is changing'!$J:$J,0)),\"\",INDEX('Étape 1 – Ce qui change'!$Y:$Y,MATCH($A64,'[1]Step 1-What is changing'!$J:$J,0)))","v":""},{"$f":"IF(ISERROR(MATCH($A64,'[1]Step 1-What is changing'!$J:$J,0)),\"\",INDEX('Étape 1 – Ce qui change'!$Z:$Z,MATCH($A64,'[1]Step 1-What is changing'!$J:$J,0)))","v":""},{"$f":"IF(ISERROR(MATCH($A64,'[1]Step 1-What is changing'!$J:$J,0)),\"\",INDEX('Étape 1 – Ce qui change'!$AA:$AA,MATCH($A64,'[1]Step 1-What is changing'!$J:$J,0)))","v":""}]
[61,{"$f":"IF(ISERROR(MATCH($A65,'[1]Step 1-What is changing'!$J:$J,0)),\"\",INDEX('Étape 1 – Ce qui change'!$D:$D,MATCH($A65,'[1]Step 1-What is changing'!$J:$J,0))&\" - \"&INDEX('Étape 1 – Ce qui change'!$G:$G,MATCH($A65,'[1]Step 1-What is changing'!$J:$J,0)))","v":""},0,{"$error":"#DIV/0!"},"",{"$f":"IF(ISERROR(MATCH($A65,'[1]Step 1-What is changing'!$J:$J,0)),\"\",INDEX('Étape 1 – Ce qui change'!$I:$I,MATCH($A65,'[1]Step 1-What is changing'!$J:$J,0)))","v":""},{"$f":"IF(ISERROR(MATCH($A65,'[1]Step 1-What is changing'!$J:$J,0)),\"\",INDEX('Étape 1 – Ce qui change'!$J:$J,MATCH($A65,'[1]Step 1-What is changing'!$J:$J,0)))","v":""},"","","",{"$f":"IF(ISERROR(MATCH($A65,'[1]Step 1-What is changing'!$J:$J,0)),\"\",INDEX('Étape 1 – Ce qui change'!$N:$N,MATCH($A65,'[1]Step 1-What is changing'!$J:$J,0)))","v":""},{"$f":"IF(ISERROR(MATCH($A65,'[1]Step 1-What is changing'!$J:$J,0)),\"\",INDEX('Étape 1 – Ce qui change'!$O:$O,MATCH($A65,'[1]Step 1-What is changing'!$J:$J,0)))","v":""},{"$f":"IF(ISERROR(MATCH($A65,'[1]Step 1-What is changing'!$J:$J,0)),\"\",INDEX('Étape 1 – Ce qui change'!$P:$P,MATCH($A65,'[1]Step 1-What is changing'!$J:$J,0)))","v":""},{"$f":"IF(ISERROR(MATCH($A65,'[1]Step 1-What is changing'!$J:$J,0)),\"\",INDEX('Étape 1 – Ce qui change'!$Q:$Q,MATCH($A65,'[1]Step 1-What is changing'!$J:$J,0)))","v":""},{"$f":"IF(ISERROR(MATCH($A65,'[1]Step 1-What is changing'!$J:$J,0)),\"\",INDEX('Étape 1 – Ce qui change'!$R:$R,MATCH($A65,'[1]Step 1-What is changing'!$J:$J,0)))","v":""},{"$f":"IF(ISERROR(MATCH($A65,'[1]Step 1-What is changing'!$J:$J,0)),\"\",INDEX('Étape 1 – Ce qui change'!$S:$S,MATCH($A65,'[1]Step 1-What is changing'!$J:$J,0)))","v":""},{"$f":"IF(ISERROR(MATCH($A65,'[1]Step 1-What is changing'!$J:$J,0)),\"\",INDEX('Étape 1 – Ce qui change'!$T:$T,MATCH($A65,'[1]Step 1-What is changing'!$J:$J,0)))","v":""},{"$f":"IF(ISERROR(MATCH($A65,'[1]Step 1-What is changing'!$J:$J,0)),\"\",INDEX('Étape 1 – Ce qui change'!$U:$U,MATCH($A65,'[1]Step 1-What is changing'!$J:$J,0)))","v":""},{"$f":"IF(ISERROR(MATCH($A65,'[1]Step 1-What is changing'!$J:$J,0)),\"\",INDEX('Étape 1 – Ce qui change'!$V:$V,MATCH($A65,'[1]Step 1-What is changing'!$J:$J,0)))","v":""},{"$f":"IF(ISERROR(MATCH($A65,'[1]Step 1-What is changing'!$J:$J,0)),\"\",INDEX('Étape 1 – Ce qui change'!$W:$W,MATCH($A65,'[1]Step 1-What is changing'!$J:$J,0)))","v":""},{"$f":"IF(ISERROR(MATCH($A65,'[1]Step 1-What is changing'!$J:$J,0)),\"\",INDEX('Étape 1 – Ce qui change'!$X:$X,MATCH($A65,'[1]Step 1-What is changing'!$J:$J,0)))","v":""},{"$f":"IF(ISERROR(MATCH($A65,'[1]Step 1-What is changing'!$J:$J,0)),\"\",INDEX('Étape 1 – Ce qui change'!$Y:$Y,MATCH($A65,'[1]Step 1-What is changing'!$J:$J,0)))","v":""},{"$f":"IF(ISERROR(MATCH($A65,'[1]Step 1-What is changing'!$J:$J,0)),\"\",INDEX('Étape 1 – Ce qui change'!$Z:$Z,MATCH($A65,'[1]Step 1-What is changing'!$J:$J,0)))","v":""},{"$f":"IF(ISERROR(MATCH($A65,'[1]Step 1-What is changing'!$J:$J,0)),\"\",INDEX('Étape 1 – Ce qui change'!$AA:$AA,MATCH($A65,'[1]Step 1-What is changing'!$J:$J,0)))","v":""}]
[62,{"$f":"IF(ISERROR(MATCH($A66,'[1]Step 1-What is changing'!$J:$J,0)),\"\",INDEX('Étape 1 – Ce qui change'!$D:$D,MATCH($A66,'[1]Step 1-What is changing'!$J:$J,0))&\" - \"&INDEX('Étape 1 – Ce qui change'!$G:$G,MATCH($A66,'[1]Step 1-What is changing'!$J:$J,0)))","v":""},0,{"$error":"#DIV/0!"},"",{"$f":"IF(ISERROR(MATCH($A66,'[1]Step 1-What is changing'!$J:$J,0)),\"\",INDEX('Étape 1 – Ce qui change'!$I:$I,MATCH($A66,'[1]Step 1-What is changing'!$J:$J,0)))","v":""},{"$f":"IF(ISERROR(MATCH($A66,'[1]Step 1-What is changing'!$J:$J,0)),\"\",INDEX('Étape 1 – Ce qui change'!$J:$J,MATCH($A66,'[1]Step 1-What is changing'!$J:$J,0)))","v":""},"","","",{"$f":"IF(ISERROR(MATCH($A66,'[1]Step 1-What is changing'!$J:$J,0)),\"\",INDEX('Étape 1 – Ce qui change'!$N:$N,MATCH($A66,'[1]Step 1-What is changing'!$J:$J,0)))","v":""},{"$f":"IF(ISERROR(MATCH($A66,'[1]Step 1-What is changing'!$J:$J,0)),\"\",INDEX('Étape 1 – Ce qui change'!$O:$O,MATCH($A66,'[1]Step 1-What is changing'!$J:$J,0)))","v":""},{"$f":"IF(ISERROR(MATCH($A66,'[1]Step 1-What is changing'!$J:$J,0)),\"\",INDEX('Étape 1 – Ce qui change'!$P:$P,MATCH($A66,'[1]Step 1-What is changing'!$J:$J,0)))","v":""},{"$f":"IF(ISERROR(MATCH($A66,'[1]Step 1-What is changing'!$J:$J,0)),\"\",INDEX('Étape 1 – Ce qui change'!$Q:$Q,MATCH($A66,'[1]Step 1-What is changing'!$J:$J,0)))","v":""},{"$f":"IF(ISERROR(MATCH($A66,'[1]Step 1-What is changing'!$J:$J,0)),\"\",INDEX('Étape 1 – Ce qui change'!$R:$R,MATCH($A66,'[1]Step 1-What is changing'!$J:$J,0)))","v":""},{"$f":"IF(ISERROR(MATCH($A66,'[1]Step 1-What is changing'!$J:$J,0)),\"\",INDEX('Étape 1 – Ce qui change'!$S:$S,MATCH($A66,'[1]Step 1-What is changing'!$J:$J,0)))","v":""},{"$f":"IF(ISERROR(MATCH($A66,'[1]Step 1-What is changing'!$J:$J,0)),\"\",INDEX('Étape 1 – Ce qui change'!$T:$T,MATCH($A66,'[1]Step 1-What is changing'!$J:$J,0)))","v":""},{"$f":"IF(ISERROR(MATCH($A66,'[1]Step 1-What is changing'!$J:$J,0)),\"\",INDEX('Étape 1 – Ce qui change'!$U:$U,MATCH($A66,'[1]Step 1-What is changing'!$J:$J,0)))","v":""},{"$f":"IF(ISERROR(MATCH($A66,'[1]Step 1-What is changing'!$J:$J,0)),\"\",INDEX('Étape 1 – Ce qui change'!$V:$V,MATCH($A66,'[1]Step 1-What is changing'!$J:$J,0)))","v":""},{"$f":"IF(ISERROR(MATCH($A66,'[1]Step 1-What is changing'!$J:$J,0)),\"\",INDEX('Étape 1 – Ce qui change'!$W:$W,MATCH($A66,'[1]Step 1-What is changing'!$J:$J,0)))","v":""},{"$f":"IF(ISERROR(MATCH($A66,'[1]Step 1-What is changing'!$J:$J,0)),\"\",INDEX('Étape 1 – Ce qui change'!$X:$X,MATCH($A66,'[1]Step 1-What is changing'!$J:$J,0)))","v":""},{"$f":"IF(ISERROR(MATCH($A66,'[1]Step 1-What is changing'!$J:$J,0)),\"\",INDEX('Étape 1 – Ce qui change'!$Y:$Y,MATCH($A66,'[1]Step 1-What is changing'!$J:$J,0)))","v":""},{"$f":"IF(ISERROR(MATCH($A66,'[1]Step 1-What is changing'!$J:$J,0)),\"\",INDEX('Étape 1 – Ce qui change'!$Z:$Z,MATCH($A66,'[1]Step 1-What is changing'!$J:$J,0)))","v":""},{"$f":"IF(ISERROR(MATCH($A66,'[1]Step 1-What is changing'!$J:$J,0)),\"\",INDEX('Étape 1 – Ce qui change'!$AA:$AA,MATCH($A66,'[1]Step 1-What is changing'!$J:$J,0)))","v":""}]
[63,{"$f":"IF(ISERROR(MATCH($A67,'[1]Step 1-What is changing'!$J:$J,0)),\"\",INDEX('Étape 1 – Ce qui change'!$D:$D,MATCH($A67,'[1]Step 1-What is changing'!$J:$J,0))&\" - \"&INDEX('Étape 1 – Ce qui change'!$G:$G,MATCH($A67,'[1]Step 1-What is changing'!$J:$J,0)))","v":""},0,{"$error":"#DIV/0!"},"",{"$f":"IF(ISERROR(MATCH($A67,'[1]Step 1-What is changing'!$J:$J,0)),\"\",INDEX('Étape 1 – Ce qui change'!$I:$I,MATCH($A67,'[1]Step 1-What is changing'!$J:$J,0)))","v":""},{"$f":"IF(ISERROR(MATCH($A67,'[1]Step 1-What is changing'!$J:$J,0)),\"\",INDEX('Étape 1 – Ce qui change'!$J:$J,MATCH($A67,'[1]Step 1-What is changing'!$J:$J,0)))","v":""},"","","",{"$f":"IF(ISERROR(MATCH($A67,'[1]Step 1-What is changing'!$J:$J,0)),\"\",INDEX('Étape 1 – Ce qui change'!$N:$N,MATCH($A67,'[1]Step 1-What is changing'!$J:$J,0)))","v":""},{"$f":"IF(ISERROR(MATCH($A67,'[1]Step 1-What is changing'!$J:$J,0)),\"\",INDEX('Étape 1 – Ce qui change'!$O:$O,MATCH($A67,'[1]Step 1-What is changing'!$J:$J,0)))","v":""},{"$f":"IF(ISERROR(MATCH($A67,'[1]Step 1-What is changing'!$J:$J,0)),\"\",INDEX('Étape 1 – Ce qui change'!$P:$P,MATCH($A67,'[1]Step 1-What is changing'!$J:$J,0)))","v":""},{"$f":"IF(ISERROR(MATCH($A67,'[1]Step 1-What is changing'!$J:$J,0)),\"\",INDEX('Étape 1 – Ce qui change'!$Q:$Q,MATCH($A67,'[1]Step 1-What is changing'!$J:$J,0)))","v":""},{"$f":"IF(ISERROR(MATCH($A67,'[1]Step 1-What is changing'!$J:$J,0)),\"\",INDEX('Étape 1 – Ce qui change'!$R:$R,MATCH($A67,'[1]Step 1-What is changing'!$J:$J,0)))","v":""},{"$f":"IF(ISERROR(MATCH($A67,'[1]Step 1-What is changing'!$J:$J,0)),\"\",INDEX('Étape 1 – Ce qui change'!$S:$S,MATCH($A67,'[1]Step 1-What is changing'!$J:$J,0)))","v":""},{"$f":"IF(ISERROR(MATCH($A67,'[1]Step 1-What is changing'!$J:$J,0)),\"\",INDEX('Étape 1 – Ce qui change'!$T:$T,MATCH($A67,'[1]Step 1-What is changing'!$J:$J,0)))","v":""},{"$f":"IF(ISERROR(MATCH($A67,'[1]Step 1-What is changing'!$J:$J,0)),\"\",INDEX('Étape 1 – Ce qui change'!$U:$U,MATCH($A67,'[1]Step 1-What is changing'!$J:$J,0)))","v":""},{"$f":"IF(ISERROR(MATCH($A67,'[1]Step 1-What is changing'!$J:$J,0)),\"\",INDEX('Étape 1 – Ce qui change'!$V:$V,MATCH($A67,'[1]Step 1-What is changing'!$J:$J,0)))","v":""},{"$f":"IF(ISERROR(MATCH($A67,'[1]Step 1-What is changing'!$J:$J,0)),\"\",INDEX('Étape 1 – Ce qui change'!$W:$W,MATCH($A67,'[1]Step 1-What is changing'!$J:$J,0)))","v":""},{"$f":"IF(ISERROR(MATCH($A67,'[1]Step 1-What is changing'!$J:$J,0)),\"\",INDEX('Étape 1 – Ce qui change'!$X:$X,MATCH($A67,'[1]Step 1-What is changing'!$J:$J,0)))","v":""},{"$f":"IF(ISERROR(MATCH($A67,'[1]Step 1-What is changing'!$J:$J,0)),\"\",INDEX('Étape 1 – Ce qui change'!$Y:$Y,MATCH($A67,'[1]Step 1-What is changing'!$J:$J,0)))","v":""},{"$f":"IF(ISERROR(MATCH($A67,'[1]Step 1-What is changing'!$J:$J,0)),\"\",INDEX('Étape 1 – Ce qui change'!$Z:$Z,MATCH($A67,'[1]Step 1-What is changing'!$J:$J,0)))","v":""},{"$f":"IF(ISERROR(MATCH($A67,'[1]Step 1-What is changing'!$J:$J,0)),\"\",INDEX('Étape 1 – Ce qui change'!$AA:$AA,MATCH($A67,'[1]Step 1-What is changing'!$J:$J,0)))","v":""}]
[64,{"$f":"IF(ISERROR(MATCH($A68,'[1]Step 1-What is changing'!$J:$J,0)),\"\",INDEX('Étape 1 – Ce qui change'!$D:$D,MATCH($A68,'[1]Step 1-What is changing'!$J:$J,0))&\" - \"&INDEX('Étape 1 – Ce qui change'!$G:$G,MATCH($A68,'[1]Step 1-What is changing'!$J:$J,0)))","v":""},0,{"$error":"#DIV/0!"},"",{"$f":"IF(ISERROR(MATCH($A68,'[1]Step 1-What is changing'!$J:$J,0)),\"\",INDEX('Étape 1 – Ce qui change'!$I:$I,MATCH($A68,'[1]Step 1-What is changing'!$J:$J,0)))","v":""},{"$f":"IF(ISERROR(MATCH($A68,'[1]Step 1-What is changing'!$J:$J,0)),\"\",INDEX('Étape 1 – Ce qui change'!$J:$J,MATCH($A68,'[1]Step 1-What is changing'!$J:$J,0)))","v":""},"","","",{"$f":"IF(ISERROR(MATCH($A68,'[1]Step 1-What is changing'!$J:$J,0)),\"\",INDEX('Étape 1 – Ce qui change'!$N:$N,MATCH($A68,'[1]Step 1-What is changing'!$J:$J,0)))","v":""},{"$f":"IF(ISERROR(MATCH($A68,'[1]Step 1-What is changing'!$J:$J,0)),\"\",INDEX('Étape 1 – Ce qui change'!$O:$O,MATCH($A68,'[1]Step 1-What is changing'!$J:$J,0)))","v":""},{"$f":"IF(ISERROR(MATCH($A68,'[1]Step 1-What is changing'!$J:$J,0)),\"\",INDEX('Étape 1 – Ce qui change'!$P:$P,MATCH($A68,'[1]Step 1-What is changing'!$J:$J,0)))","v":""},{"$f":"IF(ISERROR(MATCH($A68,'[1]Step 1-What is changing'!$J:$J,0)),\"\",INDEX('Étape 1 – Ce qui change'!$Q:$Q,MATCH($A68,'[1]Step 1-What is changing'!$J:$J,0)))","v":""},{"$f":"IF(ISERROR(MATCH($A68,'[1]Step 1-What is changing'!$J:$J,0)),\"\",INDEX('Étape 1 – Ce qui change'!$R:$R,MATCH($A68,'[1]Step 1-What is changing'!$J:$J,0)))","v":""},{"$f":"IF(ISERROR(MATCH($A68,'[1]Step 1-What is changing'!$J:$J,0)),\"\",INDEX('Étape 1 – Ce qui change'!$S:$S,MATCH($A68,'[1]Step 1-What is changing'!$J:$J,0)))","v":""},{"$f":"IF(ISERROR(MATCH($A68,'[1]Step 1-What is changing'!$J:$J,0)),\"\",INDEX('Étape 1 – Ce qui change'!$T:$T,MATCH($A68,'[1]Step 1-What is changing'!$J:$J,0)))","v":""},{"$f":"IF(ISERROR(MATCH($A68,'[1]Step 1-What is changing'!$J:$J,0)),\"\",INDEX('Étape 1 – Ce qui change'!$U:$U,MATCH($A68,'[1]Step 1-What is changing'!$J:$J,0)))","v":""},{"$f":"IF(ISERROR(MATCH($A68,'[1]Step 1-What is changing'!$J:$J,0)),\"\",INDEX('Étape 1 – Ce qui change'!$V:$V,MATCH($A68,'[1]Step 1-What is changing'!$J:$J,0)))","v":""},{"$f":"IF(ISERROR(MATCH($A68,'[1]Step 1-What is changing'!$J:$J,0)),\"\",INDEX('Étape 1 – Ce qui change'!$W:$W,MATCH($A68,'[1]Step 1-What is changing'!$J:$J,0)))","v":""},{"$f":"IF(ISERROR(MATCH($A68,'[1]Step 1-What is changing'!$J:$J,0)),\"\",INDEX('Étape 1 – Ce qui change'!$X:$X,MATCH($A68,'[1]Step 1-What is changing'!$J:$J,0)))","v":""},{"$f":"IF(ISERROR(MATCH($A68,'[1]Step 1-What is changing'!$J:$J,0)),\"\",INDEX('Étape 1 – Ce qui change'!$Y:$Y,MATCH($A68,'[1]Step 1-What is changing'!$J:$J,0)))","v":""},{"$f":"IF(ISERROR(MATCH($A68,'[1]Step 1-What is changing'!$J:$J,0)),\"\",INDEX('Étape 1 – Ce qui change'!$Z:$Z,MATCH($A68,'[1]Step 1-What is changing'!$J:$J,0)))","v":""},{"$f":"IF(ISERROR(MATCH($A68,'[1]Step 1-What is changing'!$J:$J,0)),\"\",INDEX('Étape 1 – Ce qui change'!$AA:$AA,MATCH($A68,'[1]Step 1-What is changing'!$J:$J,0)))","v":""}]
[65,{"$f":"IF(ISERROR(MATCH($A69,'[1]Step 1-What is changing'!$J:$J,0)),\"\",INDEX('Étape 1 – Ce qui change'!$D:$D,MATCH($A69,'[1]Step 1-What is changing'!$J:$J,0))&\" - \"&INDEX('Étape 1 – Ce qui change'!$G:$G,MATCH($A69,'[1]Step 1-What is changing'!$J:$J,0)))","v":""},0,{"$error":"#DIV/0!"},"",{"$f":"IF(ISERROR(MATCH($A69,'[1]Step 1-What is changing'!$J:$J,0)),\"\",INDEX('Étape 1 – Ce qui change'!$I:$I,MATCH($A69,'[1]Step 1-What is changing'!$J:$J,0)))","v":""},{"$f":"IF(ISERROR(MATCH($A69,'[1]Step 1-What is changing'!$J:$J,0)),\"\",INDEX('Étape 1 – Ce qui change'!$J:$J,MATCH($A69,'[1]Step 1-What is changing'!$J:$J,0)))","v":""},"","","",{"$f":"IF(ISERROR(MATCH($A69,'[1]Step 1-What is changing'!$J:$J,0)),\"\",INDEX('Étape 1 – Ce qui change'!$N:$N,MATCH($A69,'[1]Step 1-What is changing'!$J:$J,0)))","v":""},{"$f":"IF(ISERROR(MATCH($A69,'[1]Step 1-What is changing'!$J:$J,0)),\"\",INDEX('Étape 1 – Ce qui change'!$O:$O,MATCH($A69,'[1]Step 1-What is changing'!$J:$J,0)))","v":""},{"$f":"IF(ISERROR(MATCH($A69,'[1]Step 1-What is changing'!$J:$J,0)),\"\",INDEX('Étape 1 – Ce qui change'!$P:$P,MATCH($A69,'[1]Step 1-What is changing'!$J:$J,0)))","v":""},{"$f":"IF(ISERROR(MATCH($A69,'[1]Step 1-What is changing'!$J:$J,0)),\"\",INDEX('Étape 1 – Ce qui change'!$Q:$Q,MATCH($A69,'[1]Step 1-What is changing'!$J:$J,0)))","v":""},{"$f":"IF(ISERROR(MATCH($A69,'[1]Step 1-What is changing'!$J:$J,0)),\"\",INDEX('Étape 1 – Ce qui change'!$R:$R,MATCH($A69,'[1]Step 1-What is changing'!$J:$J,0)))","v":""},{"$f":"IF(ISERROR(MATCH($A69,'[1]Step 1-What is changing'!$J:$J,0)),\"\",INDEX('Étape 1 – Ce qui change'!$S:$S,MATCH($A69,'[1]Step 1-What is changing'!$J:$J,0)))","v":""},{"$f":"IF(ISERROR(MATCH($A69,'[1]Step 1-What is changing'!$J:$J,0)),\"\",INDEX('Étape 1 – Ce qui change'!$T:$T,MATCH($A69,'[1]Step 1-What is changing'!$J:$J,0)))","v":""},{"$f":"IF(ISERROR(MATCH($A69,'[1]Step 1-What is changing'!$J:$J,0)),\"\",INDEX('Étape 1 – Ce qui change'!$U:$U,MATCH($A69,'[1]Step 1-What is changing'!$J:$J,0)))","v":""},{"$f":"IF(ISERROR(MATCH($A69,'[1]Step 1-What is changing'!$J:$J,0)),\"\",INDEX('Étape 1 – Ce qui change'!$V:$V,MATCH($A69,'[1]Step 1-What is changing'!$J:$J,0)))","v":""},{"$f":"IF(ISERROR(MATCH($A69,'[1]Step 1-What is changing'!$J:$J,0)),\"\",INDEX('Étape 1 – Ce qui change'!$W:$W,MATCH($A69,'[1]Step 1-What is changing'!$J:$J,0)))","v":""},{"$f":"IF(ISERROR(MATCH($A69,'[1]Step 1-What is changing'!$J:$J,0)),\"\",INDEX('Étape 1 – Ce qui change'!$X:$X,MATCH($A69,'[1]Step 1-What is changing'!$J:$J,0)))","v":""},{"$f":"IF(ISERROR(MATCH($A69,'[1]Step 1-What is changing'!$J:$J,0)),\"\",INDEX('Étape 1 – Ce qui change'!$Y:$Y,MATCH($A69,'[1]Step 1-What is changing'!$J:$J,0)))","v":""},{"$f":"IF(ISERROR(MATCH($A69,'[1]Step 1-What is changing'!$J:$J,0)),\"\",INDEX('Étape 1 – Ce qui change'!$Z:$Z,MATCH($A69,'[1]Step 1-What is changing'!$J:$J,0)))","v":""},{"$f":"IF(ISERROR(MATCH($A69,'[1]Step 1-What is changing'!$J:$J,0)),\"\",INDEX('Étape 1 – Ce qui change'!$AA:$AA,MATCH($A69,'[1]Step 1-What is changing'!$J:$J,0)))","v":""}]
[{"$f":"ROW()-4","v":66},{"$f":"IF(ISERROR(MATCH($A70,'[1]Step 1-What is changing'!$J:$J,0)),\"\",INDEX('Étape 1 – Ce qui change'!$D:$D,MATCH($A70,'[1]Step 1-What is changing'!$J:$J,0))&\" - \"&INDEX('Étape 1 – Ce qui change'!$G:$G,MATCH($A70,'[1]Step 1-What is changing'!$J:$J,0)))","v":""},0,{"$f":"100*C70/$C$3","v":{"$error":"#DIV/0!"}},"",{"$f":"IF(ISERROR(MATCH($A70,'[1]Step 1-What is changing'!$J:$J,0)),\"\",INDEX('Étape 1 – Ce qui change'!$I:$I,MATCH($A70,'[1]Step 1-What is changing'!$J:$J,0)))","v":""},{"$f":"IF(ISERROR(MATCH($A70,'[1]Step 1-What is changing'!$J:$J,0)),\"\",INDEX('Étape 1 – Ce qui change'!$J:$J,MATCH($A70,'[1]Step 1-What is changing'!$J:$J,0)))","v":""},"","","",{"$f":"IF(ISERROR(MATCH($A70,'[1]Step 1-What is changing'!$J:$J,0)),\"\",INDEX('Étape 1 – Ce qui change'!$N:$N,MATCH($A70,'[1]Step 1-What is changing'!$J:$J,0)))","v":""},{"$f":"IF(ISERROR(MATCH($A70,'[1]Step 1-What is changing'!$J:$J,0)),\"\",INDEX('Étape 1 – Ce qui change'!$O:$O,MATCH($A70,'[1]Step 1-What is changing'!$J:$J,0)))","v":""},{"$f":"IF(ISERROR(MATCH($A70,'[1]Step 1-What is changing'!$J:$J,0)),\"\",INDEX('Étape 1 – Ce qui change'!$P:$P,MATCH($A70,'[1]Step 1-What is changing'!$J:$J,0)))","v":""},{"$f":"IF(ISERROR(MATCH($A70,'[1]Step 1-What is changing'!$J:$J,0)),\"\",INDEX('Étape 1 – Ce qui change'!$Q:$Q,MATCH($A70,'[1]Step 1-What is changing'!$J:$J,0)))","v":""},{"$f":"IF(ISERROR(MATCH($A70,'[1]Step 1-What is changing'!$J:$J,0)),\"\",INDEX('Étape 1 – Ce qui change'!$R:$R,MATCH($A70,'[1]Step 1-What is changing'!$J:$J,0)))","v":""},{"$f":"IF(ISERROR(MATCH($A70,'[1]Step 1-What is changing'!$J:$J,0)),\"\",INDEX('Étape 1 – Ce qui change'!$S:$S,MATCH($A70,'[1]Step 1-What is changing'!$J:$J,0)))","v":""},{"$f":"IF(ISERROR(MATCH($A70,'[1]Step 1-What is changing'!$J:$J,0)),\"\",INDEX('Étape 1 – Ce qui change'!$T:$T,MATCH($A70,'[1]Step 1-What is changing'!$J:$J,0)))","v":""},{"$f":"IF(ISERROR(MATCH($A70,'[1]Step 1-What is changing'!$J:$J,0)),\"\",INDEX('Étape 1 – Ce qui change'!$U:$U,MATCH($A70,'[1]Step 1-What is changing'!$J:$J,0)))","v":""},{"$f":"IF(ISERROR(MATCH($A70,'[1]Step 1-What is changing'!$J:$J,0)),\"\",INDEX('Étape 1 – Ce qui change'!$V:$V,MATCH($A70,'[1]Step 1-What is changing'!$J:$J,0)))","v":""},{"$f":"IF(ISERROR(MATCH($A70,'[1]Step 1-What is changing'!$J:$J,0)),\"\",INDEX('Étape 1 – Ce qui change'!$W:$W,MATCH($A70,'[1]Step 1-What is changing'!$J:$J,0)))","v":""},{"$f":"IF(ISERROR(MATCH($A70,'[1]Step 1-What is changing'!$J:$J,0)),\"\",INDEX('Étape 1 – Ce qui change'!$X:$X,MATCH($A70,'[1]Step 1-What is changing'!$J:$J,0)))","v":""},{"$f":"IF(ISERROR(MATCH($A70,'[1]Step 1-What is changing'!$J:$J,0)),\"\",INDEX('Étape 1 – Ce qui change'!$Y:$Y,MATCH($A70,'[1]Step 1-What is changing'!$J:$J,0)))","v":""},{"$f":"IF(ISERROR(MATCH($A70,'[1]Step 1-What is changing'!$J:$J,0)),\"\",INDEX('Étape 1 – Ce qui change'!$Z:$Z,MATCH($A70,'[1]Step 1-What is changing'!$J:$J,0)))","v":""},{"$f":"IF(ISERROR(MATCH($A70,'[1]Step 1-What is changing'!$J:$J,0)),\"\",INDEX('Étape 1 – Ce qui change'!$AA:$AA,MATCH($A70,'[1]Step 1-What is changing'!$J:$J,0)))","v":""}]
[67,{"$f":"IF(ISERROR(MATCH($A71,'[1]Step 1-What is changing'!$J:$J,0)),\"\",INDEX('Étape 1 – Ce qui change'!$D:$D,MATCH($A71,'[1]Step 1-What is changing'!$J:$J,0))&\" - \"&INDEX('Étape 1 – Ce qui change'!$G:$G,MATCH($A71,'[1]Step 1-What is changing'!$J:$J,0)))","v":""},0,{"$error":"#DIV/0!"},"",{"$f":"IF(ISERROR(MATCH($A71,'[1]Step 1-What is changing'!$J:$J,0)),\"\",INDEX('Étape 1 – Ce qui change'!$I:$I,MATCH($A71,'[1]Step 1-What is changing'!$J:$J,0)))","v":""},{"$f":"IF(ISERROR(MATCH($A71,'[1]Step 1-What is changing'!$J:$J,0)),\"\",INDEX('Étape 1 – Ce qui change'!$J:$J,MATCH($A71,'[1]Step 1-What is changing'!$J:$J,0)))","v":""},"","","",{"$f":"IF(ISERROR(MATCH($A71,'[1]Step 1-What is changing'!$J:$J,0)),\"\",INDEX('Étape 1 – Ce qui change'!$N:$N,MATCH($A71,'[1]Step 1-What is changing'!$J:$J,0)))","v":""},{"$f":"IF(ISERROR(MATCH($A71,'[1]Step 1-What is changing'!$J:$J,0)),\"\",INDEX('Étape 1 – Ce qui change'!$O:$O,MATCH($A71,'[1]Step 1-What is changing'!$J:$J,0)))","v":""},{"$f":"IF(ISERROR(MATCH($A71,'[1]Step 1-What is changing'!$J:$J,0)),\"\",INDEX('Étape 1 – Ce qui change'!$P:$P,MATCH($A71,'[1]Step 1-What is changing'!$J:$J,0)))","v":""},{"$f":"IF(ISERROR(MATCH($A71,'[1]Step 1-What is changing'!$J:$J,0)),\"\",INDEX('Étape 1 – Ce qui change'!$Q:$Q,MATCH($A71,'[1]Step 1-What is changing'!$J:$J,0)))","v":""},{"$f":"IF(ISERROR(MATCH($A71,'[1]Step 1-What is changing'!$J:$J,0)),\"\",INDEX('Étape 1 – Ce qui change'!$R:$R,MATCH($A71,'[1]Step 1-What is changing'!$J:$J,0)))","v":""},{"$f":"IF(ISERROR(MATCH($A71,'[1]Step 1-What is changing'!$J:$J,0)),\"\",INDEX('Étape 1 – Ce qui change'!$S:$S,MATCH($A71,'[1]Step 1-What is changing'!$J:$J,0)))","v":""},{"$f":"IF(ISERROR(MATCH($A71,'[1]Step 1-What is changing'!$J:$J,0)),\"\",INDEX('Étape 1 – Ce qui change'!$T:$T,MATCH($A71,'[1]Step 1-What is changing'!$J:$J,0)))","v":""},{"$f":"IF(ISERROR(MATCH($A71,'[1]Step 1-What is changing'!$J:$J,0)),\"\",INDEX('Étape 1 – Ce qui change'!$U:$U,MATCH($A71,'[1]Step 1-What is changing'!$J:$J,0)))","v":""},{"$f":"IF(ISERROR(MATCH($A71,'[1]Step 1-What is changing'!$J:$J,0)),\"\",INDEX('Étape 1 – Ce qui change'!$V:$V,MATCH($A71,'[1]Step 1-What is changing'!$J:$J,0)))","v":""},{"$f":"IF(ISERROR(MATCH($A71,'[1]Step 1-What is changing'!$J:$J,0)),\"\",INDEX('Étape 1 – Ce qui change'!$W:$W,MATCH($A71,'[1]Step 1-What is changing'!$J:$J,0)))","v":""},{"$f":"IF(ISERROR(MATCH($A71,'[1]Step 1-What is changing'!$J:$J,0)),\"\",INDEX('Étape 1 – Ce qui change'!$X:$X,MATCH($A71,'[1]Step 1-What is changing'!$J:$J,0)))","v":""},{"$f":"IF(ISERROR(MATCH($A71,'[1]Step 1-What is changing'!$J:$J,0)),\"\",INDEX('Étape 1 – Ce qui change'!$Y:$Y,MATCH($A71,'[1]Step 1-What is changing'!$J:$J,0)))","v":""},{"$f":"IF(ISERROR(MATCH($A71,'[1]Step 1-What is changing'!$J:$J,0)),\"\",INDEX('Étape 1 – Ce qui change'!$Z:$Z,MATCH($A71,'[1]Step 1-What is changing'!$J:$J,0)))","v":""},{"$f":"IF(ISERROR(MATCH($A71,'[1]Step 1-What is changing'!$J:$J,0)),\"\",INDEX('Étape 1 – Ce qui change'!$AA:$AA,MATCH($A71,'[1]Step 1-What is changing'!$J:$J,0)))","v":""}]
[68,{"$f":"IF(ISERROR(MATCH($A72,'[1]Step 1-What is changing'!$J:$J,0)),\"\",INDEX('Étape 1 – Ce qui change'!$D:$D,MATCH($A72,'[1]Step 1-What is changing'!$J:$J,0))&\" - \"&INDEX('Étape 1 – Ce qui change'!$G:$G,MATCH($A72,'[1]Step 1-What is changing'!$J:$J,0)))","v":""},0,{"$error":"#DIV/0!"},"",{"$f":"IF(ISERROR(MATCH($A72,'[1]Step 1-What is changing'!$J:$J,0)),\"\",INDEX('Étape 1 – Ce qui change'!$I:$I,MATCH($A72,'[1]Step 1-What is changing'!$J:$J,0)))","v":""},{"$f":"IF(ISERROR(MATCH($A72,'[1]Step 1-What is changing'!$J:$J,0)),\"\",INDEX('Étape 1 – Ce qui change'!$J:$J,MATCH($A72,'[1]Step 1-What is changing'!$J:$J,0)))","v":""},"","","",{"$f":"IF(ISERROR(MATCH($A72,'[1]Step 1-What is changing'!$J:$J,0)),\"\",INDEX('Étape 1 – Ce qui change'!$N:$N,MATCH($A72,'[1]Step 1-What is changing'!$J:$J,0)))","v":""},{"$f":"IF(ISERROR(MATCH($A72,'[1]Step 1-What is changing'!$J:$J,0)),\"\",INDEX('Étape 1 – Ce qui change'!$O:$O,MATCH($A72,'[1]Step 1-What is changing'!$J:$J,0)))","v":""},{"$f":"IF(ISERROR(MATCH($A72,'[1]Step 1-What is changing'!$J:$J,0)),\"\",INDEX('Étape 1 – Ce qui change'!$P:$P,MATCH($A72,'[1]Step 1-What is changing'!$J:$J,0)))","v":""},{"$f":"IF(ISERROR(MATCH($A72,'[1]Step 1-What is changing'!$J:$J,0)),\"\",INDEX('Étape 1 – Ce qui change'!$Q:$Q,MATCH($A72,'[1]Step 1-What is changing'!$J:$J,0)))","v":""},{"$f":"IF(ISERROR(MATCH($A72,'[1]Step 1-What is changing'!$J:$J,0)),\"\",INDEX('Étape 1 – Ce qui change'!$R:$R,MATCH($A72,'[1]Step 1-What is changing'!$J:$J,0)))","v":""},{"$f":"IF(ISERROR(MATCH($A72,'[1]Step 1-What is changing'!$J:$J,0)),\"\",INDEX('Étape 1 – Ce qui change'!$S:$S,MATCH($A72,'[1]Step 1-What is changing'!$J:$J,0)))","v":""},{"$f":"IF(ISERROR(MATCH($A72,'[1]Step 1-What is changing'!$J:$J,0)),\"\",INDEX('Étape 1 – Ce qui change'!$T:$T,MATCH($A72,'[1]Step 1-What is changing'!$J:$J,0)))","v":""},{"$f":"IF(ISERROR(MATCH($A72,'[1]Step 1-What is changing'!$J:$J,0)),\"\",INDEX('Étape 1 – Ce qui change'!$U:$U,MATCH($A72,'[1]Step 1-What is changing'!$J:$J,0)))","v":""},{"$f":"IF(ISERROR(MATCH($A72,'[1]Step 1-What is changing'!$J:$J,0)),\"\",INDEX('Étape 1 – Ce qui change'!$V:$V,MATCH($A72,'[1]Step 1-What is changing'!$J:$J,0)))","v":""},{"$f":"IF(ISERROR(MATCH($A72,'[1]Step 1-What is changing'!$J:$J,0)),\"\",INDEX('Étape 1 – Ce qui change'!$W:$W,MATCH($A72,'[1]Step 1-What is changing'!$J:$J,0)))","v":""},{"$f":"IF(ISERROR(MATCH($A72,'[1]Step 1-What is changing'!$J:$J,0)),\"\",INDEX('Étape 1 – Ce qui change'!$X:$X,MATCH($A72,'[1]Step 1-What is changing'!$J:$J,0)))","v":""},{"$f":"IF(ISERROR(MATCH($A72,'[1]Step 1-What is changing'!$J:$J,0)),\"\",INDEX('Étape 1 – Ce qui change'!$Y:$Y,MATCH($A72,'[1]Step 1-What is changing'!$J:$J,0)))","v":""},{"$f":"IF(ISERROR(MATCH($A72,'[1]Step 1-What is changing'!$J:$J,0)),\"\",INDEX('Étape 1 – Ce qui change'!$Z:$Z,MATCH($A72,'[1]Step 1-What is changing'!$J:$J,0)))","v":""},{"$f":"IF(ISERROR(MATCH($A72,'[1]Step 1-What is changing'!$J:$J,0)),\"\",INDEX('Étape 1 – Ce qui change'!$AA:$AA,MATCH($A72,'[1]Step 1-What is changing'!$J:$J,0)))","v":""}]
[69,{"$f":"IF(ISERROR(MATCH($A73,'[1]Step 1-What is changing'!$J:$J,0)),\"\",INDEX('Étape 1 – Ce qui change'!$D:$D,MATCH($A73,'[1]Step 1-What is changing'!$J:$J,0))&\" - \"&INDEX('Étape 1 – Ce qui change'!$G:$G,MATCH($A73,'[1]Step 1-What is changing'!$J:$J,0)))","v":""},0,{"$error":"#DIV/0!"},"",{"$f":"IF(ISERROR(MATCH($A73,'[1]Step 1-What is changing'!$J:$J,0)),\"\",INDEX('Étape 1 – Ce qui change'!$I:$I,MATCH($A73,'[1]Step 1-What is changing'!$J:$J,0)))","v":""},{"$f":"IF(ISERROR(MATCH($A73,'[1]Step 1-What is changing'!$J:$J,0)),\"\",INDEX('Étape 1 – Ce qui change'!$J:$J,MATCH($A73,'[1]Step 1-What is changing'!$J:$J,0)))","v":""},"","","",{"$f":"IF(ISERROR(MATCH($A73,'[1]Step 1-What is changing'!$J:$J,0)),\"\",INDEX('Étape 1 – Ce qui change'!$N:$N,MATCH($A73,'[1]Step 1-What is changing'!$J:$J,0)))","v":""},{"$f":"IF(ISERROR(MATCH($A73,'[1]Step 1-What is changing'!$J:$J,0)),\"\",INDEX('Étape 1 – Ce qui change'!$O:$O,MATCH($A73,'[1]Step 1-What is changing'!$J:$J,0)))","v":""},{"$f":"IF(ISERROR(MATCH($A73,'[1]Step 1-What is changing'!$J:$J,0)),\"\",INDEX('Étape 1 – Ce qui change'!$P:$P,MATCH($A73,'[1]Step 1-What is changing'!$J:$J,0)))","v":""},{"$f":"IF(ISERROR(MATCH($A73,'[1]Step 1-What is changing'!$J:$J,0)),\"\",INDEX('Étape 1 – Ce qui change'!$Q:$Q,MATCH($A73,'[1]Step 1-What is changing'!$J:$J,0)))","v":""},{"$f":"IF(ISERROR(MATCH($A73,'[1]Step 1-What is changing'!$J:$J,0)),\"\",INDEX('Étape 1 – Ce qui change'!$R:$R,MATCH($A73,'[1]Step 1-What is changing'!$J:$J,0)))","v":""},{"$f":"IF(ISERROR(MATCH($A73,'[1]Step 1-What is changing'!$J:$J,0)),\"\",INDEX('Étape 1 – Ce qui change'!$S:$S,MATCH($A73,'[1]Step 1-What is changing'!$J:$J,0)))","v":""},{"$f":"IF(ISERROR(MATCH($A73,'[1]Step 1-What is changing'!$J:$J,0)),\"\",INDEX('Étape 1 – Ce qui change'!$T:$T,MATCH($A73,'[1]Step 1-What is changing'!$J:$J,0)))","v":""},{"$f":"IF(ISERROR(MATCH($A73,'[1]Step 1-What is changing'!$J:$J,0)),\"\",INDEX('Étape 1 – Ce qui change'!$U:$U,MATCH($A73,'[1]Step 1-What is changing'!$J:$J,0)))","v":""},{"$f":"IF(ISERROR(MATCH($A73,'[1]Step 1-What is changing'!$J:$J,0)),\"\",INDEX('Étape 1 – Ce qui change'!$V:$V,MATCH($A73,'[1]Step 1-What is changing'!$J:$J,0)))","v":""},{"$f":"IF(ISERROR(MATCH($A73,'[1]Step 1-What is changing'!$J:$J,0)),\"\",INDEX('Étape 1 – Ce qui change'!$W:$W,MATCH($A73,'[1]Step 1-What is changing'!$J:$J,0)))","v":""},{"$f":"IF(ISERROR(MATCH($A73,'[1]Step 1-What is changing'!$J:$J,0)),\"\",INDEX('Étape 1 – Ce qui change'!$X:$X,MATCH($A73,'[1]Step 1-What is changing'!$J:$J,0)))","v":""},{"$f":"IF(ISERROR(MATCH($A73,'[1]Step 1-What is changing'!$J:$J,0)),\"\",INDEX('Étape 1 – Ce qui change'!$Y:$Y,MATCH($A73,'[1]Step 1-What is changing'!$J:$J,0)))","v":""},{"$f":"IF(ISERROR(MATCH($A73,'[1]Step 1-What is changing'!$J:$J,0)),\"\",INDEX('Étape 1 – Ce qui change'!$Z:$Z,MATCH($A73,'[1]Step 1-What is changing'!$J:$J,0)))","v":""},{"$f":"IF(ISERROR(MATCH($A73,'[1]Step 1-What is changing'!$J:$J,0)),\"\",INDEX('Étape 1 – Ce qui change'!$AA:$AA,MATCH($A73,'[1]Step 1-What is changing'!$J:$J,0)))","v":""}]
[70,{"$f":"IF(ISERROR(MATCH($A74,'[1]Step 1-What is changing'!$J:$J,0)),\"\",INDEX('Étape 1 – Ce qui change'!$D:$D,MATCH($A74,'[1]Step 1-What is changing'!$J:$J,0))&\" - \"&INDEX('Étape 1 – Ce qui change'!$G:$G,MATCH($A74,'[1]Step 1-What is changing'!$J:$J,0)))","v":""},0,{"$error":"#DIV/0!"},{"$f":"IF(F74=TRUE,\"X\",\"\")","v":""},{"$f":"IF(ISERROR(MATCH($A74,'[1]Step 1-What is changing'!$J:$J,0)),\"\",INDEX('Étape 1 – Ce qui change'!$I:$I,MATCH($A74,'[1]Step 1-What is changing'!$J:$J,0)))","v":""},{"$f":"IF(ISERROR(MATCH($A74,'[1]Step 1-What is changing'!$J:$J,0)),\"\",INDEX('Étape 1 – Ce qui change'!$J:$J,MATCH($A74,'[1]Step 1-What is changing'!$J:$J,0)))","v":""},{"$f":"IF(K74=TRUE,\"X\",\"\")","v":""},{"$f":"IF(L74=TRUE,\"X\",\"\")","v":""},{"$f":"IF(M74=TRUE,\"X\",\"\")","v":""},{"$f":"IF(ISERROR(MATCH($A74,'[1]Step 1-What is changing'!$J:$J,0)),\"\",INDEX('Étape 1 – Ce qui change'!$N:$N,MATCH($A74,'[1]Step 1-What is changing'!$J:$J,0)))","v":""},{"$f":"IF(ISERROR(MATCH($A74,'[1]Step 1-What is changing'!$J:$J,0)),\"\",INDEX('Étape 1 – Ce qui change'!$O:$O,MATCH($A74,'[1]Step 1-What is changing'!$J:$J,0)))","v":""},{"$f":"IF(ISERROR(MATCH($A74,'[1]Step 1-What is changing'!$J:$J,0)),\"\",INDEX('Étape 1 – Ce qui change'!$P:$P,MATCH($A74,'[1]Step 1-What is changing'!$J:$J,0)))","v":""},{"$f":"IF(ISERROR(MATCH($A74,'[1]Step 1-What is changing'!$J:$J,0)),\"\",INDEX('Étape 1 – Ce qui change'!$Q:$Q,MATCH($A74,'[1]Step 1-What is changing'!$J:$J,0)))","v":""},{"$f":"IF(ISERROR(MATCH($A74,'[1]Step 1-What is changing'!$J:$J,0)),\"\",INDEX('Étape 1 – Ce qui change'!$R:$R,MATCH($A74,'[1]Step 1-What is changing'!$J:$J,0)))","v":""},{"$f":"IF(ISERROR(MATCH($A74,'[1]Step 1-What is changing'!$J:$J,0)),\"\",INDEX('Étape 1 – Ce qui change'!$S:$S,MATCH($A74,'[1]Step 1-What is changing'!$J:$J,0)))","v":""},{"$f":"IF(ISERROR(MATCH($A74,'[1]Step 1-What is changing'!$J:$J,0)),\"\",INDEX('Étape 1 – Ce qui change'!$T:$T,MATCH($A74,'[1]Step 1-What is changing'!$J:$J,0)))","v":""},{"$f":"IF(ISERROR(MATCH($A74,'[1]Step 1-What is changing'!$J:$J,0)),\"\",INDEX('Étape 1 – Ce qui change'!$U:$U,MATCH($A74,'[1]Step 1-What is changing'!$J:$J,0)))","v":""},{"$f":"IF(ISERROR(MATCH($A74,'[1]Step 1-What is changing'!$J:$J,0)),\"\",INDEX('Étape 1 – Ce qui change'!$V:$V,MATCH($A74,'[1]Step 1-What is changing'!$J:$J,0)))","v":""},{"$f":"IF(ISERROR(MATCH($A74,'[1]Step 1-What is changing'!$J:$J,0)),\"\",INDEX('Étape 1 – Ce qui change'!$W:$W,MATCH($A74,'[1]Step 1-What is changing'!$J:$J,0)))","v":""},{"$f":"IF(ISERROR(MATCH($A74,'[1]Step 1-What is changing'!$J:$J,0)),\"\",INDEX('Étape 1 – Ce qui change'!$X:$X,MATCH($A74,'[1]Step 1-What is changing'!$J:$J,0)))","v":""},{"$f":"IF(ISERROR(MATCH($A74,'[1]Step 1-What is changing'!$J:$J,0)),\"\",INDEX('Étape 1 – Ce qui change'!$Y:$Y,MATCH($A74,'[1]Step 1-What is changing'!$J:$J,0)))","v":""},{"$f":"IF(ISERROR(MATCH($A74,'[1]Step 1-What is changing'!$J:$J,0)),\"\",INDEX('Étape 1 – Ce qui change'!$Z:$Z,MATCH($A74,'[1]Step 1-What is changing'!$J:$J,0)))","v":""},{"$f":"IF(ISERROR(MATCH($A74,'[1]Step 1-What is changing'!$J:$J,0)),\"\",INDEX('Étape 1 – Ce qui change'!$AA:$AA,MATCH($A74,'[1]Step 1-What is changing'!$J:$J,0)))","v":""}]
[71,{"$f":"IF(ISERROR(MATCH($A75,'[1]Step 1-What is changing'!$J:$J,0)),\"\",INDEX('Étape 1 – Ce qui change'!$D:$D,MATCH($A75,'[1]Step 1-What is changing'!$J:$J,0))&\" - \"&INDEX('Étape 1 – Ce qui change'!$G:$G,MATCH($A75,'[1]Step 1-What is changing'!$J:$J,0)))","v":""},0,{"$error":"#DIV/0!"},"",{"$f":"IF(ISERROR(MATCH($A75,'[1]Step 1-What is changing'!$J:$J,0)),\"\",INDEX('Étape 1 – Ce qui change'!$I:$I,MATCH($A75,'[1]Step 1-What is changing'!$J:$J,0)))","v":""},{"$f":"IF(ISERROR(MATCH($A75,'[1]Step 1-What is changing'!$J:$J,0)),\"\",INDEX('Étape 1 – Ce qui change'!$J:$J,MATCH($A75,'[1]Step 1-What is changing'!$J:$J,0)))","v":""},"","","",{"$f":"IF(ISERROR(MATCH($A75,'[1]Step 1-What is changing'!$J:$J,0)),\"\",INDEX('Étape 1 – Ce qui change'!$N:$N,MATCH($A75,'[1]Step 1-What is changing'!$J:$J,0)))","v":""},{"$f":"IF(ISERROR(MATCH($A75,'[1]Step 1-What is changing'!$J:$J,0)),\"\",INDEX('Étape 1 – Ce qui change'!$O:$O,MATCH($A75,'[1]Step 1-What is changing'!$J:$J,0)))","v":""},{"$f":"IF(ISERROR(MATCH($A75,'[1]Step 1-What is changing'!$J:$J,0)),\"\",INDEX('Étape 1 – Ce qui change'!$P:$P,MATCH($A75,'[1]Step 1-What is changing'!$J:$J,0)))","v":""},{"$f":"IF(ISERROR(MATCH($A75,'[1]Step 1-What is changing'!$J:$J,0)),\"\",INDEX('Étape 1 – Ce qui change'!$Q:$Q,MATCH($A75,'[1]Step 1-What is changing'!$J:$J,0)))","v":""},{"$f":"IF(ISERROR(MATCH($A75,'[1]Step 1-What is changing'!$J:$J,0)),\"\",INDEX('Étape 1 – Ce qui change'!$R:$R,MATCH($A75,'[1]Step 1-What is changing'!$J:$J,0)))","v":""},{"$f":"IF(ISERROR(MATCH($A75,'[1]Step 1-What is changing'!$J:$J,0)),\"\",INDEX('Étape 1 – Ce qui change'!$S:$S,MATCH($A75,'[1]Step 1-What is changing'!$J:$J,0)))","v":""},{"$f":"IF(ISERROR(MATCH($A75,'[1]Step 1-What is changing'!$J:$J,0)),\"\",INDEX('Étape 1 – Ce qui change'!$T:$T,MATCH($A75,'[1]Step 1-What is changing'!$J:$J,0)))","v":""},{"$f":"IF(ISERROR(MATCH($A75,'[1]Step 1-What is changing'!$J:$J,0)),\"\",INDEX('Étape 1 – Ce qui change'!$U:$U,MATCH($A75,'[1]Step 1-What is changing'!$J:$J,0)))","v":""},{"$f":"IF(ISERROR(MATCH($A75,'[1]Step 1-What is changing'!$J:$J,0)),\"\",INDEX('Étape 1 – Ce qui change'!$V:$V,MATCH($A75,'[1]Step 1-What is changing'!$J:$J,0)))","v":""},{"$f":"IF(ISERROR(MATCH($A75,'[1]Step 1-What is changing'!$J:$J,0)),\"\",INDEX('Étape 1 – Ce qui change'!$W:$W,MATCH($A75,'[1]Step 1-What is changing'!$J:$J,0)))","v":""},{"$f":"IF(ISERROR(MATCH($A75,'[1]Step 1-What is changing'!$J:$J,0)),\"\",INDEX('Étape 1 – Ce qui change'!$X:$X,MATCH($A75,'[1]Step 1-What is changing'!$J:$J,0)))","v":""},{"$f":"IF(ISERROR(MATCH($A75,'[1]Step 1-What is changing'!$J:$J,0)),\"\",INDEX('Étape 1 – Ce qui change'!$Y:$Y,MATCH($A75,'[1]Step 1-What is changing'!$J:$J,0)))","v":""},{"$f":"IF(ISERROR(MATCH($A75,'[1]Step 1-What is changing'!$J:$J,0)),\"\",INDEX('Étape 1 – Ce qui change'!$Z:$Z,MATCH($A75,'[1]Step 1-What is changing'!$J:$J,0)))","v":""},{"$f":"IF(ISERROR(MATCH($A75,'[1]Step 1-What is changing'!$J:$J,0)),\"\",INDEX('Étape 1 – Ce qui change'!$AA:$AA,MATCH($A75,'[1]Step 1-What is changing'!$J:$J,0)))","v":""}]
[72,{"$f":"IF(ISERROR(MATCH($A76,'[1]Step 1-What is changing'!$J:$J,0)),\"\",INDEX('Étape 1 – Ce qui change'!$D:$D,MATCH($A76,'[1]Step 1-What is changing'!$J:$J,0))&\" - \"&INDEX('Étape 1 – Ce qui change'!$G:$G,MATCH($A76,'[1]Step 1-What is changing'!$J:$J,0)))","v":""},0,{"$error":"#DIV/0!"},"",{"$f":"IF(ISERROR(MATCH($A76,'[1]Step 1-What is changing'!$J:$J,0)),\"\",INDEX('Étape 1 – Ce qui change'!$I:$I,MATCH($A76,'[1]Step 1-What is changing'!$J:$J,0)))","v":""},{"$f":"IF(ISERROR(MATCH($A76,'[1]Step 1-What is changing'!$J:$J,0)),\"\",INDEX('Étape 1 – Ce qui change'!$J:$J,MATCH($A76,'[1]Step 1-What is changing'!$J:$J,0)))","v":""},"","","",{"$f":"IF(ISERROR(MATCH($A76,'[1]Step 1-What is changing'!$J:$J,0)),\"\",INDEX('Étape 1 – Ce qui change'!$N:$N,MATCH($A76,'[1]Step 1-What is changing'!$J:$J,0)))","v":""},{"$f":"IF(ISERROR(MATCH($A76,'[1]Step 1-What is changing'!$J:$J,0)),\"\",INDEX('Étape 1 – Ce qui change'!$O:$O,MATCH($A76,'[1]Step 1-What is changing'!$J:$J,0)))","v":""},{"$f":"IF(ISERROR(MATCH($A76,'[1]Step 1-What is changing'!$J:$J,0)),\"\",INDEX('Étape 1 – Ce qui change'!$P:$P,MATCH($A76,'[1]Step 1-What is changing'!$J:$J,0)))","v":""},{"$f":"IF(ISERROR(MATCH($A76,'[1]Step 1-What is changing'!$J:$J,0)),\"\",INDEX('Étape 1 – Ce qui change'!$Q:$Q,MATCH($A76,'[1]Step 1-What is changing'!$J:$J,0)))","v":""},{"$f":"IF(ISERROR(MATCH($A76,'[1]Step 1-What is changing'!$J:$J,0)),\"\",INDEX('Étape 1 – Ce qui change'!$R:$R,MATCH($A76,'[1]Step 1-What is changing'!$J:$J,0)))","v":""},{"$f":"IF(ISERROR(MATCH($A76,'[1]Step 1-What is changing'!$J:$J,0)),\"\",INDEX('Étape 1 – Ce qui change'!$S:$S,MATCH($A76,'[1]Step 1-What is changing'!$J:$J,0)))","v":""},{"$f":"IF(ISERROR(MATCH($A76,'[1]Step 1-What is changing'!$J:$J,0)),\"\",INDEX('Étape 1 – Ce qui change'!$T:$T,MATCH($A76,'[1]Step 1-What is changing'!$J:$J,0)))","v":""},{"$f":"IF(ISERROR(MATCH($A76,'[1]Step 1-What is changing'!$J:$J,0)),\"\",INDEX('Étape 1 – Ce qui change'!$U:$U,MATCH($A76,'[1]Step 1-What is changing'!$J:$J,0)))","v":""},{"$f":"IF(ISERROR(MATCH($A76,'[1]Step 1-What is changing'!$J:$J,0)),\"\",INDEX('Étape 1 – Ce qui change'!$V:$V,MATCH($A76,'[1]Step 1-What is changing'!$J:$J,0)))","v":""},{"$f":"IF(ISERROR(MATCH($A76,'[1]Step 1-What is changing'!$J:$J,0)),\"\",INDEX('Étape 1 – Ce qui change'!$W:$W,MATCH($A76,'[1]Step 1-What is changing'!$J:$J,0)))","v":""},{"$f":"IF(ISERROR(MATCH($A76,'[1]Step 1-What is changing'!$J:$J,0)),\"\",INDEX('Étape 1 – Ce qui change'!$X:$X,MATCH($A76,'[1]Step 1-What is changing'!$J:$J,0)))","v":""},{"$f":"IF(ISERROR(MATCH($A76,'[1]Step 1-What is changing'!$J:$J,0)),\"\",INDEX('Étape 1 – Ce qui change'!$Y:$Y,MATCH($A76,'[1]Step 1-What is changing'!$J:$J,0)))","v":""},{"$f":"IF(ISERROR(MATCH($A76,'[1]Step 1-What is changing'!$J:$J,0)),\"\",INDEX('Étape 1 – Ce qui change'!$Z:$Z,MATCH($A76,'[1]Step 1-What is changing'!$J:$J,0)))","v":""},{"$f":"IF(ISERROR(MATCH($A76,'[1]Step 1-What is changing'!$J:$J,0)),\"\",INDEX('Étape 1 – Ce qui change'!$AA:$AA,MATCH($A76,'[1]Step 1-What is changing'!$J:$J,0)))","v":""}]
[73,{"$f":"IF(ISERROR(MATCH($A77,'[1]Step 1-What is changing'!$J:$J,0)),\"\",INDEX('Étape 1 – Ce qui change'!$D:$D,MATCH($A77,'[1]Step 1-What is changing'!$J:$J,0))&\" - \"&INDEX('Étape 1 – Ce qui change'!$G:$G,MATCH($A77,'[1]Step 1-What is changing'!$J:$J,0)))","v":""},0,{"$error":"#DIV/0!"},"",{"$f":"IF(ISERROR(MATCH($A77,'[1]Step 1-What is changing'!$J:$J,0)),\"\",INDEX('Étape 1 – Ce qui change'!$I:$I,MATCH($A77,'[1]Step 1-What is changing'!$J:$J,0)))","v":""},{"$f":"IF(ISERROR(MATCH($A77,'[1]Step 1-What is changing'!$J:$J,0)),\"\",INDEX('Étape 1 – Ce qui change'!$J:$J,MATCH($A77,'[1]Step 1-What is changing'!$J:$J,0)))","v":""},"","","",{"$f":"IF(ISERROR(MATCH($A77,'[1]Step 1-What is changing'!$J:$J,0)),\"\",INDEX('Étape 1 – Ce qui change'!$N:$N,MATCH($A77,'[1]Step 1-What is changing'!$J:$J,0)))","v":""},{"$f":"IF(ISERROR(MATCH($A77,'[1]Step 1-What is changing'!$J:$J,0)),\"\",INDEX('Étape 1 – Ce qui change'!$O:$O,MATCH($A77,'[1]Step 1-What is changing'!$J:$J,0)))","v":""},{"$f":"IF(ISERROR(MATCH($A77,'[1]Step 1-What is changing'!$J:$J,0)),\"\",INDEX('Étape 1 – Ce qui change'!$P:$P,MATCH($A77,'[1]Step 1-What is changing'!$J:$J,0)))","v":""},{"$f":"IF(ISERROR(MATCH($A77,'[1]Step 1-What is changing'!$J:$J,0)),\"\",INDEX('Étape 1 – Ce qui change'!$Q:$Q,MATCH($A77,'[1]Step 1-What is changing'!$J:$J,0)))","v":""},{"$f":"IF(ISERROR(MATCH($A77,'[1]Step 1-What is changing'!$J:$J,0)),\"\",INDEX('Étape 1 – Ce qui change'!$R:$R,MATCH($A77,'[1]Step 1-What is changing'!$J:$J,0)))","v":""},{"$f":"IF(ISERROR(MATCH($A77,'[1]Step 1-What is changing'!$J:$J,0)),\"\",INDEX('Étape 1 – Ce qui change'!$S:$S,MATCH($A77,'[1]Step 1-What is changing'!$J:$J,0)))","v":""},{"$f":"IF(ISERROR(MATCH($A77,'[1]Step 1-What is changing'!$J:$J,0)),\"\",INDEX('Étape 1 – Ce qui change'!$T:$T,MATCH($A77,'[1]Step 1-What is changing'!$J:$J,0)))","v":""},{"$f":"IF(ISERROR(MATCH($A77,'[1]Step 1-What is changing'!$J:$J,0)),\"\",INDEX('Étape 1 – Ce qui change'!$U:$U,MATCH($A77,'[1]Step 1-What is changing'!$J:$J,0)))","v":""},{"$f":"IF(ISERROR(MATCH($A77,'[1]Step 1-What is changing'!$J:$J,0)),\"\",INDEX('Étape 1 – Ce qui change'!$V:$V,MATCH($A77,'[1]Step 1-What is changing'!$J:$J,0)))","v":""},{"$f":"IF(ISERROR(MATCH($A77,'[1]Step 1-What is changing'!$J:$J,0)),\"\",INDEX('Étape 1 – Ce qui change'!$W:$W,MATCH($A77,'[1]Step 1-What is changing'!$J:$J,0)))","v":""},{"$f":"IF(ISERROR(MATCH($A77,'[1]Step 1-What is changing'!$J:$J,0)),\"\",INDEX('Étape 1 – Ce qui change'!$X:$X,MATCH($A77,'[1]Step 1-What is changing'!$J:$J,0)))","v":""},{"$f":"IF(ISERROR(MATCH($A77,'[1]Step 1-What is changing'!$J:$J,0)),\"\",INDEX('Étape 1 – Ce qui change'!$Y:$Y,MATCH($A77,'[1]Step 1-What is changing'!$J:$J,0)))","v":""},{"$f":"IF(ISERROR(MATCH($A77,'[1]Step 1-What is changing'!$J:$J,0)),\"\",INDEX('Étape 1 – Ce qui change'!$Z:$Z,MATCH($A77,'[1]Step 1-What is changing'!$J:$J,0)))","v":""},{"$f":"IF(ISERROR(MATCH($A77,'[1]Step 1-What is changing'!$J:$J,0)),\"\",INDEX('Étape 1 – Ce qui change'!$AA:$AA,MATCH($A77,'[1]Step 1-What is changing'!$J:$J,0)))","v":""}]
[74,{"$f":"IF(ISERROR(MATCH($A78,'[1]Step 1-What is changing'!$J:$J,0)),\"\",INDEX('Étape 1 – Ce qui change'!$D:$D,MATCH($A78,'[1]Step 1-What is changing'!$J:$J,0))&\" - \"&INDEX('Étape 1 – Ce qui change'!$G:$G,MATCH($A78,'[1]Step 1-What is changing'!$J:$J,0)))","v":""},0,{"$error":"#DIV/0!"},"",{"$f":"IF(ISERROR(MATCH($A78,'[1]Step 1-What is changing'!$J:$J,0)),\"\",INDEX('Étape 1 – Ce qui change'!$I:$I,MATCH($A78,'[1]Step 1-What is changing'!$J:$J,0)))","v":""},{"$f":"IF(ISERROR(MATCH($A78,'[1]Step 1-What is changing'!$J:$J,0)),\"\",INDEX('Étape 1 – Ce qui change'!$J:$J,MATCH($A78,'[1]Step 1-What is changing'!$J:$J,0)))","v":""},"","","",{"$f":"IF(ISERROR(MATCH($A78,'[1]Step 1-What is changing'!$J:$J,0)),\"\",INDEX('Étape 1 – Ce qui change'!$N:$N,MATCH($A78,'[1]Step 1-What is changing'!$J:$J,0)))","v":""},{"$f":"IF(ISERROR(MATCH($A78,'[1]Step 1-What is changing'!$J:$J,0)),\"\",INDEX('Étape 1 – Ce qui change'!$O:$O,MATCH($A78,'[1]Step 1-What is changing'!$J:$J,0)))","v":""},{"$f":"IF(ISERROR(MATCH($A78,'[1]Step 1-What is changing'!$J:$J,0)),\"\",INDEX('Étape 1 – Ce qui change'!$P:$P,MATCH($A78,'[1]Step 1-What is changing'!$J:$J,0)))","v":""},{"$f":"IF(ISERROR(MATCH($A78,'[1]Step 1-What is changing'!$J:$J,0)),\"\",INDEX('Étape 1 – Ce qui change'!$Q:$Q,MATCH($A78,'[1]Step 1-What is changing'!$J:$J,0)))","v":""},{"$f":"IF(ISERROR(MATCH($A78,'[1]Step 1-What is changing'!$J:$J,0)),\"\",INDEX('Étape 1 – Ce qui change'!$R:$R,MATCH($A78,'[1]Step 1-What is changing'!$J:$J,0)))","v":""},{"$f":"IF(ISERROR(MATCH($A78,'[1]Step 1-What is changing'!$J:$J,0)),\"\",INDEX('Étape 1 – Ce qui change'!$S:$S,MATCH($A78,'[1]Step 1-What is changing'!$J:$J,0)))","v":""},{"$f":"IF(ISERROR(MATCH($A78,'[1]Step 1-What is changing'!$J:$J,0)),\"\",INDEX('Étape 1 – Ce qui change'!$T:$T,MATCH($A78,'[1]Step 1-What is changing'!$J:$J,0)))","v":""},{"$f":"IF(ISERROR(MATCH($A78,'[1]Step 1-What is changing'!$J:$J,0)),\"\",INDEX('Étape 1 – Ce qui change'!$U:$U,MATCH($A78,'[1]Step 1-What is changing'!$J:$J,0)))","v":""},{"$f":"IF(ISERROR(MATCH($A78,'[1]Step 1-What is changing'!$J:$J,0)),\"\",INDEX('Étape 1 – Ce qui change'!$V:$V,MATCH($A78,'[1]Step 1-What is changing'!$J:$J,0)))","v":""},{"$f":"IF(ISERROR(MATCH($A78,'[1]Step 1-What is changing'!$J:$J,0)),\"\",INDEX('Étape 1 – Ce qui change'!$W:$W,MATCH($A78,'[1]Step 1-What is changing'!$J:$J,0)))","v":""},{"$f":"IF(ISERROR(MATCH($A78,'[1]Step 1-What is changing'!$J:$J,0)),\"\",INDEX('Étape 1 – Ce qui change'!$X:$X,MATCH($A78,'[1]Step 1-What is changing'!$J:$J,0)))","v":""},{"$f":"IF(ISERROR(MATCH($A78,'[1]Step 1-What is changing'!$J:$J,0)),\"\",INDEX('Étape 1 – Ce qui change'!$Y:$Y,MATCH($A78,'[1]Step 1-What is changing'!$J:$J,0)))","v":""},{"$f":"IF(ISERROR(MATCH($A78,'[1]Step 1-What is changing'!$J:$J,0)),\"\",INDEX('Étape 1 – Ce qui change'!$Z:$Z,MATCH($A78,'[1]Step 1-What is changing'!$J:$J,0)))","v":""},{"$f":"IF(ISERROR(MATCH($A78,'[1]Step 1-What is changing'!$J:$J,0)),\"\",INDEX('Étape 1 – Ce qui change'!$AA:$AA,MATCH($A78,'[1]Step 1-What is changing'!$J:$J,0)))","v":""}]
[75,{"$f":"IF(ISERROR(MATCH($A79,'[1]Step 1-What is changing'!$J:$J,0)),\"\",INDEX('Étape 1 – Ce qui change'!$D:$D,MATCH($A79,'[1]Step 1-What is changing'!$J:$J,0))&\" - \"&INDEX('Étape 1 – Ce qui change'!$G:$G,MATCH($A79,'[1]Step 1-What is changing'!$J:$J,0)))","v":""},0,{"$error":"#DIV/0!"},"",{"$f":"IF(ISERROR(MATCH($A79,'[1]Step 1-What is changing'!$J:$J,0)),\"\",INDEX('Étape 1 – Ce qui change'!$I:$I,MATCH($A79,'[1]Step 1-What is changing'!$J:$J,0)))","v":""},{"$f":"IF(ISERROR(MATCH($A79,'[1]Step 1-What is changing'!$J:$J,0)),\"\",INDEX('Étape 1 – Ce qui change'!$J:$J,MATCH($A79,'[1]Step 1-What is changing'!$J:$J,0)))","v":""},"","","",{"$f":"IF(ISERROR(MATCH($A79,'[1]Step 1-What is changing'!$J:$J,0)),\"\",INDEX('Étape 1 – Ce qui change'!$N:$N,MATCH($A79,'[1]Step 1-What is changing'!$J:$J,0)))","v":""},{"$f":"IF(ISERROR(MATCH($A79,'[1]Step 1-What is changing'!$J:$J,0)),\"\",INDEX('Étape 1 – Ce qui change'!$O:$O,MATCH($A79,'[1]Step 1-What is changing'!$J:$J,0)))","v":""},{"$f":"IF(ISERROR(MATCH($A79,'[1]Step 1-What is changing'!$J:$J,0)),\"\",INDEX('Étape 1 – Ce qui change'!$P:$P,MATCH($A79,'[1]Step 1-What is changing'!$J:$J,0)))","v":""},{"$f":"IF(ISERROR(MATCH($A79,'[1]Step 1-What is changing'!$J:$J,0)),\"\",INDEX('Étape 1 – Ce qui change'!$Q:$Q,MATCH($A79,'[1]Step 1-What is changing'!$J:$J,0)))","v":""},{"$f":"IF(ISERROR(MATCH($A79,'[1]Step 1-What is changing'!$J:$J,0)),\"\",INDEX('Étape 1 – Ce qui change'!$R:$R,MATCH($A79,'[1]Step 1-What is changing'!$J:$J,0)))","v":""},{"$f":"IF(ISERROR(MATCH($A79,'[1]Step 1-What is changing'!$J:$J,0)),\"\",INDEX('Étape 1 – Ce qui change'!$S:$S,MATCH($A79,'[1]Step 1-What is changing'!$J:$J,0)))","v":""},{"$f":"IF(ISERROR(MATCH($A79,'[1]Step 1-What is changing'!$J:$J,0)),\"\",INDEX('Étape 1 – Ce qui change'!$T:$T,MATCH($A79,'[1]Step 1-What is changing'!$J:$J,0)))","v":""},{"$f":"IF(ISERROR(MATCH($A79,'[1]Step 1-What is changing'!$J:$J,0)),\"\",INDEX('Étape 1 – Ce qui change'!$U:$U,MATCH($A79,'[1]Step 1-What is changing'!$J:$J,0)))","v":""},{"$f":"IF(ISERROR(MATCH($A79,'[1]Step 1-What is changing'!$J:$J,0)),\"\",INDEX('Étape 1 – Ce qui change'!$V:$V,MATCH($A79,'[1]Step 1-What is changing'!$J:$J,0)))","v":""},{"$f":"IF(ISERROR(MATCH($A79,'[1]Step 1-What is changing'!$J:$J,0)),\"\",INDEX('Étape 1 – Ce qui change'!$W:$W,MATCH($A79,'[1]Step 1-What is changing'!$J:$J,0)))","v":""},{"$f":"IF(ISERROR(MATCH($A79,'[1]Step 1-What is changing'!$J:$J,0)),\"\",INDEX('Étape 1 – Ce qui change'!$X:$X,MATCH($A79,'[1]Step 1-What is changing'!$J:$J,0)))","v":""},{"$f":"IF(ISERROR(MATCH($A79,'[1]Step 1-What is changing'!$J:$J,0)),\"\",INDEX('Étape 1 – Ce qui change'!$Y:$Y,MATCH($A79,'[1]Step 1-What is changing'!$J:$J,0)))","v":""},{"$f":"IF(ISERROR(MATCH($A79,'[1]Step 1-What is changing'!$J:$J,0)),\"\",INDEX('Étape 1 – Ce qui change'!$Z:$Z,MATCH($A79,'[1]Step 1-What is changing'!$J:$J,0)))","v":""},{"$f":"IF(ISERROR(MATCH($A79,'[1]Step 1-What is changing'!$J:$J,0)),\"\",INDEX('Étape 1 – Ce qui change'!$AA:$AA,MATCH($A79,'[1]Step 1-What is changing'!$J:$J,0)))","v":""}]
[76,{"$f":"IF(ISERROR(MATCH($A80,'[1]Step 1-What is changing'!$J:$J,0)),\"\",INDEX('Étape 1 – Ce qui change'!$D:$D,MATCH($A80,'[1]Step 1-What is changing'!$J:$J,0))&\" - \"&INDEX('Étape 1 – Ce qui change'!$G:$G,MATCH($A80,'[1]Step 1-What is changing'!$J:$J,0)))","v":""},0,{"$error":"#DIV/0!"},"",{"$f":"IF(ISERROR(MATCH($A80,'[1]Step 1-What is changing'!$J:$J,0)),\"\",INDEX('Étape 1 – Ce qui change'!$I:$I,MATCH($A80,'[1]Step 1-What is changing'!$J:$J,0)))","v":""},{"$f":"IF(ISERROR(MATCH($A80,'[1]Step 1-What is changing'!$J:$J,0)),\"\",INDEX('Étape 1 – Ce qui change'!$J:$J,MATCH($A80,'[1]Step 1-What is changing'!$J:$J,0)))","v":""},"","","",{"$f":"IF(ISERROR(MATCH($A80,'[1]Step 1-What is changing'!$J:$J,0)),\"\",INDEX('Étape 1 – Ce qui change'!$N:$N,MATCH($A80,'[1]Step 1-What is changing'!$J:$J,0)))","v":""},{"$f":"IF(ISERROR(MATCH($A80,'[1]Step 1-What is changing'!$J:$J,0)),\"\",INDEX('Étape 1 – Ce qui change'!$O:$O,MATCH($A80,'[1]Step 1-What is changing'!$J:$J,0)))","v":""},{"$f":"IF(ISERROR(MATCH($A80,'[1]Step 1-What is changing'!$J:$J,0)),\"\",INDEX('Étape 1 – Ce qui change'!$P:$P,MATCH($A80,'[1]Step 1-What is changing'!$J:$J,0)))","v":""},{"$f":"IF(ISERROR(MATCH($A80,'[1]Step 1-What is changing'!$J:$J,0)),\"\",INDEX('Étape 1 – Ce qui change'!$Q:$Q,MATCH($A80,'[1]Step 1-What is changing'!$J:$J,0)))","v":""},{"$f":"IF(ISERROR(MATCH($A80,'[1]Step 1-What is changing'!$J:$J,0)),\"\",INDEX('Étape 1 – Ce qui change'!$R:$R,MATCH($A80,'[1]Step 1-What is changing'!$J:$J,0)))","v":""},{"$f":"IF(ISERROR(MATCH($A80,'[1]Step 1-What is changing'!$J:$J,0)),\"\",INDEX('Étape 1 – Ce qui change'!$S:$S,MATCH($A80,'[1]Step 1-What is changing'!$J:$J,0)))","v":""},{"$f":"IF(ISERROR(MATCH($A80,'[1]Step 1-What is changing'!$J:$J,0)),\"\",INDEX('Étape 1 – Ce qui change'!$T:$T,MATCH($A80,'[1]Step 1-What is changing'!$J:$J,0)))","v":""},{"$f":"IF(ISERROR(MATCH($A80,'[1]Step 1-What is changing'!$J:$J,0)),\"\",INDEX('Étape 1 – Ce qui change'!$U:$U,MATCH($A80,'[1]Step 1-What is changing'!$J:$J,0)))","v":""},{"$f":"IF(ISERROR(MATCH($A80,'[1]Step 1-What is changing'!$J:$J,0)),\"\",INDEX('Étape 1 – Ce qui change'!$V:$V,MATCH($A80,'[1]Step 1-What is changing'!$J:$J,0)))","v":""},{"$f":"IF(ISERROR(MATCH($A80,'[1]Step 1-What is changing'!$J:$J,0)),\"\",INDEX('Étape 1 – Ce qui change'!$W:$W,MATCH($A80,'[1]Step 1-What is changing'!$J:$J,0)))","v":""},{"$f":"IF(ISERROR(MATCH($A80,'[1]Step 1-What is changing'!$J:$J,0)),\"\",INDEX('Étape 1 – Ce qui change'!$X:$X,MATCH($A80,'[1]Step 1-What is changing'!$J:$J,0)))","v":""},{"$f":"IF(ISERROR(MATCH($A80,'[1]Step 1-What is changing'!$J:$J,0)),\"\",INDEX('Étape 1 – Ce qui change'!$Y:$Y,MATCH($A80,'[1]Step 1-What is changing'!$J:$J,0)))","v":""},{"$f":"IF(ISERROR(MATCH($A80,'[1]Step 1-What is changing'!$J:$J,0)),\"\",INDEX('Étape 1 – Ce qui change'!$Z:$Z,MATCH($A80,'[1]Step 1-What is changing'!$J:$J,0)))","v":""},{"$f":"IF(ISERROR(MATCH($A80,'[1]Step 1-What is changing'!$J:$J,0)),\"\",INDEX('Étape 1 – Ce qui change'!$AA:$AA,MATCH($A80,'[1]Step 1-What is changing'!$J:$J,0)))","v":""}]
[77,{"$f":"IF(ISERROR(MATCH($A81,'[1]Step 1-What is changing'!$J:$J,0)),\"\",INDEX('Étape 1 – Ce qui change'!$D:$D,MATCH($A81,'[1]Step 1-What is changing'!$J:$J,0))&\" - \"&INDEX('Étape 1 – Ce qui change'!$G:$G,MATCH($A81,'[1]Step 1-What is changing'!$J:$J,0)))","v":""},0,{"$error":"#DIV/0!"},"",{"$f":"IF(ISERROR(MATCH($A81,'[1]Step 1-What is changing'!$J:$J,0)),\"\",INDEX('Étape 1 – Ce qui change'!$I:$I,MATCH($A81,'[1]Step 1-What is changing'!$J:$J,0)))","v":""},{"$f":"IF(ISERROR(MATCH($A81,'[1]Step 1-What is changing'!$J:$J,0)),\"\",INDEX('Étape 1 – Ce qui change'!$J:$J,MATCH($A81,'[1]Step 1-What is changing'!$J:$J,0)))","v":""},"","","",{"$f":"IF(ISERROR(MATCH($A81,'[1]Step 1-What is changing'!$J:$J,0)),\"\",INDEX('Étape 1 – Ce qui change'!$N:$N,MATCH($A81,'[1]Step 1-What is changing'!$J:$J,0)))","v":""},{"$f":"IF(ISERROR(MATCH($A81,'[1]Step 1-What is changing'!$J:$J,0)),\"\",INDEX('Étape 1 – Ce qui change'!$O:$O,MATCH($A81,'[1]Step 1-What is changing'!$J:$J,0)))","v":""},{"$f":"IF(ISERROR(MATCH($A81,'[1]Step 1-What is changing'!$J:$J,0)),\"\",INDEX('Étape 1 – Ce qui change'!$P:$P,MATCH($A81,'[1]Step 1-What is changing'!$J:$J,0)))","v":""},{"$f":"IF(ISERROR(MATCH($A81,'[1]Step 1-What is changing'!$J:$J,0)),\"\",INDEX('Étape 1 – Ce qui change'!$Q:$Q,MATCH($A81,'[1]Step 1-What is changing'!$J:$J,0)))","v":""},{"$f":"IF(ISERROR(MATCH($A81,'[1]Step 1-What is changing'!$J:$J,0)),\"\",INDEX('Étape 1 – Ce qui change'!$R:$R,MATCH($A81,'[1]Step 1-What is changing'!$J:$J,0)))","v":""},{"$f":"IF(ISERROR(MATCH($A81,'[1]Step 1-What is changing'!$J:$J,0)),\"\",INDEX('Étape 1 – Ce qui change'!$S:$S,MATCH($A81,'[1]Step 1-What is changing'!$J:$J,0)))","v":""},{"$f":"IF(ISERROR(MATCH($A81,'[1]Step 1-What is changing'!$J:$J,0)),\"\",INDEX('Étape 1 – Ce qui change'!$T:$T,MATCH($A81,'[1]Step 1-What is changing'!$J:$J,0)))","v":""},{"$f":"IF(ISERROR(MATCH($A81,'[1]Step 1-What is changing'!$J:$J,0)),\"\",INDEX('Étape 1 – Ce qui change'!$U:$U,MATCH($A81,'[1]Step 1-What is changing'!$J:$J,0)))","v":""},{"$f":"IF(ISERROR(MATCH($A81,'[1]Step 1-What is changing'!$J:$J,0)),\"\",INDEX('Étape 1 – Ce qui change'!$V:$V,MATCH($A81,'[1]Step 1-What is changing'!$J:$J,0)))","v":""},{"$f":"IF(ISERROR(MATCH($A81,'[1]Step 1-What is changing'!$J:$J,0)),\"\",INDEX('Étape 1 – Ce qui change'!$W:$W,MATCH($A81,'[1]Step 1-What is changing'!$J:$J,0)))","v":""},{"$f":"IF(ISERROR(MATCH($A81,'[1]Step 1-What is changing'!$J:$J,0)),\"\",INDEX('Étape 1 – Ce qui change'!$X:$X,MATCH($A81,'[1]Step 1-What is changing'!$J:$J,0)))","v":""},{"$f":"IF(ISERROR(MATCH($A81,'[1]Step 1-What is changing'!$J:$J,0)),\"\",INDEX('Étape 1 – Ce qui change'!$Y:$Y,MATCH($A81,'[1]Step 1-What is changing'!$J:$J,0)))","v":""},{"$f":"IF(ISERROR(MATCH($A81,'[1]Step 1-What is changing'!$J:$J,0)),\"\",INDEX('Étape 1 – Ce qui change'!$Z:$Z,MATCH($A81,'[1]Step 1-What is changing'!$J:$J,0)))","v":""},{"$f":"IF(ISERROR(MATCH($A81,'[1]Step 1-What is changing'!$J:$J,0)),\"\",INDEX('Étape 1 – Ce qui change'!$AA:$AA,MATCH($A81,'[1]Step 1-What is changing'!$J:$J,0)))","v":""}]
[78,{"$f":"IF(ISERROR(MATCH($A82,'[1]Step 1-What is changing'!$J:$J,0)),\"\",INDEX('Étape 1 – Ce qui change'!$D:$D,MATCH($A82,'[1]Step 1-What is changing'!$J:$J,0))&\" - \"&INDEX('Étape 1 – Ce qui change'!$G:$G,MATCH($A82,'[1]Step 1-What is changing'!$J:$J,0)))","v":""},0,{"$error":"#DIV/0!"},"",{"$f":"IF(ISERROR(MATCH($A82,'[1]Step 1-What is changing'!$J:$J,0)),\"\",INDEX('Étape 1 – Ce qui change'!$I:$I,MATCH($A82,'[1]Step 1-What is changing'!$J:$J,0)))","v":""},{"$f":"IF(ISERROR(MATCH($A82,'[1]Step 1-What is changing'!$J:$J,0)),\"\",INDEX('Étape 1 – Ce qui change'!$J:$J,MATCH($A82,'[1]Step 1-What is changing'!$J:$J,0)))","v":""},"","","",{"$f":"IF(ISERROR(MATCH($A82,'[1]Step 1-What is changing'!$J:$J,0)),\"\",INDEX('Étape 1 – Ce qui change'!$N:$N,MATCH($A82,'[1]Step 1-What is changing'!$J:$J,0)))","v":""},{"$f":"IF(ISERROR(MATCH($A82,'[1]Step 1-What is changing'!$J:$J,0)),\"\",INDEX('Étape 1 – Ce qui change'!$O:$O,MATCH($A82,'[1]Step 1-What is changing'!$J:$J,0)))","v":""},{"$f":"IF(ISERROR(MATCH($A82,'[1]Step 1-What is changing'!$J:$J,0)),\"\",INDEX('Étape 1 – Ce qui change'!$P:$P,MATCH($A82,'[1]Step 1-What is changing'!$J:$J,0)))","v":""},{"$f":"IF(ISERROR(MATCH($A82,'[1]Step 1-What is changing'!$J:$J,0)),\"\",INDEX('Étape 1 – Ce qui change'!$Q:$Q,MATCH($A82,'[1]Step 1-What is changing'!$J:$J,0)))","v":""},{"$f":"IF(ISERROR(MATCH($A82,'[1]Step 1-What is changing'!$J:$J,0)),\"\",INDEX('Étape 1 – Ce qui change'!$R:$R,MATCH($A82,'[1]Step 1-What is changing'!$J:$J,0)))","v":""},{"$f":"IF(ISERROR(MATCH($A82,'[1]Step 1-What is changing'!$J:$J,0)),\"\",INDEX('Étape 1 – Ce qui change'!$S:$S,MATCH($A82,'[1]Step 1-What is changing'!$J:$J,0)))","v":""},{"$f":"IF(ISERROR(MATCH($A82,'[1]Step 1-What is changing'!$J:$J,0)),\"\",INDEX('Étape 1 – Ce qui change'!$T:$T,MATCH($A82,'[1]Step 1-What is changing'!$J:$J,0)))","v":""},{"$f":"IF(ISERROR(MATCH($A82,'[1]Step 1-What is changing'!$J:$J,0)),\"\",INDEX('Étape 1 – Ce qui change'!$U:$U,MATCH($A82,'[1]Step 1-What is changing'!$J:$J,0)))","v":""},{"$f":"IF(ISERROR(MATCH($A82,'[1]Step 1-What is changing'!$J:$J,0)),\"\",INDEX('Étape 1 – Ce qui change'!$V:$V,MATCH($A82,'[1]Step 1-What is changing'!$J:$J,0)))","v":""},{"$f":"IF(ISERROR(MATCH($A82,'[1]Step 1-What is changing'!$J:$J,0)),\"\",INDEX('Étape 1 – Ce qui change'!$W:$W,MATCH($A82,'[1]Step 1-What is changing'!$J:$J,0)))","v":""},{"$f":"IF(ISERROR(MATCH($A82,'[1]Step 1-What is changing'!$J:$J,0)),\"\",INDEX('Étape 1 – Ce qui change'!$X:$X,MATCH($A82,'[1]Step 1-What is changing'!$J:$J,0)))","v":""},{"$f":"IF(ISERROR(MATCH($A82,'[1]Step 1-What is changing'!$J:$J,0)),\"\",INDEX('Étape 1 – Ce qui change'!$Y:$Y,MATCH($A82,'[1]Step 1-What is changing'!$J:$J,0)))","v":""},{"$f":"IF(ISERROR(MATCH($A82,'[1]Step 1-What is changing'!$J:$J,0)),\"\",INDEX('Étape 1 – Ce qui change'!$Z:$Z,MATCH($A82,'[1]Step 1-What is changing'!$J:$J,0)))","v":""},{"$f":"IF(ISERROR(MATCH($A82,'[1]Step 1-What is changing'!$J:$J,0)),\"\",INDEX('Étape 1 – Ce qui change'!$AA:$AA,MATCH($A82,'[1]Step 1-What is changing'!$J:$J,0)))","v":""}]
[79,{"$f":"IF(ISERROR(MATCH($A83,'[1]Step 1-What is changing'!$J:$J,0)),\"\",INDEX('Étape 1 – Ce qui change'!$D:$D,MATCH($A83,'[1]Step 1-What is changing'!$J:$J,0))&\" - \"&INDEX('Étape 1 – Ce qui change'!$G:$G,MATCH($A83,'[1]Step 1-What is changing'!$J:$J,0)))","v":""},0,{"$error":"#DIV/0!"},"",{"$f":"IF(ISERROR(MATCH($A83,'[1]Step 1-What is changing'!$J:$J,0)),\"\",INDEX('Étape 1 – Ce qui change'!$I:$I,MATCH($A83,'[1]Step 1-What is changing'!$J:$J,0)))","v":""},{"$f":"IF(ISERROR(MATCH($A83,'[1]Step 1-What is changing'!$J:$J,0)),\"\",INDEX('Étape 1 – Ce qui change'!$J:$J,MATCH($A83,'[1]Step 1-What is changing'!$J:$J,0)))","v":""},"","","",{"$f":"IF(ISERROR(MATCH($A83,'[1]Step 1-What is changing'!$J:$J,0)),\"\",INDEX('Étape 1 – Ce qui change'!$N:$N,MATCH($A83,'[1]Step 1-What is changing'!$J:$J,0)))","v":""},{"$f":"IF(ISERROR(MATCH($A83,'[1]Step 1-What is changing'!$J:$J,0)),\"\",INDEX('Étape 1 – Ce qui change'!$O:$O,MATCH($A83,'[1]Step 1-What is changing'!$J:$J,0)))","v":""},{"$f":"IF(ISERROR(MATCH($A83,'[1]Step 1-What is changing'!$J:$J,0)),\"\",INDEX('Étape 1 – Ce qui change'!$P:$P,MATCH($A83,'[1]Step 1-What is changing'!$J:$J,0)))","v":""},{"$f":"IF(ISERROR(MATCH($A83,'[1]Step 1-What is changing'!$J:$J,0)),\"\",INDEX('Étape 1 – Ce qui change'!$Q:$Q,MATCH($A83,'[1]Step 1-What is changing'!$J:$J,0)))","v":""},{"$f":"IF(ISERROR(MATCH($A83,'[1]Step 1-What is changing'!$J:$J,0)),\"\",INDEX('Étape 1 – Ce qui change'!$R:$R,MATCH($A83,'[1]Step 1-What is changing'!$J:$J,0)))","v":""},{"$f":"IF(ISERROR(MATCH($A83,'[1]Step 1-What is changing'!$J:$J,0)),\"\",INDEX('Étape 1 – Ce qui change'!$S:$S,MATCH($A83,'[1]Step 1-What is changing'!$J:$J,0)))","v":""},{"$f":"IF(ISERROR(MATCH($A83,'[1]Step 1-What is changing'!$J:$J,0)),\"\",INDEX('Étape 1 – Ce qui change'!$T:$T,MATCH($A83,'[1]Step 1-What is changing'!$J:$J,0)))","v":""},{"$f":"IF(ISERROR(MATCH($A83,'[1]Step 1-What is changing'!$J:$J,0)),\"\",INDEX('Étape 1 – Ce qui change'!$U:$U,MATCH($A83,'[1]Step 1-What is changing'!$J:$J,0)))","v":""},{"$f":"IF(ISERROR(MATCH($A83,'[1]Step 1-What is changing'!$J:$J,0)),\"\",INDEX('Étape 1 – Ce qui change'!$V:$V,MATCH($A83,'[1]Step 1-What is changing'!$J:$J,0)))","v":""},{"$f":"IF(ISERROR(MATCH($A83,'[1]Step 1-What is changing'!$J:$J,0)),\"\",INDEX('Étape 1 – Ce qui change'!$W:$W,MATCH($A83,'[1]Step 1-What is changing'!$J:$J,0)))","v":""},{"$f":"IF(ISERROR(MATCH($A83,'[1]Step 1-What is changing'!$J:$J,0)),\"\",INDEX('Étape 1 – Ce qui change'!$X:$X,MATCH($A83,'[1]Step 1-What is changing'!$J:$J,0)))","v":""},{"$f":"IF(ISERROR(MATCH($A83,'[1]Step 1-What is changing'!$J:$J,0)),\"\",INDEX('Étape 1 – Ce qui change'!$Y:$Y,MATCH($A83,'[1]Step 1-What is changing'!$J:$J,0)))","v":""},{"$f":"IF(ISERROR(MATCH($A83,'[1]Step 1-What is changing'!$J:$J,0)),\"\",INDEX('Étape 1 – Ce qui change'!$Z:$Z,MATCH($A83,'[1]Step 1-What is changing'!$J:$J,0)))","v":""},{"$f":"IF(ISERROR(MATCH($A83,'[1]Step 1-What is changing'!$J:$J,0)),\"\",INDEX('Étape 1 – Ce qui change'!$AA:$AA,MATCH($A83,'[1]Step 1-What is changing'!$J:$J,0)))","v":""}]
[80,{"$f":"IF(ISERROR(MATCH($A84,'[1]Step 1-What is changing'!$J:$J,0)),\"\",INDEX('Étape 1 – Ce qui change'!$D:$D,MATCH($A84,'[1]Step 1-What is changing'!$J:$J,0))&\" - \"&INDEX('Étape 1 – Ce qui change'!$G:$G,MATCH($A84,'[1]Step 1-What is changing'!$J:$J,0)))","v":""},0,{"$error":"#DIV/0!"},"",{"$f":"IF(ISERROR(MATCH($A84,'[1]Step 1-What is changing'!$J:$J,0)),\"\",INDEX('Étape 1 – Ce qui change'!$I:$I,MATCH($A84,'[1]Step 1-What is changing'!$J:$J,0)))","v":""},{"$f":"IF(ISERROR(MATCH($A84,'[1]Step 1-What is changing'!$J:$J,0)),\"\",INDEX('Étape 1 – Ce qui change'!$J:$J,MATCH($A84,'[1]Step 1-What is changing'!$J:$J,0)))","v":""},"","","",{"$f":"IF(ISERROR(MATCH($A84,'[1]Step 1-What is changing'!$J:$J,0)),\"\",INDEX('Étape 1 – Ce qui change'!$N:$N,MATCH($A84,'[1]Step 1-What is changing'!$J:$J,0)))","v":""},{"$f":"IF(ISERROR(MATCH($A84,'[1]Step 1-What is changing'!$J:$J,0)),\"\",INDEX('Étape 1 – Ce qui change'!$O:$O,MATCH($A84,'[1]Step 1-What is changing'!$J:$J,0)))","v":""},{"$f":"IF(ISERROR(MATCH($A84,'[1]Step 1-What is changing'!$J:$J,0)),\"\",INDEX('Étape 1 – Ce qui change'!$P:$P,MATCH($A84,'[1]Step 1-What is changing'!$J:$J,0)))","v":""},{"$f":"IF(ISERROR(MATCH($A84,'[1]Step 1-What is changing'!$J:$J,0)),\"\",INDEX('Étape 1 – Ce qui change'!$Q:$Q,MATCH($A84,'[1]Step 1-What is changing'!$J:$J,0)))","v":""},{"$f":"IF(ISERROR(MATCH($A84,'[1]Step 1-What is changing'!$J:$J,0)),\"\",INDEX('Étape 1 – Ce qui change'!$R:$R,MATCH($A84,'[1]Step 1-What is changing'!$J:$J,0)))","v":""},{"$f":"IF(ISERROR(MATCH($A84,'[1]Step 1-What is changing'!$J:$J,0)),\"\",INDEX('Étape 1 – Ce qui change'!$S:$S,MATCH($A84,'[1]Step 1-What is changing'!$J:$J,0)))","v":""},{"$f":"IF(ISERROR(MATCH($A84,'[1]Step 1-What is changing'!$J:$J,0)),\"\",INDEX('Étape 1 – Ce qui change'!$T:$T,MATCH($A84,'[1]Step 1-What is changing'!$J:$J,0)))","v":""},{"$f":"IF(ISERROR(MATCH($A84,'[1]Step 1-What is changing'!$J:$J,0)),\"\",INDEX('Étape 1 – Ce qui change'!$U:$U,MATCH($A84,'[1]Step 1-What is changing'!$J:$J,0)))","v":""},{"$f":"IF(ISERROR(MATCH($A84,'[1]Step 1-What is changing'!$J:$J,0)),\"\",INDEX('Étape 1 – Ce qui change'!$V:$V,MATCH($A84,'[1]Step 1-What is changing'!$J:$J,0)))","v":""},{"$f":"IF(ISERROR(MATCH($A84,'[1]Step 1-What is changing'!$J:$J,0)),\"\",INDEX('Étape 1 – Ce qui change'!$W:$W,MATCH($A84,'[1]Step 1-What is changing'!$J:$J,0)))","v":""},{"$f":"IF(ISERROR(MATCH($A84,'[1]Step 1-What is changing'!$J:$J,0)),\"\",INDEX('Étape 1 – Ce qui change'!$X:$X,MATCH($A84,'[1]Step 1-What is changing'!$J:$J,0)))","v":""},{"$f":"IF(ISERROR(MATCH($A84,'[1]Step 1-What is changing'!$J:$J,0)),\"\",INDEX('Étape 1 – Ce qui change'!$Y:$Y,MATCH($A84,'[1]Step 1-What is changing'!$J:$J,0)))","v":""},{"$f":"IF(ISERROR(MATCH($A84,'[1]Step 1-What is changing'!$J:$J,0)),\"\",INDEX('Étape 1 – Ce qui change'!$Z:$Z,MATCH($A84,'[1]Step 1-What is changing'!$J:$J,0)))","v":""},{"$f":"IF(ISERROR(MATCH($A84,'[1]Step 1-What is changing'!$J:$J,0)),\"\",INDEX('Étape 1 – Ce qui change'!$AA:$AA,MATCH($A84,'[1]Step 1-What is changing'!$J:$J,0)))","v":""}]
[81,{"$f":"IF(ISERROR(MATCH($A85,'[1]Step 1-What is changing'!$J:$J,0)),\"\",INDEX('Étape 1 – Ce qui change'!$D:$D,MATCH($A85,'[1]Step 1-What is changing'!$J:$J,0))&\" - \"&INDEX('Étape 1 – Ce qui change'!$G:$G,MATCH($A85,'[1]Step 1-What is changing'!$J:$J,0)))","v":""},0,{"$error":"#DIV/0!"},"",{"$f":"IF(ISERROR(MATCH($A85,'[1]Step 1-What is changing'!$J:$J,0)),\"\",INDEX('Étape 1 – Ce qui change'!$I:$I,MATCH($A85,'[1]Step 1-What is changing'!$J:$J,0)))","v":""},{"$f":"IF(ISERROR(MATCH($A85,'[1]Step 1-What is changing'!$J:$J,0)),\"\",INDEX('Étape 1 – Ce qui change'!$J:$J,MATCH($A85,'[1]Step 1-What is changing'!$J:$J,0)))","v":""},"","","",{"$f":"IF(ISERROR(MATCH($A85,'[1]Step 1-What is changing'!$J:$J,0)),\"\",INDEX('Étape 1 – Ce qui change'!$N:$N,MATCH($A85,'[1]Step 1-What is changing'!$J:$J,0)))","v":""},{"$f":"IF(ISERROR(MATCH($A85,'[1]Step 1-What is changing'!$J:$J,0)),\"\",INDEX('Étape 1 – Ce qui change'!$O:$O,MATCH($A85,'[1]Step 1-What is changing'!$J:$J,0)))","v":""},{"$f":"IF(ISERROR(MATCH($A85,'[1]Step 1-What is changing'!$J:$J,0)),\"\",INDEX('Étape 1 – Ce qui change'!$P:$P,MATCH($A85,'[1]Step 1-What is changing'!$J:$J,0)))","v":""},{"$f":"IF(ISERROR(MATCH($A85,'[1]Step 1-What is changing'!$J:$J,0)),\"\",INDEX('Étape 1 – Ce qui change'!$Q:$Q,MATCH($A85,'[1]Step 1-What is changing'!$J:$J,0)))","v":""},{"$f":"IF(ISERROR(MATCH($A85,'[1]Step 1-What is changing'!$J:$J,0)),\"\",INDEX('Étape 1 – Ce qui change'!$R:$R,MATCH($A85,'[1]Step 1-What is changing'!$J:$J,0)))","v":""},{"$f":"IF(ISERROR(MATCH($A85,'[1]Step 1-What is changing'!$J:$J,0)),\"\",INDEX('Étape 1 – Ce qui change'!$S:$S,MATCH($A85,'[1]Step 1-What is changing'!$J:$J,0)))","v":""},{"$f":"IF(ISERROR(MATCH($A85,'[1]Step 1-What is changing'!$J:$J,0)),\"\",INDEX('Étape 1 – Ce qui change'!$T:$T,MATCH($A85,'[1]Step 1-What is changing'!$J:$J,0)))","v":""},{"$f":"IF(ISERROR(MATCH($A85,'[1]Step 1-What is changing'!$J:$J,0)),\"\",INDEX('Étape 1 – Ce qui change'!$U:$U,MATCH($A85,'[1]Step 1-What is changing'!$J:$J,0)))","v":""},{"$f":"IF(ISERROR(MATCH($A85,'[1]Step 1-What is changing'!$J:$J,0)),\"\",INDEX('Étape 1 – Ce qui change'!$V:$V,MATCH($A85,'[1]Step 1-What is changing'!$J:$J,0)))","v":""},{"$f":"IF(ISERROR(MATCH($A85,'[1]Step 1-What is changing'!$J:$J,0)),\"\",INDEX('Étape 1 – Ce qui change'!$W:$W,MATCH($A85,'[1]Step 1-What is changing'!$J:$J,0)))","v":""},{"$f":"IF(ISERROR(MATCH($A85,'[1]Step 1-What is changing'!$J:$J,0)),\"\",INDEX('Étape 1 – Ce qui change'!$X:$X,MATCH($A85,'[1]Step 1-What is changing'!$J:$J,0)))","v":""},{"$f":"IF(ISERROR(MATCH($A85,'[1]Step 1-What is changing'!$J:$J,0)),\"\",INDEX('Étape 1 – Ce qui change'!$Y:$Y,MATCH($A85,'[1]Step 1-What is changing'!$J:$J,0)))","v":""},{"$f":"IF(ISERROR(MATCH($A85,'[1]Step 1-What is changing'!$J:$J,0)),\"\",INDEX('Étape 1 – Ce qui change'!$Z:$Z,MATCH($A85,'[1]Step 1-What is changing'!$J:$J,0)))","v":""},{"$f":"IF(ISERROR(MATCH($A85,'[1]Step 1-What is changing'!$J:$J,0)),\"\",INDEX('Étape 1 – Ce qui change'!$AA:$AA,MATCH($A85,'[1]Step 1-What is changing'!$J:$J,0)))","v":""}]
[82,{"$f":"IF(ISERROR(MATCH($A86,'[1]Step 1-What is changing'!$J:$J,0)),\"\",INDEX('Étape 1 – Ce qui change'!$D:$D,MATCH($A86,'[1]Step 1-What is changing'!$J:$J,0))&\" - \"&INDEX('Étape 1 – Ce qui change'!$G:$G,MATCH($A86,'[1]Step 1-What is changing'!$J:$J,0)))","v":""},0,{"$error":"#DIV/0!"},"",{"$f":"IF(ISERROR(MATCH($A86,'[1]Step 1-What is changing'!$J:$J,0)),\"\",INDEX('Étape 1 – Ce qui change'!$I:$I,MATCH($A86,'[1]Step 1-What is changing'!$J:$J,0)))","v":""},{"$f":"IF(ISERROR(MATCH($A86,'[1]Step 1-What is changing'!$J:$J,0)),\"\",INDEX('Étape 1 – Ce qui change'!$J:$J,MATCH($A86,'[1]Step 1-What is changing'!$J:$J,0)))","v":""},"","","",{"$f":"IF(ISERROR(MATCH($A86,'[1]Step 1-What is changing'!$J:$J,0)),\"\",INDEX('Étape 1 – Ce qui change'!$N:$N,MATCH($A86,'[1]Step 1-What is changing'!$J:$J,0)))","v":""},{"$f":"IF(ISERROR(MATCH($A86,'[1]Step 1-What is changing'!$J:$J,0)),\"\",INDEX('Étape 1 – Ce qui change'!$O:$O,MATCH($A86,'[1]Step 1-What is changing'!$J:$J,0)))","v":""},{"$f":"IF(ISERROR(MATCH($A86,'[1]Step 1-What is changing'!$J:$J,0)),\"\",INDEX('Étape 1 – Ce qui change'!$P:$P,MATCH($A86,'[1]Step 1-What is changing'!$J:$J,0)))","v":""},{"$f":"IF(ISERROR(MATCH($A86,'[1]Step 1-What is changing'!$J:$J,0)),\"\",INDEX('Étape 1 – Ce qui change'!$Q:$Q,MATCH($A86,'[1]Step 1-What is changing'!$J:$J,0)))","v":""},{"$f":"IF(ISERROR(MATCH($A86,'[1]Step 1-What is changing'!$J:$J,0)),\"\",INDEX('Étape 1 – Ce qui change'!$R:$R,MATCH($A86,'[1]Step 1-What is changing'!$J:$J,0)))","v":""},{"$f":"IF(ISERROR(MATCH($A86,'[1]Step 1-What is changing'!$J:$J,0)),\"\",INDEX('Étape 1 – Ce qui change'!$S:$S,MATCH($A86,'[1]Step 1-What is changing'!$J:$J,0)))","v":""},{"$f":"IF(ISERROR(MATCH($A86,'[1]Step 1-What is changing'!$J:$J,0)),\"\",INDEX('Étape 1 – Ce qui change'!$T:$T,MATCH($A86,'[1]Step 1-What is changing'!$J:$J,0)))","v":""},{"$f":"IF(ISERROR(MATCH($A86,'[1]Step 1-What is changing'!$J:$J,0)),\"\",INDEX('Étape 1 – Ce qui change'!$U:$U,MATCH($A86,'[1]Step 1-What is changing'!$J:$J,0)))","v":""},{"$f":"IF(ISERROR(MATCH($A86,'[1]Step 1-What is changing'!$J:$J,0)),\"\",INDEX('Étape 1 – Ce qui change'!$V:$V,MATCH($A86,'[1]Step 1-What is changing'!$J:$J,0)))","v":""},{"$f":"IF(ISERROR(MATCH($A86,'[1]Step 1-What is changing'!$J:$J,0)),\"\",INDEX('Étape 1 – Ce qui change'!$W:$W,MATCH($A86,'[1]Step 1-What is changing'!$J:$J,0)))","v":""},{"$f":"IF(ISERROR(MATCH($A86,'[1]Step 1-What is changing'!$J:$J,0)),\"\",INDEX('Étape 1 – Ce qui change'!$X:$X,MATCH($A86,'[1]Step 1-What is changing'!$J:$J,0)))","v":""},{"$f":"IF(ISERROR(MATCH($A86,'[1]Step 1-What is changing'!$J:$J,0)),\"\",INDEX('Étape 1 – Ce qui change'!$Y:$Y,MATCH($A86,'[1]Step 1-What is changing'!$J:$J,0)))","v":""},{"$f":"IF(ISERROR(MATCH($A86,'[1]Step 1-What is changing'!$J:$J,0)),\"\",INDEX('Étape 1 – Ce qui change'!$Z:$Z,MATCH($A86,'[1]Step 1-What is changing'!$J:$J,0)))","v":""},{"$f":"IF(ISERROR(MATCH($A86,'[1]Step 1-What is changing'!$J:$J,0)),\"\",INDEX('Étape 1 – Ce qui change'!$AA:$AA,MATCH($A86,'[1]Step 1-What is changing'!$J:$J,0)))","v":""}]
[83,{"$f":"IF(ISERROR(MATCH($A87,'[1]Step 1-What is changing'!$J:$J,0)),\"\",INDEX('Étape 1 – Ce qui change'!$D:$D,MATCH($A87,'[1]Step 1-What is changing'!$J:$J,0))&\" - \"&INDEX('Étape 1 – Ce qui change'!$G:$G,MATCH($A87,'[1]Step 1-What is changing'!$J:$J,0)))","v":""},0,{"$error":"#DIV/0!"},"",{"$f":"IF(ISERROR(MATCH($A87,'[1]Step 1-What is changing'!$J:$J,0)),\"\",INDEX('Étape 1 – Ce qui change'!$I:$I,MATCH($A87,'[1]Step 1-What is changing'!$J:$J,0)))","v":""},{"$f":"IF(ISERROR(MATCH($A87,'[1]Step 1-What is changing'!$J:$J,0)),\"\",INDEX('Étape 1 – Ce qui change'!$J:$J,MATCH($A87,'[1]Step 1-What is changing'!$J:$J,0)))","v":""},"","","",{"$f":"IF(ISERROR(MATCH($A87,'[1]Step 1-What is changing'!$J:$J,0)),\"\",INDEX('Étape 1 – Ce qui change'!$N:$N,MATCH($A87,'[1]Step 1-What is changing'!$J:$J,0)))","v":""},{"$f":"IF(ISERROR(MATCH($A87,'[1]Step 1-What is changing'!$J:$J,0)),\"\",INDEX('Étape 1 – Ce qui change'!$O:$O,MATCH($A87,'[1]Step 1-What is changing'!$J:$J,0)))","v":""},{"$f":"IF(ISERROR(MATCH($A87,'[1]Step 1-What is changing'!$J:$J,0)),\"\",INDEX('Étape 1 – Ce qui change'!$P:$P,MATCH($A87,'[1]Step 1-What is changing'!$J:$J,0)))","v":""},{"$f":"IF(ISERROR(MATCH($A87,'[1]Step 1-What is changing'!$J:$J,0)),\"\",INDEX('Étape 1 – Ce qui change'!$Q:$Q,MATCH($A87,'[1]Step 1-What is changing'!$J:$J,0)))","v":""},{"$f":"IF(ISERROR(MATCH($A87,'[1]Step 1-What is changing'!$J:$J,0)),\"\",INDEX('Étape 1 – Ce qui change'!$R:$R,MATCH($A87,'[1]Step 1-What is changing'!$J:$J,0)))","v":""},{"$f":"IF(ISERROR(MATCH($A87,'[1]Step 1-What is changing'!$J:$J,0)),\"\",INDEX('Étape 1 – Ce qui change'!$S:$S,MATCH($A87,'[1]Step 1-What is changing'!$J:$J,0)))","v":""},{"$f":"IF(ISERROR(MATCH($A87,'[1]Step 1-What is changing'!$J:$J,0)),\"\",INDEX('Étape 1 – Ce qui change'!$T:$T,MATCH($A87,'[1]Step 1-What is changing'!$J:$J,0)))","v":""},{"$f":"IF(ISERROR(MATCH($A87,'[1]Step 1-What is changing'!$J:$J,0)),\"\",INDEX('Étape 1 – Ce qui change'!$U:$U,MATCH($A87,'[1]Step 1-What is changing'!$J:$J,0)))","v":""},{"$f":"IF(ISERROR(MATCH($A87,'[1]Step 1-What is changing'!$J:$J,0)),\"\",INDEX('Étape 1 – Ce qui change'!$V:$V,MATCH($A87,'[1]Step 1-What is changing'!$J:$J,0)))","v":""},{"$f":"IF(ISERROR(MATCH($A87,'[1]Step 1-What is changing'!$J:$J,0)),\"\",INDEX('Étape 1 – Ce qui change'!$W:$W,MATCH($A87,'[1]Step 1-What is changing'!$J:$J,0)))","v":""},{"$f":"IF(ISERROR(MATCH($A87,'[1]Step 1-What is changing'!$J:$J,0)),\"\",INDEX('Étape 1 – Ce qui change'!$X:$X,MATCH($A87,'[1]Step 1-What is changing'!$J:$J,0)))","v":""},{"$f":"IF(ISERROR(MATCH($A87,'[1]Step 1-What is changing'!$J:$J,0)),\"\",INDEX('Étape 1 – Ce qui change'!$Y:$Y,MATCH($A87,'[1]Step 1-What is changing'!$J:$J,0)))","v":""},{"$f":"IF(ISERROR(MATCH($A87,'[1]Step 1-What is changing'!$J:$J,0)),\"\",INDEX('Étape 1 – Ce qui change'!$Z:$Z,MATCH($A87,'[1]Step 1-What is changing'!$J:$J,0)))","v":""},{"$f":"IF(ISERROR(MATCH($A87,'[1]Step 1-What is changing'!$J:$J,0)),\"\",INDEX('Étape 1 – Ce qui change'!$AA:$AA,MATCH($A87,'[1]Step 1-What is changing'!$J:$J,0)))","v":""}]
[84,{"$f":"IF(ISERROR(MATCH($A88,'[1]Step 1-What is changing'!$J:$J,0)),\"\",INDEX('Étape 1 – Ce qui change'!$D:$D,MATCH($A88,'[1]Step 1-What is changing'!$J:$J,0))&\" - \"&INDEX('Étape 1 – Ce qui change'!$G:$G,MATCH($A88,'[1]Step 1-What is changing'!$J:$J,0)))","v":""},0,{"$error":"#DIV/0!"},"",{"$f":"IF(ISERROR(MATCH($A88,'[1]Step 1-What is changing'!$J:$J,0)),\"\",INDEX('Étape 1 – Ce qui change'!$I:$I,MATCH($A88,'[1]Step 1-What is changing'!$J:$J,0)))","v":""},{"$f":"IF(ISERROR(MATCH($A88,'[1]Step 1-What is changing'!$J:$J,0)),\"\",INDEX('Étape 1 – Ce qui change'!$J:$J,MATCH($A88,'[1]Step 1-What is changing'!$J:$J,0)))","v":""},"","","",{"$f":"IF(ISERROR(MATCH($A88,'[1]Step 1-What is changing'!$J:$J,0)),\"\",INDEX('Étape 1 – Ce qui change'!$N:$N,MATCH($A88,'[1]Step 1-What is changing'!$J:$J,0)))","v":""},{"$f":"IF(ISERROR(MATCH($A88,'[1]Step 1-What is changing'!$J:$J,0)),\"\",INDEX('Étape 1 – Ce qui change'!$O:$O,MATCH($A88,'[1]Step 1-What is changing'!$J:$J,0)))","v":""},{"$f":"IF(ISERROR(MATCH($A88,'[1]Step 1-What is changing'!$J:$J,0)),\"\",INDEX('Étape 1 – Ce qui change'!$P:$P,MATCH($A88,'[1]Step 1-What is changing'!$J:$J,0)))","v":""},{"$f":"IF(ISERROR(MATCH($A88,'[1]Step 1-What is changing'!$J:$J,0)),\"\",INDEX('Étape 1 – Ce qui change'!$Q:$Q,MATCH($A88,'[1]Step 1-What is changing'!$J:$J,0)))","v":""},{"$f":"IF(ISERROR(MATCH($A88,'[1]Step 1-What is changing'!$J:$J,0)),\"\",INDEX('Étape 1 – Ce qui change'!$R:$R,MATCH($A88,'[1]Step 1-What is changing'!$J:$J,0)))","v":""},{"$f":"IF(ISERROR(MATCH($A88,'[1]Step 1-What is changing'!$J:$J,0)),\"\",INDEX('Étape 1 – Ce qui change'!$S:$S,MATCH($A88,'[1]Step 1-What is changing'!$J:$J,0)))","v":""},{"$f":"IF(ISERROR(MATCH($A88,'[1]Step 1-What is changing'!$J:$J,0)),\"\",INDEX('Étape 1 – Ce qui change'!$T:$T,MATCH($A88,'[1]Step 1-What is changing'!$J:$J,0)))","v":""},{"$f":"IF(ISERROR(MATCH($A88,'[1]Step 1-What is changing'!$J:$J,0)),\"\",INDEX('Étape 1 – Ce qui change'!$U:$U,MATCH($A88,'[1]Step 1-What is changing'!$J:$J,0)))","v":""},{"$f":"IF(ISERROR(MATCH($A88,'[1]Step 1-What is changing'!$J:$J,0)),\"\",INDEX('Étape 1 – Ce qui change'!$V:$V,MATCH($A88,'[1]Step 1-What is changing'!$J:$J,0)))","v":""},{"$f":"IF(ISERROR(MATCH($A88,'[1]Step 1-What is changing'!$J:$J,0)),\"\",INDEX('Étape 1 – Ce qui change'!$W:$W,MATCH($A88,'[1]Step 1-What is changing'!$J:$J,0)))","v":""},{"$f":"IF(ISERROR(MATCH($A88,'[1]Step 1-What is changing'!$J:$J,0)),\"\",INDEX('Étape 1 – Ce qui change'!$X:$X,MATCH($A88,'[1]Step 1-What is changing'!$J:$J,0)))","v":""},{"$f":"IF(ISERROR(MATCH($A88,'[1]Step 1-What is changing'!$J:$J,0)),\"\",INDEX('Étape 1 – Ce qui change'!$Y:$Y,MATCH($A88,'[1]Step 1-What is changing'!$J:$J,0)))","v":""},{"$f":"IF(ISERROR(MATCH($A88,'[1]Step 1-What is changing'!$J:$J,0)),\"\",INDEX('Étape 1 – Ce qui change'!$Z:$Z,MATCH($A88,'[1]Step 1-What is changing'!$J:$J,0)))","v":""},{"$f":"IF(ISERROR(MATCH($A88,'[1]Step 1-What is changing'!$J:$J,0)),\"\",INDEX('Étape 1 – Ce qui change'!$AA:$AA,MATCH($A88,'[1]Step 1-What is changing'!$J:$J,0)))","v":""}]
[85,{"$f":"IF(ISERROR(MATCH($A89,'[1]Step 1-What is changing'!$J:$J,0)),\"\",INDEX('Étape 1 – Ce qui change'!$D:$D,MATCH($A89,'[1]Step 1-What is changing'!$J:$J,0))&\" - \"&INDEX('Étape 1 – Ce qui change'!$G:$G,MATCH($A89,'[1]Step 1-What is changing'!$J:$J,0)))","v":""},0,{"$error":"#DIV/0!"},"",{"$f":"IF(ISERROR(MATCH($A89,'[1]Step 1-What is changing'!$J:$J,0)),\"\",INDEX('Étape 1 – Ce qui change'!$I:$I,MATCH($A89,'[1]Step 1-What is changing'!$J:$J,0)))","v":""},{"$f":"IF(ISERROR(MATCH($A89,'[1]Step 1-What is changing'!$J:$J,0)),\"\",INDEX('Étape 1 – Ce qui change'!$J:$J,MATCH($A89,'[1]Step 1-What is changing'!$J:$J,0)))","v":""},"","","",{"$f":"IF(ISERROR(MATCH($A89,'[1]Step 1-What is changing'!$J:$J,0)),\"\",INDEX('Étape 1 – Ce qui change'!$N:$N,MATCH($A89,'[1]Step 1-What is changing'!$J:$J,0)))","v":""},{"$f":"IF(ISERROR(MATCH($A89,'[1]Step 1-What is changing'!$J:$J,0)),\"\",INDEX('Étape 1 – Ce qui change'!$O:$O,MATCH($A89,'[1]Step 1-What is changing'!$J:$J,0)))","v":""},{"$f":"IF(ISERROR(MATCH($A89,'[1]Step 1-What is changing'!$J:$J,0)),\"\",INDEX('Étape 1 – Ce qui change'!$P:$P,MATCH($A89,'[1]Step 1-What is changing'!$J:$J,0)))","v":""},{"$f":"IF(ISERROR(MATCH($A89,'[1]Step 1-What is changing'!$J:$J,0)),\"\",INDEX('Étape 1 – Ce qui change'!$Q:$Q,MATCH($A89,'[1]Step 1-What is changing'!$J:$J,0)))","v":""},{"$f":"IF(ISERROR(MATCH($A89,'[1]Step 1-What is changing'!$J:$J,0)),\"\",INDEX('Étape 1 – Ce qui change'!$R:$R,MATCH($A89,'[1]Step 1-What is changing'!$J:$J,0)))","v":""},{"$f":"IF(ISERROR(MATCH($A89,'[1]Step 1-What is changing'!$J:$J,0)),\"\",INDEX('Étape 1 – Ce qui change'!$S:$S,MATCH($A89,'[1]Step 1-What is changing'!$J:$J,0)))","v":""},{"$f":"IF(ISERROR(MATCH($A89,'[1]Step 1-What is changing'!$J:$J,0)),\"\",INDEX('Étape 1 – Ce qui change'!$T:$T,MATCH($A89,'[1]Step 1-What is changing'!$J:$J,0)))","v":""},{"$f":"IF(ISERROR(MATCH($A89,'[1]Step 1-What is changing'!$J:$J,0)),\"\",INDEX('Étape 1 – Ce qui change'!$U:$U,MATCH($A89,'[1]Step 1-What is changing'!$J:$J,0)))","v":""},{"$f":"IF(ISERROR(MATCH($A89,'[1]Step 1-What is changing'!$J:$J,0)),\"\",INDEX('Étape 1 – Ce qui change'!$V:$V,MATCH($A89,'[1]Step 1-What is changing'!$J:$J,0)))","v":""},{"$f":"IF(ISERROR(MATCH($A89,'[1]Step 1-What is changing'!$J:$J,0)),\"\",INDEX('Étape 1 – Ce qui change'!$W:$W,MATCH($A89,'[1]Step 1-What is changing'!$J:$J,0)))","v":""},{"$f":"IF(ISERROR(MATCH($A89,'[1]Step 1-What is changing'!$J:$J,0)),\"\",INDEX('Étape 1 – Ce qui change'!$X:$X,MATCH($A89,'[1]Step 1-What is changing'!$J:$J,0)))","v":""},{"$f":"IF(ISERROR(MATCH($A89,'[1]Step 1-What is changing'!$J:$J,0)),\"\",INDEX('Étape 1 – Ce qui change'!$Y:$Y,MATCH($A89,'[1]Step 1-What is changing'!$J:$J,0)))","v":""},{"$f":"IF(ISERROR(MATCH($A89,'[1]Step 1-What is changing'!$J:$J,0)),\"\",INDEX('Étape 1 – Ce qui change'!$Z:$Z,MATCH($A89,'[1]Step 1-What is changing'!$J:$J,0)))","v":""},{"$f":"IF(ISERROR(MATCH($A89,'[1]Step 1-What is changing'!$J:$J,0)),\"\",INDEX('Étape 1 – Ce qui change'!$AA:$AA,MATCH($A89,'[1]Step 1-What is changing'!$J:$J,0)))","v":""}]
[86,{"$f":"IF(ISERROR(MATCH($A90,'[1]Step 1-What is changing'!$J:$J,0)),\"\",INDEX('Étape 1 – Ce qui change'!$D:$D,MATCH($A90,'[1]Step 1-What is changing'!$J:$J,0))&\" - \"&INDEX('Étape 1 – Ce qui change'!$G:$G,MATCH($A90,'[1]Step 1-What is changing'!$J:$J,0)))","v":""},0,{"$error":"#DIV/0!"},"",{"$f":"IF(ISERROR(MATCH($A90,'[1]Step 1-What is changing'!$J:$J,0)),\"\",INDEX('Étape 1 – Ce qui change'!$I:$I,MATCH($A90,'[1]Step 1-What is changing'!$J:$J,0)))","v":""},{"$f":"IF(ISERROR(MATCH($A90,'[1]Step 1-What is changing'!$J:$J,0)),\"\",INDEX('Étape 1 – Ce qui change'!$J:$J,MATCH($A90,'[1]Step 1-What is changing'!$J:$J,0)))","v":""},"","","",{"$f":"IF(ISERROR(MATCH($A90,'[1]Step 1-What is changing'!$J:$J,0)),\"\",INDEX('Étape 1 – Ce qui change'!$N:$N,MATCH($A90,'[1]Step 1-What is changing'!$J:$J,0)))","v":""},{"$f":"IF(ISERROR(MATCH($A90,'[1]Step 1-What is changing'!$J:$J,0)),\"\",INDEX('Étape 1 – Ce qui change'!$O:$O,MATCH($A90,'[1]Step 1-What is changing'!$J:$J,0)))","v":""},{"$f":"IF(ISERROR(MATCH($A90,'[1]Step 1-What is changing'!$J:$J,0)),\"\",INDEX('Étape 1 – Ce qui change'!$P:$P,MATCH($A90,'[1]Step 1-What is changing'!$J:$J,0)))","v":""},{"$f":"IF(ISERROR(MATCH($A90,'[1]Step 1-What is changing'!$J:$J,0)),\"\",INDEX('Étape 1 – Ce qui change'!$Q:$Q,MATCH($A90,'[1]Step 1-What is changing'!$J:$J,0)))","v":""},{"$f":"IF(ISERROR(MATCH($A90,'[1]Step 1-What is changing'!$J:$J,0)),\"\",INDEX('Étape 1 – Ce qui change'!$R:$R,MATCH($A90,'[1]Step 1-What is changing'!$J:$J,0)))","v":""},{"$f":"IF(ISERROR(MATCH($A90,'[1]Step 1-What is changing'!$J:$J,0)),\"\",INDEX('Étape 1 – Ce qui change'!$S:$S,MATCH($A90,'[1]Step 1-What is changing'!$J:$J,0)))","v":""},{"$f":"IF(ISERROR(MATCH($A90,'[1]Step 1-What is changing'!$J:$J,0)),\"\",INDEX('Étape 1 – Ce qui change'!$T:$T,MATCH($A90,'[1]Step 1-What is changing'!$J:$J,0)))","v":""},{"$f":"IF(ISERROR(MATCH($A90,'[1]Step 1-What is changing'!$J:$J,0)),\"\",INDEX('Étape 1 – Ce qui change'!$U:$U,MATCH($A90,'[1]Step 1-What is changing'!$J:$J,0)))","v":""},{"$f":"IF(ISERROR(MATCH($A90,'[1]Step 1-What is changing'!$J:$J,0)),\"\",INDEX('Étape 1 – Ce qui change'!$V:$V,MATCH($A90,'[1]Step 1-What is changing'!$J:$J,0)))","v":""},{"$f":"IF(ISERROR(MATCH($A90,'[1]Step 1-What is changing'!$J:$J,0)),\"\",INDEX('Étape 1 – Ce qui change'!$W:$W,MATCH($A90,'[1]Step 1-What is changing'!$J:$J,0)))","v":""},{"$f":"IF(ISERROR(MATCH($A90,'[1]Step 1-What is changing'!$J:$J,0)),\"\",INDEX('Étape 1 – Ce qui change'!$X:$X,MATCH($A90,'[1]Step 1-What is changing'!$J:$J,0)))","v":""},{"$f":"IF(ISERROR(MATCH($A90,'[1]Step 1-What is changing'!$J:$J,0)),\"\",INDEX('Étape 1 – Ce qui change'!$Y:$Y,MATCH($A90,'[1]Step 1-What is changing'!$J:$J,0)))","v":""},{"$f":"IF(ISERROR(MATCH($A90,'[1]Step 1-What is changing'!$J:$J,0)),\"\",INDEX('Étape 1 – Ce qui change'!$Z:$Z,MATCH($A90,'[1]Step 1-What is changing'!$J:$J,0)))","v":""},{"$f":"IF(ISERROR(MATCH($A90,'[1]Step 1-What is changing'!$J:$J,0)),\"\",INDEX('Étape 1 – Ce qui change'!$AA:$AA,MATCH($A90,'[1]Step 1-What is changing'!$J:$J,0)))","v":""}]
[87,{"$f":"IF(ISERROR(MATCH($A91,'[1]Step 1-What is changing'!$J:$J,0)),\"\",INDEX('Étape 1 – Ce qui change'!$D:$D,MATCH($A91,'[1]Step 1-What is changing'!$J:$J,0))&\" - \"&INDEX('Étape 1 – Ce qui change'!$G:$G,MATCH($A91,'[1]Step 1-What is changing'!$J:$J,0)))","v":""},0,{"$error":"#DIV/0!"},"",{"$f":"IF(ISERROR(MATCH($A91,'[1]Step 1-What is changing'!$J:$J,0)),\"\",INDEX('Étape 1 – Ce qui change'!$I:$I,MATCH($A91,'[1]Step 1-What is changing'!$J:$J,0)))","v":""},{"$f":"IF(ISERROR(MATCH($A91,'[1]Step 1-What is changing'!$J:$J,0)),\"\",INDEX('Étape 1 – Ce qui change'!$J:$J,MATCH($A91,'[1]Step 1-What is changing'!$J:$J,0)))","v":""},"","","",{"$f":"IF(ISERROR(MATCH($A91,'[1]Step 1-What is changing'!$J:$J,0)),\"\",INDEX('Étape 1 – Ce qui change'!$N:$N,MATCH($A91,'[1]Step 1-What is changing'!$J:$J,0)))","v":""},{"$f":"IF(ISERROR(MATCH($A91,'[1]Step 1-What is changing'!$J:$J,0)),\"\",INDEX('Étape 1 – Ce qui change'!$O:$O,MATCH($A91,'[1]Step 1-What is changing'!$J:$J,0)))","v":""},{"$f":"IF(ISERROR(MATCH($A91,'[1]Step 1-What is changing'!$J:$J,0)),\"\",INDEX('Étape 1 – Ce qui change'!$P:$P,MATCH($A91,'[1]Step 1-What is changing'!$J:$J,0)))","v":""},{"$f":"IF(ISERROR(MATCH($A91,'[1]Step 1-What is changing'!$J:$J,0)),\"\",INDEX('Étape 1 – Ce qui change'!$Q:$Q,MATCH($A91,'[1]Step 1-What is changing'!$J:$J,0)))","v":""},{"$f":"IF(ISERROR(MATCH($A91,'[1]Step 1-What is changing'!$J:$J,0)),\"\",INDEX('Étape 1 – Ce qui change'!$R:$R,MATCH($A91,'[1]Step 1-What is changing'!$J:$J,0)))","v":""},{"$f":"IF(ISERROR(MATCH($A91,'[1]Step 1-What is changing'!$J:$J,0)),\"\",INDEX('Étape 1 – Ce qui change'!$S:$S,MATCH($A91,'[1]Step 1-What is changing'!$J:$J,0)))","v":""},{"$f":"IF(ISERROR(MATCH($A91,'[1]Step 1-What is changing'!$J:$J,0)),\"\",INDEX('Étape 1 – Ce qui change'!$T:$T,MATCH($A91,'[1]Step 1-What is changing'!$J:$J,0)))","v":""},{"$f":"IF(ISERROR(MATCH($A91,'[1]Step 1-What is changing'!$J:$J,0)),\"\",INDEX('Étape 1 – Ce qui change'!$U:$U,MATCH($A91,'[1]Step 1-What is changing'!$J:$J,0)))","v":""},{"$f":"IF(ISERROR(MATCH($A91,'[1]Step 1-What is changing'!$J:$J,0)),\"\",INDEX('Étape 1 – Ce qui change'!$V:$V,MATCH($A91,'[1]Step 1-What is changing'!$J:$J,0)))","v":""},{"$f":"IF(ISERROR(MATCH($A91,'[1]Step 1-What is changing'!$J:$J,0)),\"\",INDEX('Étape 1 – Ce qui change'!$W:$W,MATCH($A91,'[1]Step 1-What is changing'!$J:$J,0)))","v":""},{"$f":"IF(ISERROR(MATCH($A91,'[1]Step 1-What is changing'!$J:$J,0)),\"\",INDEX('Étape 1 – Ce qui change'!$X:$X,MATCH($A91,'[1]Step 1-What is changing'!$J:$J,0)))","v":""},{"$f":"IF(ISERROR(MATCH($A91,'[1]Step 1-What is changing'!$J:$J,0)),\"\",INDEX('Étape 1 – Ce qui change'!$Y:$Y,MATCH($A91,'[1]Step 1-What is changing'!$J:$J,0)))","v":""},{"$f":"IF(ISERROR(MATCH($A91,'[1]Step 1-What is changing'!$J:$J,0)),\"\",INDEX('Étape 1 – Ce qui change'!$Z:$Z,MATCH($A91,'[1]Step 1-What is changing'!$J:$J,0)))","v":""},{"$f":"IF(ISERROR(MATCH($A91,'[1]Step 1-What is changing'!$J:$J,0)),\"\",INDEX('Étape 1 – Ce qui change'!$AA:$AA,MATCH($A91,'[1]Step 1-What is changing'!$J:$J,0)))","v":""}]
[88,{"$f":"IF(ISERROR(MATCH($A92,'[1]Step 1-What is changing'!$J:$J,0)),\"\",INDEX('Étape 1 – Ce qui change'!$D:$D,MATCH($A92,'[1]Step 1-What is changing'!$J:$J,0))&\" - \"&INDEX('Étape 1 – Ce qui change'!$G:$G,MATCH($A92,'[1]Step 1-What is changing'!$J:$J,0)))","v":""},0,{"$error":"#DIV/0!"},"",{"$f":"IF(ISERROR(MATCH($A92,'[1]Step 1-What is changing'!$J:$J,0)),\"\",INDEX('Étape 1 – Ce qui change'!$I:$I,MATCH($A92,'[1]Step 1-What is changing'!$J:$J,0)))","v":""},{"$f":"IF(ISERROR(MATCH($A92,'[1]Step 1-What is changing'!$J:$J,0)),\"\",INDEX('Étape 1 – Ce qui change'!$J:$J,MATCH($A92,'[1]Step 1-What is changing'!$J:$J,0)))","v":""},"","","",{"$f":"IF(ISERROR(MATCH($A92,'[1]Step 1-What is changing'!$J:$J,0)),\"\",INDEX('Étape 1 – Ce qui change'!$N:$N,MATCH($A92,'[1]Step 1-What is changing'!$J:$J,0)))","v":""},{"$f":"IF(ISERROR(MATCH($A92,'[1]Step 1-What is changing'!$J:$J,0)),\"\",INDEX('Étape 1 – Ce qui change'!$O:$O,MATCH($A92,'[1]Step 1-What is changing'!$J:$J,0)))","v":""},{"$f":"IF(ISERROR(MATCH($A92,'[1]Step 1-What is changing'!$J:$J,0)),\"\",INDEX('Étape 1 – Ce qui change'!$P:$P,MATCH($A92,'[1]Step 1-What is changing'!$J:$J,0)))","v":""},{"$f":"IF(ISERROR(MATCH($A92,'[1]Step 1-What is changing'!$J:$J,0)),\"\",INDEX('Étape 1 – Ce qui change'!$Q:$Q,MATCH($A92,'[1]Step 1-What is changing'!$J:$J,0)))","v":""},{"$f":"IF(ISERROR(MATCH($A92,'[1]Step 1-What is changing'!$J:$J,0)),\"\",INDEX('Étape 1 – Ce qui change'!$R:$R,MATCH($A92,'[1]Step 1-What is changing'!$J:$J,0)))","v":""},{"$f":"IF(ISERROR(MATCH($A92,'[1]Step 1-What is changing'!$J:$J,0)),\"\",INDEX('Étape 1 – Ce qui change'!$S:$S,MATCH($A92,'[1]Step 1-What is changing'!$J:$J,0)))","v":""},{"$f":"IF(ISERROR(MATCH($A92,'[1]Step 1-What is changing'!$J:$J,0)),\"\",INDEX('Étape 1 – Ce qui change'!$T:$T,MATCH($A92,'[1]Step 1-What is changing'!$J:$J,0)))","v":""},{"$f":"IF(ISERROR(MATCH($A92,'[1]Step 1-What is changing'!$J:$J,0)),\"\",INDEX('Étape 1 – Ce qui change'!$U:$U,MATCH($A92,'[1]Step 1-What is changing'!$J:$J,0)))","v":""},{"$f":"IF(ISERROR(MATCH($A92,'[1]Step 1-What is changing'!$J:$J,0)),\"\",INDEX('Étape 1 – Ce qui change'!$V:$V,MATCH($A92,'[1]Step 1-What is changing'!$J:$J,0)))","v":""},{"$f":"IF(ISERROR(MATCH($A92,'[1]Step 1-What is changing'!$J:$J,0)),\"\",INDEX('Étape 1 – Ce qui change'!$W:$W,MATCH($A92,'[1]Step 1-What is changing'!$J:$J,0)))","v":""},{"$f":"IF(ISERROR(MATCH($A92,'[1]Step 1-What is changing'!$J:$J,0)),\"\",INDEX('Étape 1 – Ce qui change'!$X:$X,MATCH($A92,'[1]Step 1-What is changing'!$J:$J,0)))","v":""},{"$f":"IF(ISERROR(MATCH($A92,'[1]Step 1-What is changing'!$J:$J,0)),\"\",INDEX('Étape 1 – Ce qui change'!$Y:$Y,MATCH($A92,'[1]Step 1-What is changing'!$J:$J,0)))","v":""},{"$f":"IF(ISERROR(MATCH($A92,'[1]Step 1-What is changing'!$J:$J,0)),\"\",INDEX('Étape 1 – Ce qui change'!$Z:$Z,MATCH($A92,'[1]Step 1-What is changing'!$J:$J,0)))","v":""},{"$f":"IF(ISERROR(MATCH($A92,'[1]Step 1-What is changing'!$J:$J,0)),\"\",INDEX('Étape 1 – Ce qui change'!$AA:$AA,MATCH($A92,'[1]Step 1-What is changing'!$J:$J,0)))","v":""}]
[89,{"$f":"IF(ISERROR(MATCH($A93,'[1]Step 1-What is changing'!$J:$J,0)),\"\",INDEX('Étape 1 – Ce qui change'!$D:$D,MATCH($A93,'[1]Step 1-What is changing'!$J:$J,0))&\" - \"&INDEX('Étape 1 – Ce qui change'!$G:$G,MATCH($A93,'[1]Step 1-What is changing'!$J:$J,0)))","v":""},0,{"$error":"#DIV/0!"},"",{"$f":"IF(ISERROR(MATCH($A93,'[1]Step 1-What is changing'!$J:$J,0)),\"\",INDEX('Étape 1 – Ce qui change'!$I:$I,MATCH($A93,'[1]Step 1-What is changing'!$J:$J,0)))","v":""},{"$f":"IF(ISERROR(MATCH($A93,'[1]Step 1-What is changing'!$J:$J,0)),\"\",INDEX('Étape 1 – Ce qui change'!$J:$J,MATCH($A93,'[1]Step 1-What is changing'!$J:$J,0)))","v":""},"","","",{"$f":"IF(ISERROR(MATCH($A93,'[1]Step 1-What is changing'!$J:$J,0)),\"\",INDEX('Étape 1 – Ce qui change'!$N:$N,MATCH($A93,'[1]Step 1-What is changing'!$J:$J,0)))","v":""},{"$f":"IF(ISERROR(MATCH($A93,'[1]Step 1-What is changing'!$J:$J,0)),\"\",INDEX('Étape 1 – Ce qui change'!$O:$O,MATCH($A93,'[1]Step 1-What is changing'!$J:$J,0)))","v":""},{"$f":"IF(ISERROR(MATCH($A93,'[1]Step 1-What is changing'!$J:$J,0)),\"\",INDEX('Étape 1 – Ce qui change'!$P:$P,MATCH($A93,'[1]Step 1-What is changing'!$J:$J,0)))","v":""},{"$f":"IF(ISERROR(MATCH($A93,'[1]Step 1-What is changing'!$J:$J,0)),\"\",INDEX('Étape 1 – Ce qui change'!$Q:$Q,MATCH($A93,'[1]Step 1-What is changing'!$J:$J,0)))","v":""},{"$f":"IF(ISERROR(MATCH($A93,'[1]Step 1-What is changing'!$J:$J,0)),\"\",INDEX('Étape 1 – Ce qui change'!$R:$R,MATCH($A93,'[1]Step 1-What is changing'!$J:$J,0)))","v":""},{"$f":"IF(ISERROR(MATCH($A93,'[1]Step 1-What is changing'!$J:$J,0)),\"\",INDEX('Étape 1 – Ce qui change'!$S:$S,MATCH($A93,'[1]Step 1-What is changing'!$J:$J,0)))","v":""},{"$f":"IF(ISERROR(MATCH($A93,'[1]Step 1-What is changing'!$J:$J,0)),\"\",INDEX('Étape 1 – Ce qui change'!$T:$T,MATCH($A93,'[1]Step 1-What is changing'!$J:$J,0)))","v":""},{"$f":"IF(ISERROR(MATCH($A93,'[1]Step 1-What is changing'!$J:$J,0)),\"\",INDEX('Étape 1 – Ce qui change'!$U:$U,MATCH($A93,'[1]Step 1-What is changing'!$J:$J,0)))","v":""},{"$f":"IF(ISERROR(MATCH($A93,'[1]Step 1-What is changing'!$J:$J,0)),\"\",INDEX('Étape 1 – Ce qui change'!$V:$V,MATCH($A93,'[1]Step 1-What is changing'!$J:$J,0)))","v":""},{"$f":"IF(ISERROR(MATCH($A93,'[1]Step 1-What is changing'!$J:$J,0)),\"\",INDEX('Étape 1 – Ce qui change'!$W:$W,MATCH($A93,'[1]Step 1-What is changing'!$J:$J,0)))","v":""},{"$f":"IF(ISERROR(MATCH($A93,'[1]Step 1-What is changing'!$J:$J,0)),\"\",INDEX('Étape 1 – Ce qui change'!$X:$X,MATCH($A93,'[1]Step 1-What is changing'!$J:$J,0)))","v":""},{"$f":"IF(ISERROR(MATCH($A93,'[1]Step 1-What is changing'!$J:$J,0)),\"\",INDEX('Étape 1 – Ce qui change'!$Y:$Y,MATCH($A93,'[1]Step 1-What is changing'!$J:$J,0)))","v":""},{"$f":"IF(ISERROR(MATCH($A93,'[1]Step 1-What is changing'!$J:$J,0)),\"\",INDEX('Étape 1 – Ce qui change'!$Z:$Z,MATCH($A93,'[1]Step 1-What is changing'!$J:$J,0)))","v":""},{"$f":"IF(ISERROR(MATCH($A93,'[1]Step 1-What is changing'!$J:$J,0)),\"\",INDEX('Étape 1 – Ce qui change'!$AA:$AA,MATCH($A93,'[1]Step 1-What is changing'!$J:$J,0)))","v":""}]
[90,{"$f":"IF(ISERROR(MATCH($A94,'[1]Step 1-What is changing'!$J:$J,0)),\"\",INDEX('Étape 1 – Ce qui change'!$D:$D,MATCH($A94,'[1]Step 1-What is changing'!$J:$J,0))&\" - \"&INDEX('Étape 1 – Ce qui change'!$G:$G,MATCH($A94,'[1]Step 1-What is changing'!$J:$J,0)))","v":""},0,{"$error":"#DIV/0!"},"",{"$f":"IF(ISERROR(MATCH($A94,'[1]Step 1-What is changing'!$J:$J,0)),\"\",INDEX('Étape 1 – Ce qui change'!$I:$I,MATCH($A94,'[1]Step 1-What is changing'!$J:$J,0)))","v":""},{"$f":"IF(ISERROR(MATCH($A94,'[1]Step 1-What is changing'!$J:$J,0)),\"\",INDEX('Étape 1 – Ce qui change'!$J:$J,MATCH($A94,'[1]Step 1-What is changing'!$J:$J,0)))","v":""},"","","",{"$f":"IF(ISERROR(MATCH($A94,'[1]Step 1-What is changing'!$J:$J,0)),\"\",INDEX('Étape 1 – Ce qui change'!$N:$N,MATCH($A94,'[1]Step 1-What is changing'!$J:$J,0)))","v":""},{"$f":"IF(ISERROR(MATCH($A94,'[1]Step 1-What is changing'!$J:$J,0)),\"\",INDEX('Étape 1 – Ce qui change'!$O:$O,MATCH($A94,'[1]Step 1-What is changing'!$J:$J,0)))","v":""},{"$f":"IF(ISERROR(MATCH($A94,'[1]Step 1-What is changing'!$J:$J,0)),\"\",INDEX('Étape 1 – Ce qui change'!$P:$P,MATCH($A94,'[1]Step 1-What is changing'!$J:$J,0)))","v":""},{"$f":"IF(ISERROR(MATCH($A94,'[1]Step 1-What is changing'!$J:$J,0)),\"\",INDEX('Étape 1 – Ce qui change'!$Q:$Q,MATCH($A94,'[1]Step 1-What is changing'!$J:$J,0)))","v":""},{"$f":"IF(ISERROR(MATCH($A94,'[1]Step 1-What is changing'!$J:$J,0)),\"\",INDEX('Étape 1 – Ce qui change'!$R:$R,MATCH($A94,'[1]Step 1-What is changing'!$J:$J,0)))","v":""},{"$f":"IF(ISERROR(MATCH($A94,'[1]Step 1-What is changing'!$J:$J,0)),\"\",INDEX('Étape 1 – Ce qui change'!$S:$S,MATCH($A94,'[1]Step 1-What is changing'!$J:$J,0)))","v":""},{"$f":"IF(ISERROR(MATCH($A94,'[1]Step 1-What is changing'!$J:$J,0)),\"\",INDEX('Étape 1 – Ce qui change'!$T:$T,MATCH($A94,'[1]Step 1-What is changing'!$J:$J,0)))","v":""},{"$f":"IF(ISERROR(MATCH($A94,'[1]Step 1-What is changing'!$J:$J,0)),\"\",INDEX('Étape 1 – Ce qui change'!$U:$U,MATCH($A94,'[1]Step 1-What is changing'!$J:$J,0)))","v":""},{"$f":"IF(ISERROR(MATCH($A94,'[1]Step 1-What is changing'!$J:$J,0)),\"\",INDEX('Étape 1 – Ce qui change'!$V:$V,MATCH($A94,'[1]Step 1-What is changing'!$J:$J,0)))","v":""},{"$f":"IF(ISERROR(MATCH($A94,'[1]Step 1-What is changing'!$J:$J,0)),\"\",INDEX('Étape 1 – Ce qui change'!$W:$W,MATCH($A94,'[1]Step 1-What is changing'!$J:$J,0)))","v":""},{"$f":"IF(ISERROR(MATCH($A94,'[1]Step 1-What is changing'!$J:$J,0)),\"\",INDEX('Étape 1 – Ce qui change'!$X:$X,MATCH($A94,'[1]Step 1-What is changing'!$J:$J,0)))","v":""},{"$f":"IF(ISERROR(MATCH($A94,'[1]Step 1-What is changing'!$J:$J,0)),\"\",INDEX('Étape 1 – Ce qui change'!$Y:$Y,MATCH($A94,'[1]Step 1-What is changing'!$J:$J,0)))","v":""},{"$f":"IF(ISERROR(MATCH($A94,'[1]Step 1-What is changing'!$J:$J,0)),\"\",INDEX('Étape 1 – Ce qui change'!$Z:$Z,MATCH($A94,'[1]Step 1-What is changing'!$J:$J,0)))","v":""},{"$f":"IF(ISERROR(MATCH($A94,'[1]Step 1-What is changing'!$J:$J,0)),\"\",INDEX('Étape 1 – Ce qui change'!$AA:$AA,MATCH($A94,'[1]Step 1-What is changing'!$J:$J,0)))","v":""}]
[91,{"$f":"IF(ISERROR(MATCH($A95,'[1]Step 1-What is changing'!$J:$J,0)),\"\",INDEX('Étape 1 – Ce qui change'!$D:$D,MATCH($A95,'[1]Step 1-What is changing'!$J:$J,0))&\" - \"&INDEX('Étape 1 – Ce qui change'!$G:$G,MATCH($A95,'[1]Step 1-What is changing'!$J:$J,0)))","v":""},0,{"$error":"#DIV/0!"},"",{"$f":"IF(ISERROR(MATCH($A95,'[1]Step 1-What is changing'!$J:$J,0)),\"\",INDEX('Étape 1 – Ce qui change'!$I:$I,MATCH($A95,'[1]Step 1-What is changing'!$J:$J,0)))","v":""},{"$f":"IF(ISERROR(MATCH($A95,'[1]Step 1-What is changing'!$J:$J,0)),\"\",INDEX('Étape 1 – Ce qui change'!$J:$J,MATCH($A95,'[1]Step 1-What is changing'!$J:$J,0)))","v":""},"","","",{"$f":"IF(ISERROR(MATCH($A95,'[1]Step 1-What is changing'!$J:$J,0)),\"\",INDEX('Étape 1 – Ce qui change'!$N:$N,MATCH($A95,'[1]Step 1-What is changing'!$J:$J,0)))","v":""},{"$f":"IF(ISERROR(MATCH($A95,'[1]Step 1-What is changing'!$J:$J,0)),\"\",INDEX('Étape 1 – Ce qui change'!$O:$O,MATCH($A95,'[1]Step 1-What is changing'!$J:$J,0)))","v":""},{"$f":"IF(ISERROR(MATCH($A95,'[1]Step 1-What is changing'!$J:$J,0)),\"\",INDEX('Étape 1 – Ce qui change'!$P:$P,MATCH($A95,'[1]Step 1-What is changing'!$J:$J,0)))","v":""},{"$f":"IF(ISERROR(MATCH($A95,'[1]Step 1-What is changing'!$J:$J,0)),\"\",INDEX('Étape 1 – Ce qui change'!$Q:$Q,MATCH($A95,'[1]Step 1-What is changing'!$J:$J,0)))","v":""},{"$f":"IF(ISERROR(MATCH($A95,'[1]Step 1-What is changing'!$J:$J,0)),\"\",INDEX('Étape 1 – Ce qui change'!$R:$R,MATCH($A95,'[1]Step 1-What is changing'!$J:$J,0)))","v":""},{"$f":"IF(ISERROR(MATCH($A95,'[1]Step 1-What is changing'!$J:$J,0)),\"\",INDEX('Étape 1 – Ce qui change'!$S:$S,MATCH($A95,'[1]Step 1-What is changing'!$J:$J,0)))","v":""},{"$f":"IF(ISERROR(MATCH($A95,'[1]Step 1-What is changing'!$J:$J,0)),\"\",INDEX('Étape 1 – Ce qui change'!$T:$T,MATCH($A95,'[1]Step 1-What is changing'!$J:$J,0)))","v":""},{"$f":"IF(ISERROR(MATCH($A95,'[1]Step 1-What is changing'!$J:$J,0)),\"\",INDEX('Étape 1 – Ce qui change'!$U:$U,MATCH($A95,'[1]Step 1-What is changing'!$J:$J,0)))","v":""},{"$f":"IF(ISERROR(MATCH($A95,'[1]Step 1-What is changing'!$J:$J,0)),\"\",INDEX('Étape 1 – Ce qui change'!$V:$V,MATCH($A95,'[1]Step 1-What is changing'!$J:$J,0)))","v":""},{"$f":"IF(ISERROR(MATCH($A95,'[1]Step 1-What is changing'!$J:$J,0)),\"\",INDEX('Étape 1 – Ce qui change'!$W:$W,MATCH($A95,'[1]Step 1-What is changing'!$J:$J,0)))","v":""},{"$f":"IF(ISERROR(MATCH($A95,'[1]Step 1-What is changing'!$J:$J,0)),\"\",INDEX('Étape 1 – Ce qui change'!$X:$X,MATCH($A95,'[1]Step 1-What is changing'!$J:$J,0)))","v":""},{"$f":"IF(ISERROR(MATCH($A95,'[1]Step 1-What is changing'!$J:$J,0)),\"\",INDEX('Étape 1 – Ce qui change'!$Y:$Y,MATCH($A95,'[1]Step 1-What is changing'!$J:$J,0)))","v":""},{"$f":"IF(ISERROR(MATCH($A95,'[1]Step 1-What is changing'!$J:$J,0)),\"\",INDEX('Étape 1 – Ce qui change'!$Z:$Z,MATCH($A95,'[1]Step 1-What is changing'!$J:$J,0)))","v":""},{"$f":"IF(ISERROR(MATCH($A95,'[1]Step 1-What is changing'!$J:$J,0)),\"\",INDEX('Étape 1 – Ce qui change'!$AA:$AA,MATCH($A95,'[1]Step 1-What is changing'!$J:$J,0)))","v":""}]
[92,{"$f":"IF(ISERROR(MATCH($A96,'[1]Step 1-What is changing'!$J:$J,0)),\"\",INDEX('Étape 1 – Ce qui change'!$D:$D,MATCH($A96,'[1]Step 1-What is changing'!$J:$J,0))&\" - \"&INDEX('Étape 1 – Ce qui change'!$G:$G,MATCH($A96,'[1]Step 1-What is changing'!$J:$J,0)))","v":""},0,{"$error":"#DIV/0!"},"",{"$f":"IF(ISERROR(MATCH($A96,'[1]Step 1-What is changing'!$J:$J,0)),\"\",INDEX('Étape 1 – Ce qui change'!$I:$I,MATCH($A96,'[1]Step 1-What is changing'!$J:$J,0)))","v":""},{"$f":"IF(ISERROR(MATCH($A96,'[1]Step 1-What is changing'!$J:$J,0)),\"\",INDEX('Étape 1 – Ce qui change'!$J:$J,MATCH($A96,'[1]Step 1-What is changing'!$J:$J,0)))","v":""},"","","",{"$f":"IF(ISERROR(MATCH($A96,'[1]Step 1-What is changing'!$J:$J,0)),\"\",INDEX('Étape 1 – Ce qui change'!$N:$N,MATCH($A96,'[1]Step 1-What is changing'!$J:$J,0)))","v":""},{"$f":"IF(ISERROR(MATCH($A96,'[1]Step 1-What is changing'!$J:$J,0)),\"\",INDEX('Étape 1 – Ce qui change'!$O:$O,MATCH($A96,'[1]Step 1-What is changing'!$J:$J,0)))","v":""},{"$f":"IF(ISERROR(MATCH($A96,'[1]Step 1-What is changing'!$J:$J,0)),\"\",INDEX('Étape 1 – Ce qui change'!$P:$P,MATCH($A96,'[1]Step 1-What is changing'!$J:$J,0)))","v":""},{"$f":"IF(ISERROR(MATCH($A96,'[1]Step 1-What is changing'!$J:$J,0)),\"\",INDEX('Étape 1 – Ce qui change'!$Q:$Q,MATCH($A96,'[1]Step 1-What is changing'!$J:$J,0)))","v":""},{"$f":"IF(ISERROR(MATCH($A96,'[1]Step 1-What is changing'!$J:$J,0)),\"\",INDEX('Étape 1 – Ce qui change'!$R:$R,MATCH($A96,'[1]Step 1-What is changing'!$J:$J,0)))","v":""},{"$f":"IF(ISERROR(MATCH($A96,'[1]Step 1-What is changing'!$J:$J,0)),\"\",INDEX('Étape 1 – Ce qui change'!$S:$S,MATCH($A96,'[1]Step 1-What is changing'!$J:$J,0)))","v":""},{"$f":"IF(ISERROR(MATCH($A96,'[1]Step 1-What is changing'!$J:$J,0)),\"\",INDEX('Étape 1 – Ce qui change'!$T:$T,MATCH($A96,'[1]Step 1-What is changing'!$J:$J,0)))","v":""},{"$f":"IF(ISERROR(MATCH($A96,'[1]Step 1-What is changing'!$J:$J,0)),\"\",INDEX('Étape 1 – Ce qui change'!$U:$U,MATCH($A96,'[1]Step 1-What is changing'!$J:$J,0)))","v":""},{"$f":"IF(ISERROR(MATCH($A96,'[1]Step 1-What is changing'!$J:$J,0)),\"\",INDEX('Étape 1 – Ce qui change'!$V:$V,MATCH($A96,'[1]Step 1-What is changing'!$J:$J,0)))","v":""},{"$f":"IF(ISERROR(MATCH($A96,'[1]Step 1-What is changing'!$J:$J,0)),\"\",INDEX('Étape 1 – Ce qui change'!$W:$W,MATCH($A96,'[1]Step 1-What is changing'!$J:$J,0)))","v":""},{"$f":"IF(ISERROR(MATCH($A96,'[1]Step 1-What is changing'!$J:$J,0)),\"\",INDEX('Étape 1 – Ce qui change'!$X:$X,MATCH($A96,'[1]Step 1-What is changing'!$J:$J,0)))","v":""},{"$f":"IF(ISERROR(MATCH($A96,'[1]Step 1-What is changing'!$J:$J,0)),\"\",INDEX('Étape 1 – Ce qui change'!$Y:$Y,MATCH($A96,'[1]Step 1-What is changing'!$J:$J,0)))","v":""},{"$f":"IF(ISERROR(MATCH($A96,'[1]Step 1-What is changing'!$J:$J,0)),\"\",INDEX('Étape 1 – Ce qui change'!$Z:$Z,MATCH($A96,'[1]Step 1-What is changing'!$J:$J,0)))","v":""},{"$f":"IF(ISERROR(MATCH($A96,'[1]Step 1-What is changing'!$J:$J,0)),\"\",INDEX('Étape 1 – Ce qui change'!$AA:$AA,MATCH($A96,'[1]Step 1-What is changing'!$J:$J,0)))","v":""}]
[93,{"$f":"IF(ISERROR(MATCH($A97,'[1]Step 1-What is changing'!$J:$J,0)),\"\",INDEX('Étape 1 – Ce qui change'!$D:$D,MATCH($A97,'[1]Step 1-What is changing'!$J:$J,0))&\" - \"&INDEX('Étape 1 – Ce qui change'!$G:$G,MATCH($A97,'[1]Step 1-What is changing'!$J:$J,0)))","v":""},0,{"$error":"#DIV/0!"},"",{"$f":"IF(ISERROR(MATCH($A97,'[1]Step 1-What is changing'!$J:$J,0)),\"\",INDEX('Étape 1 – Ce qui change'!$I:$I,MATCH($A97,'[1]Step 1-What is changing'!$J:$J,0)))","v":""},{"$f":"IF(ISERROR(MATCH($A97,'[1]Step 1-What is changing'!$J:$J,0)),\"\",INDEX('Étape 1 – Ce qui change'!$J:$J,MATCH($A97,'[1]Step 1-What is changing'!$J:$J,0)))","v":""},"","","",{"$f":"IF(ISERROR(MATCH($A97,'[1]Step 1-What is changing'!$J:$J,0)),\"\",INDEX('Étape 1 – Ce qui change'!$N:$N,MATCH($A97,'[1]Step 1-What is changing'!$J:$J,0)))","v":""},{"$f":"IF(ISERROR(MATCH($A97,'[1]Step 1-What is changing'!$J:$J,0)),\"\",INDEX('Étape 1 – Ce qui change'!$O:$O,MATCH($A97,'[1]Step 1-What is changing'!$J:$J,0)))","v":""},{"$f":"IF(ISERROR(MATCH($A97,'[1]Step 1-What is changing'!$J:$J,0)),\"\",INDEX('Étape 1 – Ce qui change'!$P:$P,MATCH($A97,'[1]Step 1-What is changing'!$J:$J,0)))","v":""},{"$f":"IF(ISERROR(MATCH($A97,'[1]Step 1-What is changing'!$J:$J,0)),\"\",INDEX('Étape 1 – Ce qui change'!$Q:$Q,MATCH($A97,'[1]Step 1-What is changing'!$J:$J,0)))","v":""},{"$f":"IF(ISERROR(MATCH($A97,'[1]Step 1-What is changing'!$J:$J,0)),\"\",INDEX('Étape 1 – Ce qui change'!$R:$R,MATCH($A97,'[1]Step 1-What is changing'!$J:$J,0)))","v":""},{"$f":"IF(ISERROR(MATCH($A97,'[1]Step 1-What is changing'!$J:$J,0)),\"\",INDEX('Étape 1 – Ce qui change'!$S:$S,MATCH($A97,'[1]Step 1-What is changing'!$J:$J,0)))","v":""},{"$f":"IF(ISERROR(MATCH($A97,'[1]Step 1-What is changing'!$J:$J,0)),\"\",INDEX('Étape 1 – Ce qui change'!$T:$T,MATCH($A97,'[1]Step 1-What is changing'!$J:$J,0)))","v":""},{"$f":"IF(ISERROR(MATCH($A97,'[1]Step 1-What is changing'!$J:$J,0)),\"\",INDEX('Étape 1 – Ce qui change'!$U:$U,MATCH($A97,'[1]Step 1-What is changing'!$J:$J,0)))","v":""},{"$f":"IF(ISERROR(MATCH($A97,'[1]Step 1-What is changing'!$J:$J,0)),\"\",INDEX('Étape 1 – Ce qui change'!$V:$V,MATCH($A97,'[1]Step 1-What is changing'!$J:$J,0)))","v":""},{"$f":"IF(ISERROR(MATCH($A97,'[1]Step 1-What is changing'!$J:$J,0)),\"\",INDEX('Étape 1 – Ce qui change'!$W:$W,MATCH($A97,'[1]Step 1-What is changing'!$J:$J,0)))","v":""},{"$f":"IF(ISERROR(MATCH($A97,'[1]Step 1-What is changing'!$J:$J,0)),\"\",INDEX('Étape 1 – Ce qui change'!$X:$X,MATCH($A97,'[1]Step 1-What is changing'!$J:$J,0)))","v":""},{"$f":"IF(ISERROR(MATCH($A97,'[1]Step 1-What is changing'!$J:$J,0)),\"\",INDEX('Étape 1 – Ce qui change'!$Y:$Y,MATCH($A97,'[1]Step 1-What is changing'!$J:$J,0)))","v":""},{"$f":"IF(ISERROR(MATCH($A97,'[1]Step 1-What is changing'!$J:$J,0)),\"\",INDEX('Étape 1 – Ce qui change'!$Z:$Z,MATCH($A97,'[1]Step 1-What is changing'!$J:$J,0)))","v":""},{"$f":"IF(ISERROR(MATCH($A97,'[1]Step 1-What is changing'!$J:$J,0)),\"\",INDEX('Étape 1 – Ce qui change'!$AA:$AA,MATCH($A97,'[1]Step 1-What is changing'!$J:$J,0)))","v":""}]
[94,{"$f":"IF(ISERROR(MATCH($A98,'[1]Step 1-What is changing'!$J:$J,0)),\"\",INDEX('Étape 1 – Ce qui change'!$D:$D,MATCH($A98,'[1]Step 1-What is changing'!$J:$J,0))&\" - \"&INDEX('Étape 1 – Ce qui change'!$G:$G,MATCH($A98,'[1]Step 1-What is changing'!$J:$J,0)))","v":""},0,{"$error":"#DIV/0!"},"",{"$f":"IF(ISERROR(MATCH($A98,'[1]Step 1-What is changing'!$J:$J,0)),\"\",INDEX('Étape 1 – Ce qui change'!$I:$I,MATCH($A98,'[1]Step 1-What is changing'!$J:$J,0)))","v":""},{"$f":"IF(ISERROR(MATCH($A98,'[1]Step 1-What is changing'!$J:$J,0)),\"\",INDEX('Étape 1 – Ce qui change'!$J:$J,MATCH($A98,'[1]Step 1-What is changing'!$J:$J,0)))","v":""},"","","",{"$f":"IF(ISERROR(MATCH($A98,'[1]Step 1-What is changing'!$J:$J,0)),\"\",INDEX('Étape 1 – Ce qui change'!$N:$N,MATCH($A98,'[1]Step 1-What is changing'!$J:$J,0)))","v":""},{"$f":"IF(ISERROR(MATCH($A98,'[1]Step 1-What is changing'!$J:$J,0)),\"\",INDEX('Étape 1 – Ce qui change'!$O:$O,MATCH($A98,'[1]Step 1-What is changing'!$J:$J,0)))","v":""},{"$f":"IF(ISERROR(MATCH($A98,'[1]Step 1-What is changing'!$J:$J,0)),\"\",INDEX('Étape 1 – Ce qui change'!$P:$P,MATCH($A98,'[1]Step 1-What is changing'!$J:$J,0)))","v":""},{"$f":"IF(ISERROR(MATCH($A98,'[1]Step 1-What is changing'!$J:$J,0)),\"\",INDEX('Étape 1 – Ce qui change'!$Q:$Q,MATCH($A98,'[1]Step 1-What is changing'!$J:$J,0)))","v":""},{"$f":"IF(ISERROR(MATCH($A98,'[1]Step 1-What is changing'!$J:$J,0)),\"\",INDEX('Étape 1 – Ce qui change'!$R:$R,MATCH($A98,'[1]Step 1-What is changing'!$J:$J,0)))","v":""},{"$f":"IF(ISERROR(MATCH($A98,'[1]Step 1-What is changing'!$J:$J,0)),\"\",INDEX('Étape 1 – Ce qui change'!$S:$S,MATCH($A98,'[1]Step 1-What is changing'!$J:$J,0)))","v":""},{"$f":"IF(ISERROR(MATCH($A98,'[1]Step 1-What is changing'!$J:$J,0)),\"\",INDEX('Étape 1 – Ce qui change'!$T:$T,MATCH($A98,'[1]Step 1-What is changing'!$J:$J,0)))","v":""},{"$f":"IF(ISERROR(MATCH($A98,'[1]Step 1-What is changing'!$J:$J,0)),\"\",INDEX('Étape 1 – Ce qui change'!$U:$U,MATCH($A98,'[1]Step 1-What is changing'!$J:$J,0)))","v":""},{"$f":"IF(ISERROR(MATCH($A98,'[1]Step 1-What is changing'!$J:$J,0)),\"\",INDEX('Étape 1 – Ce qui change'!$V:$V,MATCH($A98,'[1]Step 1-What is changing'!$J:$J,0)))","v":""},{"$f":"IF(ISERROR(MATCH($A98,'[1]Step 1-What is changing'!$J:$J,0)),\"\",INDEX('Étape 1 – Ce qui change'!$W:$W,MATCH($A98,'[1]Step 1-What is changing'!$J:$J,0)))","v":""},{"$f":"IF(ISERROR(MATCH($A98,'[1]Step 1-What is changing'!$J:$J,0)),\"\",INDEX('Étape 1 – Ce qui change'!$X:$X,MATCH($A98,'[1]Step 1-What is changing'!$J:$J,0)))","v":""},{"$f":"IF(ISERROR(MATCH($A98,'[1]Step 1-What is changing'!$J:$J,0)),\"\",INDEX('Étape 1 – Ce qui change'!$Y:$Y,MATCH($A98,'[1]Step 1-What is changing'!$J:$J,0)))","v":""},{"$f":"IF(ISERROR(MATCH($A98,'[1]Step 1-What is changing'!$J:$J,0)),\"\",INDEX('Étape 1 – Ce qui change'!$Z:$Z,MATCH($A98,'[1]Step 1-What is changing'!$J:$J,0)))","v":""},{"$f":"IF(ISERROR(MATCH($A98,'[1]Step 1-What is changing'!$J:$J,0)),\"\",INDEX('Étape 1 – Ce qui change'!$AA:$AA,MATCH($A98,'[1]Step 1-What is changing'!$J:$J,0)))","v":""}]
[95,{"$f":"IF(ISERROR(MATCH($A99,'[1]Step 1-What is changing'!$J:$J,0)),\"\",INDEX('Étape 1 – Ce qui change'!$D:$D,MATCH($A99,'[1]Step 1-What is changing'!$J:$J,0))&\" - \"&INDEX('Étape 1 – Ce qui change'!$G:$G,MATCH($A99,'[1]Step 1-What is changing'!$J:$J,0)))","v":""},0,{"$error":"#DIV/0!"},"",{"$f":"IF(ISERROR(MATCH($A99,'[1]Step 1-What is changing'!$J:$J,0)),\"\",INDEX('Étape 1 – Ce qui change'!$I:$I,MATCH($A99,'[1]Step 1-What is changing'!$J:$J,0)))","v":""},{"$f":"IF(ISERROR(MATCH($A99,'[1]Step 1-What is changing'!$J:$J,0)),\"\",INDEX('Étape 1 – Ce qui change'!$J:$J,MATCH($A99,'[1]Step 1-What is changing'!$J:$J,0)))","v":""},"","","",{"$f":"IF(ISERROR(MATCH($A99,'[1]Step 1-What is changing'!$J:$J,0)),\"\",INDEX('Étape 1 – Ce qui change'!$N:$N,MATCH($A99,'[1]Step 1-What is changing'!$J:$J,0)))","v":""},{"$f":"IF(ISERROR(MATCH($A99,'[1]Step 1-What is changing'!$J:$J,0)),\"\",INDEX('Étape 1 – Ce qui change'!$O:$O,MATCH($A99,'[1]Step 1-What is changing'!$J:$J,0)))","v":""},{"$f":"IF(ISERROR(MATCH($A99,'[1]Step 1-What is changing'!$J:$J,0)),\"\",INDEX('Étape 1 – Ce qui change'!$P:$P,MATCH($A99,'[1]Step 1-What is changing'!$J:$J,0)))","v":""},{"$f":"IF(ISERROR(MATCH($A99,'[1]Step 1-What is changing'!$J:$J,0)),\"\",INDEX('Étape 1 – Ce qui change'!$Q:$Q,MATCH($A99,'[1]Step 1-What is changing'!$J:$J,0)))","v":""},{"$f":"IF(ISERROR(MATCH($A99,'[1]Step 1-What is changing'!$J:$J,0)),\"\",INDEX('Étape 1 – Ce qui change'!$R:$R,MATCH($A99,'[1]Step 1-What is changing'!$J:$J,0)))","v":""},{"$f":"IF(ISERROR(MATCH($A99,'[1]Step 1-What is changing'!$J:$J,0)),\"\",INDEX('Étape 1 – Ce qui change'!$S:$S,MATCH($A99,'[1]Step 1-What is changing'!$J:$J,0)))","v":""},{"$f":"IF(ISERROR(MATCH($A99,'[1]Step 1-What is changing'!$J:$J,0)),\"\",INDEX('Étape 1 – Ce qui change'!$T:$T,MATCH($A99,'[1]Step 1-What is changing'!$J:$J,0)))","v":""},{"$f":"IF(ISERROR(MATCH($A99,'[1]Step 1-What is changing'!$J:$J,0)),\"\",INDEX('Étape 1 – Ce qui change'!$U:$U,MATCH($A99,'[1]Step 1-What is changing'!$J:$J,0)))","v":""},{"$f":"IF(ISERROR(MATCH($A99,'[1]Step 1-What is changing'!$J:$J,0)),\"\",INDEX('Étape 1 – Ce qui change'!$V:$V,MATCH($A99,'[1]Step 1-What is changing'!$J:$J,0)))","v":""},{"$f":"IF(ISERROR(MATCH($A99,'[1]Step 1-What is changing'!$J:$J,0)),\"\",INDEX('Étape 1 – Ce qui change'!$W:$W,MATCH($A99,'[1]Step 1-What is changing'!$J:$J,0)))","v":""},{"$f":"IF(ISERROR(MATCH($A99,'[1]Step 1-What is changing'!$J:$J,0)),\"\",INDEX('Étape 1 – Ce qui change'!$X:$X,MATCH($A99,'[1]Step 1-What is changing'!$J:$J,0)))","v":""},{"$f":"IF(ISERROR(MATCH($A99,'[1]Step 1-What is changing'!$J:$J,0)),\"\",INDEX('Étape 1 – Ce qui change'!$Y:$Y,MATCH($A99,'[1]Step 1-What is changing'!$J:$J,0)))","v":""},{"$f":"IF(ISERROR(MATCH($A99,'[1]Step 1-What is changing'!$J:$J,0)),\"\",INDEX('Étape 1 – Ce qui change'!$Z:$Z,MATCH($A99,'[1]Step 1-What is changing'!$J:$J,0)))","v":""},{"$f":"IF(ISERROR(MATCH($A99,'[1]Step 1-What is changing'!$J:$J,0)),\"\",INDEX('Étape 1 – Ce qui change'!$AA:$AA,MATCH($A99,'[1]Step 1-What is changing'!$J:$J,0)))","v":""}]
[96,{"$f":"IF(ISERROR(MATCH($A100,'[1]Step 1-What is changing'!$J:$J,0)),\"\",INDEX('Étape 1 – Ce qui change'!$D:$D,MATCH($A100,'[1]Step 1-What is changing'!$J:$J,0))&\" - \"&INDEX('Étape 1 – Ce qui change'!$G:$G,MATCH($A100,'[1]Step 1-What is changing'!$J:$J,0)))","v":""},0,{"$error":"#DIV/0!"},"",{"$f":"IF(ISERROR(MATCH($A100,'[1]Step 1-What is changing'!$J:$J,0)),\"\",INDEX('Étape 1 – Ce qui change'!$I:$I,MATCH($A100,'[1]Step 1-What is changing'!$J:$J,0)))","v":""},{"$f":"IF(ISERROR(MATCH($A100,'[1]Step 1-What is changing'!$J:$J,0)),\"\",INDEX('Étape 1 – Ce qui change'!$J:$J,MATCH($A100,'[1]Step 1-What is changing'!$J:$J,0)))","v":""},"","","",{"$f":"IF(ISERROR(MATCH($A100,'[1]Step 1-What is changing'!$J:$J,0)),\"\",INDEX('Étape 1 – Ce qui change'!$N:$N,MATCH($A100,'[1]Step 1-What is changing'!$J:$J,0)))","v":""},{"$f":"IF(ISERROR(MATCH($A100,'[1]Step 1-What is changing'!$J:$J,0)),\"\",INDEX('Étape 1 – Ce qui change'!$O:$O,MATCH($A100,'[1]Step 1-What is changing'!$J:$J,0)))","v":""},{"$f":"IF(ISERROR(MATCH($A100,'[1]Step 1-What is changing'!$J:$J,0)),\"\",INDEX('Étape 1 – Ce qui change'!$P:$P,MATCH($A100,'[1]Step 1-What is changing'!$J:$J,0)))","v":""},{"$f":"IF(ISERROR(MATCH($A100,'[1]Step 1-What is changing'!$J:$J,0)),\"\",INDEX('Étape 1 – Ce qui change'!$Q:$Q,MATCH($A100,'[1]Step 1-What is changing'!$J:$J,0)))","v":""},{"$f":"IF(ISERROR(MATCH($A100,'[1]Step 1-What is changing'!$J:$J,0)),\"\",INDEX('Étape 1 – Ce qui change'!$R:$R,MATCH($A100,'[1]Step 1-What is changing'!$J:$J,0)))","v":""},{"$f":"IF(ISERROR(MATCH($A100,'[1]Step 1-What is changing'!$J:$J,0)),\"\",INDEX('Étape 1 – Ce qui change'!$S:$S,MATCH($A100,'[1]Step 1-What is changing'!$J:$J,0)))","v":""},{"$f":"IF(ISERROR(MATCH($A100,'[1]Step 1-What is changing'!$J:$J,0)),\"\",INDEX('Étape 1 – Ce qui change'!$T:$T,MATCH($A100,'[1]Step 1-What is changing'!$J:$J,0)))","v":""},{"$f":"IF(ISERROR(MATCH($A100,'[1]Step 1-What is changing'!$J:$J,0)),\"\",INDEX('Étape 1 – Ce qui change'!$U:$U,MATCH($A100,'[1]Step 1-What is changing'!$J:$J,0)))","v":""},{"$f":"IF(ISERROR(MATCH($A100,'[1]Step 1-What is changing'!$J:$J,0)),\"\",INDEX('Étape 1 – Ce qui change'!$V:$V,MATCH($A100,'[1]Step 1-What is changing'!$J:$J,0)))","v":""},{"$f":"IF(ISERROR(MATCH($A100,'[1]Step 1-What is changing'!$J:$J,0)),\"\",INDEX('Étape 1 – Ce qui change'!$W:$W,MATCH($A100,'[1]Step 1-What is changing'!$J:$J,0)))","v":""},{"$f":"IF(ISERROR(MATCH($A100,'[1]Step 1-What is changing'!$J:$J,0)),\"\",INDEX('Étape 1 – Ce qui change'!$X:$X,MATCH($A100,'[1]Step 1-What is changing'!$J:$J,0)))","v":""},{"$f":"IF(ISERROR(MATCH($A100,'[1]Step 1-What is changing'!$J:$J,0)),\"\",INDEX('Étape 1 – Ce qui change'!$Y:$Y,MATCH($A100,'[1]Step 1-What is changing'!$J:$J,0)))","v":""},{"$f":"IF(ISERROR(MATCH($A100,'[1]Step 1-What is changing'!$J:$J,0)),\"\",INDEX('Étape 1 – Ce qui change'!$Z:$Z,MATCH($A100,'[1]Step 1-What is changing'!$J:$J,0)))","v":""},{"$f":"IF(ISERROR(MATCH($A100,'[1]Step 1-What is changing'!$J:$J,0)),\"\",INDEX('Étape 1 – Ce qui change'!$AA:$AA,MATCH($A100,'[1]Step 1-What is changing'!$J:$J,0)))","v":""}]
[97,{"$f":"IF(ISERROR(MATCH($A101,'[1]Step 1-What is changing'!$J:$J,0)),\"\",INDEX('Étape 1 – Ce qui change'!$D:$D,MATCH($A101,'[1]Step 1-What is changing'!$J:$J,0))&\" - \"&INDEX('Étape 1 – Ce qui change'!$G:$G,MATCH($A101,'[1]Step 1-What is changing'!$J:$J,0)))","v":""},0,{"$error":"#DIV/0!"},"",{"$f":"IF(ISERROR(MATCH($A101,'[1]Step 1-What is changing'!$J:$J,0)),\"\",INDEX('Étape 1 – Ce qui change'!$I:$I,MATCH($A101,'[1]Step 1-What is changing'!$J:$J,0)))","v":""},{"$f":"IF(ISERROR(MATCH($A101,'[1]Step 1-What is changing'!$J:$J,0)),\"\",INDEX('Étape 1 – Ce qui change'!$J:$J,MATCH($A101,'[1]Step 1-What is changing'!$J:$J,0)))","v":""},"","","",{"$f":"IF(ISERROR(MATCH($A101,'[1]Step 1-What is changing'!$J:$J,0)),\"\",INDEX('Étape 1 – Ce qui change'!$N:$N,MATCH($A101,'[1]Step 1-What is changing'!$J:$J,0)))","v":""},{"$f":"IF(ISERROR(MATCH($A101,'[1]Step 1-What is changing'!$J:$J,0)),\"\",INDEX('Étape 1 – Ce qui change'!$O:$O,MATCH($A101,'[1]Step 1-What is changing'!$J:$J,0)))","v":""},{"$f":"IF(ISERROR(MATCH($A101,'[1]Step 1-What is changing'!$J:$J,0)),\"\",INDEX('Étape 1 – Ce qui change'!$P:$P,MATCH($A101,'[1]Step 1-What is changing'!$J:$J,0)))","v":""},{"$f":"IF(ISERROR(MATCH($A101,'[1]Step 1-What is changing'!$J:$J,0)),\"\",INDEX('Étape 1 – Ce qui change'!$Q:$Q,MATCH($A101,'[1]Step 1-What is changing'!$J:$J,0)))","v":""},{"$f":"IF(ISERROR(MATCH($A101,'[1]Step 1-What is changing'!$J:$J,0)),\"\",INDEX('Étape 1 – Ce qui change'!$R:$R,MATCH($A101,'[1]Step 1-What is changing'!$J:$J,0)))","v":""},{"$f":"IF(ISERROR(MATCH($A101,'[1]Step 1-What is changing'!$J:$J,0)),\"\",INDEX('Étape 1 – Ce qui change'!$S:$S,MATCH($A101,'[1]Step 1-What is changing'!$J:$J,0)))","v":""},{"$f":"IF(ISERROR(MATCH($A101,'[1]Step 1-What is changing'!$J:$J,0)),\"\",INDEX('Étape 1 – Ce qui change'!$T:$T,MATCH($A101,'[1]Step 1-What is changing'!$J:$J,0)))","v":""},{"$f":"IF(ISERROR(MATCH($A101,'[1]Step 1-What is changing'!$J:$J,0)),\"\",INDEX('Étape 1 – Ce qui change'!$U:$U,MATCH($A101,'[1]Step 1-What is changing'!$J:$J,0)))","v":""},{"$f":"IF(ISERROR(MATCH($A101,'[1]Step 1-What is changing'!$J:$J,0)),\"\",INDEX('Étape 1 – Ce qui change'!$V:$V,MATCH($A101,'[1]Step 1-What is changing'!$J:$J,0)))","v":""},{"$f":"IF(ISERROR(MATCH($A101,'[1]Step 1-What is changing'!$J:$J,0)),\"\",INDEX('Étape 1 – Ce qui change'!$W:$W,MATCH($A101,'[1]Step 1-What is changing'!$J:$J,0)))","v":""},{"$f":"IF(ISERROR(MATCH($A101,'[1]Step 1-What is changing'!$J:$J,0)),\"\",INDEX('Étape 1 – Ce qui change'!$X:$X,MATCH($A101,'[1]Step 1-What is changing'!$J:$J,0)))","v":""},{"$f":"IF(ISERROR(MATCH($A101,'[1]Step 1-What is changing'!$J:$J,0)),\"\",INDEX('Étape 1 – Ce qui change'!$Y:$Y,MATCH($A101,'[1]Step 1-What is changing'!$J:$J,0)))","v":""},{"$f":"IF(ISERROR(MATCH($A101,'[1]Step 1-What is changing'!$J:$J,0)),\"\",INDEX('Étape 1 – Ce qui change'!$Z:$Z,MATCH($A101,'[1]Step 1-What is changing'!$J:$J,0)))","v":""},{"$f":"IF(ISERROR(MATCH($A101,'[1]Step 1-What is changing'!$J:$J,0)),\"\",INDEX('Étape 1 – Ce qui change'!$AA:$AA,MATCH($A101,'[1]Step 1-What is changing'!$J:$J,0)))","v":""}]
[98,{"$f":"IF(ISERROR(MATCH($A102,'[1]Step 1-What is changing'!$J:$J,0)),\"\",INDEX('Étape 1 – Ce qui change'!$D:$D,MATCH($A102,'[1]Step 1-What is changing'!$J:$J,0))&\" - \"&INDEX('Étape 1 – Ce qui change'!$G:$G,MATCH($A102,'[1]Step 1-What is changing'!$J:$J,0)))","v":""},0,{"$error":"#DIV/0!"},"",{"$f":"IF(ISERROR(MATCH($A102,'[1]Step 1-What is changing'!$J:$J,0)),\"\",INDEX('Étape 1 – Ce qui change'!$I:$I,MATCH($A102,'[1]Step 1-What is changing'!$J:$J,0)))","v":""},{"$f":"IF(ISERROR(MATCH($A102,'[1]Step 1-What is changing'!$J:$J,0)),\"\",INDEX('Étape 1 – Ce qui change'!$J:$J,MATCH($A102,'[1]Step 1-What is changing'!$J:$J,0)))","v":""},"","","",{"$f":"IF(ISERROR(MATCH($A102,'[1]Step 1-What is changing'!$J:$J,0)),\"\",INDEX('Étape 1 – Ce qui change'!$N:$N,MATCH($A102,'[1]Step 1-What is changing'!$J:$J,0)))","v":""},{"$f":"IF(ISERROR(MATCH($A102,'[1]Step 1-What is changing'!$J:$J,0)),\"\",INDEX('Étape 1 – Ce qui change'!$O:$O,MATCH($A102,'[1]Step 1-What is changing'!$J:$J,0)))","v":""},{"$f":"IF(ISERROR(MATCH($A102,'[1]Step 1-What is changing'!$J:$J,0)),\"\",INDEX('Étape 1 – Ce qui change'!$P:$P,MATCH($A102,'[1]Step 1-What is changing'!$J:$J,0)))","v":""},{"$f":"IF(ISERROR(MATCH($A102,'[1]Step 1-What is changing'!$J:$J,0)),\"\",INDEX('Étape 1 – Ce qui change'!$Q:$Q,MATCH($A102,'[1]Step 1-What is changing'!$J:$J,0)))","v":""},{"$f":"IF(ISERROR(MATCH($A102,'[1]Step 1-What is changing'!$J:$J,0)),\"\",INDEX('Étape 1 – Ce qui change'!$R:$R,MATCH($A102,'[1]Step 1-What is changing'!$J:$J,0)))","v":""},{"$f":"IF(ISERROR(MATCH($A102,'[1]Step 1-What is changing'!$J:$J,0)),\"\",INDEX('Étape 1 – Ce qui change'!$S:$S,MATCH($A102,'[1]Step 1-What is changing'!$J:$J,0)))","v":""},{"$f":"IF(ISERROR(MATCH($A102,'[1]Step 1-What is changing'!$J:$J,0)),\"\",INDEX('Étape 1 – Ce qui change'!$T:$T,MATCH($A102,'[1]Step 1-What is changing'!$J:$J,0)))","v":""},{"$f":"IF(ISERROR(MATCH($A102,'[1]Step 1-What is changing'!$J:$J,0)),\"\",INDEX('Étape 1 – Ce qui change'!$U:$U,MATCH($A102,'[1]Step 1-What is changing'!$J:$J,0)))","v":""},{"$f":"IF(ISERROR(MATCH($A102,'[1]Step 1-What is changing'!$J:$J,0)),\"\",INDEX('Étape 1 – Ce qui change'!$V:$V,MATCH($A102,'[1]Step 1-What is changing'!$J:$J,0)))","v":""},{"$f":"IF(ISERROR(MATCH($A102,'[1]Step 1-What is changing'!$J:$J,0)),\"\",INDEX('Étape 1 – Ce qui change'!$W:$W,MATCH($A102,'[1]Step 1-What is changing'!$J:$J,0)))","v":""},{"$f":"IF(ISERROR(MATCH($A102,'[1]Step 1-What is changing'!$J:$J,0)),\"\",INDEX('Étape 1 – Ce qui change'!$X:$X,MATCH($A102,'[1]Step 1-What is changing'!$J:$J,0)))","v":""},{"$f":"IF(ISERROR(MATCH($A102,'[1]Step 1-What is changing'!$J:$J,0)),\"\",INDEX('Étape 1 – Ce qui change'!$Y:$Y,MATCH($A102,'[1]Step 1-What is changing'!$J:$J,0)))","v":""},{"$f":"IF(ISERROR(MATCH($A102,'[1]Step 1-What is changing'!$J:$J,0)),\"\",INDEX('Étape 1 – Ce qui change'!$Z:$Z,MATCH($A102,'[1]Step 1-What is changing'!$J:$J,0)))","v":""},{"$f":"IF(ISERROR(MATCH($A102,'[1]Step 1-What is changing'!$J:$J,0)),\"\",INDEX('Étape 1 – Ce qui change'!$AA:$AA,MATCH($A102,'[1]Step 1-What is changing'!$J:$J,0)))","v":""}]
[99,{"$f":"IF(ISERROR(MATCH($A103,'[1]Step 1-What is changing'!$J:$J,0)),\"\",INDEX('Étape 1 – Ce qui change'!$D:$D,MATCH($A103,'[1]Step 1-What is changing'!$J:$J,0))&\" - \"&INDEX('Étape 1 – Ce qui change'!$G:$G,MATCH($A103,'[1]Step 1-What is changing'!$J:$J,0)))","v":""},0,{"$error":"#DIV/0!"},"",{"$f":"IF(ISERROR(MATCH($A103,'[1]Step 1-What is changing'!$J:$J,0)),\"\",INDEX('Étape 1 – Ce qui change'!$I:$I,MATCH($A103,'[1]Step 1-What is changing'!$J:$J,0)))","v":""},{"$f":"IF(ISERROR(MATCH($A103,'[1]Step 1-What is changing'!$J:$J,0)),\"\",INDEX('Étape 1 – Ce qui change'!$J:$J,MATCH($A103,'[1]Step 1-What is changing'!$J:$J,0)))","v":""},"","","",{"$f":"IF(ISERROR(MATCH($A103,'[1]Step 1-What is changing'!$J:$J,0)),\"\",INDEX('Étape 1 – Ce qui change'!$N:$N,MATCH($A103,'[1]Step 1-What is changing'!$J:$J,0)))","v":""},{"$f":"IF(ISERROR(MATCH($A103,'[1]Step 1-What is changing'!$J:$J,0)),\"\",INDEX('Étape 1 – Ce qui change'!$O:$O,MATCH($A103,'[1]Step 1-What is changing'!$J:$J,0)))","v":""},{"$f":"IF(ISERROR(MATCH($A103,'[1]Step 1-What is changing'!$J:$J,0)),\"\",INDEX('Étape 1 – Ce qui change'!$P:$P,MATCH($A103,'[1]Step 1-What is changing'!$J:$J,0)))","v":""},{"$f":"IF(ISERROR(MATCH($A103,'[1]Step 1-What is changing'!$J:$J,0)),\"\",INDEX('Étape 1 – Ce qui change'!$Q:$Q,MATCH($A103,'[1]Step 1-What is changing'!$J:$J,0)))","v":""},{"$f":"IF(ISERROR(MATCH($A103,'[1]Step 1-What is changing'!$J:$J,0)),\"\",INDEX('Étape 1 – Ce qui change'!$R:$R,MATCH($A103,'[1]Step 1-What is changing'!$J:$J,0)))","v":""},{"$f":"IF(ISERROR(MATCH($A103,'[1]Step 1-What is changing'!$J:$J,0)),\"\",INDEX('Étape 1 – Ce qui change'!$S:$S,MATCH($A103,'[1]Step 1-What is changing'!$J:$J,0)))","v":""},{"$f":"IF(ISERROR(MATCH($A103,'[1]Step 1-What is changing'!$J:$J,0)),\"\",INDEX('Étape 1 – Ce qui change'!$T:$T,MATCH($A103,'[1]Step 1-What is changing'!$J:$J,0)))","v":""},{"$f":"IF(ISERROR(MATCH($A103,'[1]Step 1-What is changing'!$J:$J,0)),\"\",INDEX('Étape 1 – Ce qui change'!$U:$U,MATCH($A103,'[1]Step 1-What is changing'!$J:$J,0)))","v":""},{"$f":"IF(ISERROR(MATCH($A103,'[1]Step 1-What is changing'!$J:$J,0)),\"\",INDEX('Étape 1 – Ce qui change'!$V:$V,MATCH($A103,'[1]Step 1-What is changing'!$J:$J,0)))","v":""},{"$f":"IF(ISERROR(MATCH($A103,'[1]Step 1-What is changing'!$J:$J,0)),\"\",INDEX('Étape 1 – Ce qui change'!$W:$W,MATCH($A103,'[1]Step 1-What is changing'!$J:$J,0)))","v":""},{"$f":"IF(ISERROR(MATCH($A103,'[1]Step 1-What is changing'!$J:$J,0)),\"\",INDEX('Étape 1 – Ce qui change'!$X:$X,MATCH($A103,'[1]Step 1-What is changing'!$J:$J,0)))","v":""},{"$f":"IF(ISERROR(MATCH($A103,'[1]Step 1-What is changing'!$J:$J,0)),\"\",INDEX('Étape 1 – Ce qui change'!$Y:$Y,MATCH($A103,'[1]Step 1-What is changing'!$J:$J,0)))","v":""},{"$f":"IF(ISERROR(MATCH($A103,'[1]Step 1-What is changing'!$J:$J,0)),\"\",INDEX('Étape 1 – Ce qui change'!$Z:$Z,MATCH($A103,'[1]Step 1-What is changing'!$J:$J,0)))","v":""},{"$f":"IF(ISERROR(MATCH($A103,'[1]Step 1-What is changing'!$J:$J,0)),\"\",INDEX('Étape 1 – Ce qui change'!$AA:$AA,MATCH($A103,'[1]Step 1-What is changing'!$J:$J,0)))","v":""}]
[100,{"$f":"IF(ISERROR(MATCH($A104,'[1]Step 1-What is changing'!$J:$J,0)),\"\",INDEX('Étape 1 – Ce qui change'!$D:$D,MATCH($A104,'[1]Step 1-What is changing'!$J:$J,0))&\" - \"&INDEX('Étape 1 – Ce qui change'!$G:$G,MATCH($A104,'[1]Step 1-What is changing'!$J:$J,0)))","v":""},0,{"$error":"#DIV/0!"},"",{"$f":"IF(ISERROR(MATCH($A104,'[1]Step 1-What is changing'!$J:$J,0)),\"\",INDEX('Étape 1 – Ce qui change'!$I:$I,MATCH($A104,'[1]Step 1-What is changing'!$J:$J,0)))","v":""},{"$f":"IF(ISERROR(MATCH($A104,'[1]Step 1-What is changing'!$J:$J,0)),\"\",INDEX('Étape 1 – Ce qui change'!$J:$J,MATCH($A104,'[1]Step 1-What is changing'!$J:$J,0)))","v":""},"","","",{"$f":"IF(ISERROR(MATCH($A104,'[1]Step 1-What is changing'!$J:$J,0)),\"\",INDEX('Étape 1 – Ce qui change'!$N:$N,MATCH($A104,'[1]Step 1-What is changing'!$J:$J,0)))","v":""},{"$f":"IF(ISERROR(MATCH($A104,'[1]Step 1-What is changing'!$J:$J,0)),\"\",INDEX('Étape 1 – Ce qui change'!$O:$O,MATCH($A104,'[1]Step 1-What is changing'!$J:$J,0)))","v":""},{"$f":"IF(ISERROR(MATCH($A104,'[1]Step 1-What is changing'!$J:$J,0)),\"\",INDEX('Étape 1 – Ce qui change'!$P:$P,MATCH($A104,'[1]Step 1-What is changing'!$J:$J,0)))","v":""},{"$f":"IF(ISERROR(MATCH($A104,'[1]Step 1-What is changing'!$J:$J,0)),\"\",INDEX('Étape 1 – Ce qui change'!$Q:$Q,MATCH($A104,'[1]Step 1-What is changing'!$J:$J,0)))","v":""},{"$f":"IF(ISERROR(MATCH($A104,'[1]Step 1-What is changing'!$J:$J,0)),\"\",INDEX('Étape 1 – Ce qui change'!$R:$R,MATCH($A104,'[1]Step 1-What is changing'!$J:$J,0)))","v":""},{"$f":"IF(ISERROR(MATCH($A104,'[1]Step 1-What is changing'!$J:$J,0)),\"\",INDEX('Étape 1 – Ce qui change'!$S:$S,MATCH($A104,'[1]Step 1-What is changing'!$J:$J,0)))","v":""},{"$f":"IF(ISERROR(MATCH($A104,'[1]Step 1-What is changing'!$J:$J,0)),\"\",INDEX('Étape 1 – Ce qui change'!$T:$T,MATCH($A104,'[1]Step 1-What is changing'!$J:$J,0)))","v":""},{"$f":"IF(ISERROR(MATCH($A104,'[1]Step 1-What is changing'!$J:$J,0)),\"\",INDEX('Étape 1 – Ce qui change'!$U:$U,MATCH($A104,'[1]Step 1-What is changing'!$J:$J,0)))","v":""},{"$f":"IF(ISERROR(MATCH($A104,'[1]Step 1-What is changing'!$J:$J,0)),\"\",INDEX('Étape 1 – Ce qui change'!$V:$V,MATCH($A104,'[1]Step 1-What is changing'!$J:$J,0)))","v":""},{"$f":"IF(ISERROR(MATCH($A104,'[1]Step 1-What is changing'!$J:$J,0)),\"\",INDEX('Étape 1 – Ce qui change'!$W:$W,MATCH($A104,'[1]Step 1-What is changing'!$J:$J,0)))","v":""},{"$f":"IF(ISERROR(MATCH($A104,'[1]Step 1-What is changing'!$J:$J,0)),\"\",INDEX('Étape 1 – Ce qui change'!$X:$X,MATCH($A104,'[1]Step 1-What is changing'!$J:$J,0)))","v":""},{"$f":"IF(ISERROR(MATCH($A104,'[1]Step 1-What is changing'!$J:$J,0)),\"\",INDEX('Étape 1 – Ce qui change'!$Y:$Y,MATCH($A104,'[1]Step 1-What is changing'!$J:$J,0)))","v":""},{"$f":"IF(ISERROR(MATCH($A104,'[1]Step 1-What is changing'!$J:$J,0)),\"\",INDEX('Étape 1 – Ce qui change'!$Z:$Z,MATCH($A104,'[1]Step 1-What is changing'!$J:$J,0)))","v":""},{"$f":"IF(ISERROR(MATCH($A104,'[1]Step 1-What is changing'!$J:$J,0)),\"\",INDEX('Étape 1 – Ce qui change'!$AA:$AA,MATCH($A104,'[1]Step 1-What is changing'!$J:$J,0)))","v":""}]

{"sheet":"Résultats – Évaluation des répe","index":3,"n_rows":104,"n_cols":28,"rows_kept":104,"cut":false,"hidden":false,"merged":[[0,1,0,28],[1,1,1,27]]}
[null,"Résultats : Inventaire des changements et évaluation des répercussions"]
[null,"Les résultats définitifs de l’inventaire des changements et de l’évaluation des répercussions sont présentés ci-dessous. Chaque changement potentiel lié au projet de modernisation du lieu de travail est lié à son niveau d’incidence sur les employés. Le niveau d’incidence donne une idée du niveau d’effort à consacrer à chaque élément précis de la stratégie de gestion du changement. Il y a également un graphique indiquant le nombre de changements par domaine de changement (GI, sécurité des TI, RH, installations), ainsi qu’un graphique montrant les dix éléments ayant l’incidence la plus importante sur les employés. "]
[null,null,2000]
[null,{"$f":"' Étape 2 – Nombre d’ETP touchés'!B4","v":"Liste des changements"},{"$f":"' Étape 2 – Nombre d’ETP touchés'!C4","v":"Nombre d’ETP touchés\n(nombre d’ETP)"},{"$f":"' Étape 2 – Nombre d’ETP touchés'!D4","v":"Pourcentage global des ETP touchés \n(%)"},{"$f":"' Étape 2 – Nombre d’ETP touchés'!E4","v":"Check If applicable change to your organization"},{"$f":"' Étape 2 – Nombre d’ETP touchés'!F4","v":"Formula only"},{"$f":"' Étape 2 – Nombre d’ETP touchés'!G4","v":"Formula\nfor order in Step2 Page"},{"$f":"' Étape 2 – Nombre d’ETP touchés'!H4","v":"T"},{"$f":"' Étape 2 – Nombre d’ETP touchés'!I4","v":"B"},{"$f":"' Étape 2 – Nombre d’ETP touchés'!J4","v":"P"},{"$f":"' Étape 2 – Nombre d’ETP touchés'!K4","v":"formula\nfor F"},{"$f":"' Étape 2 – Nombre d’ETP touchés'!L4","v":"formula\nfor G"},{"$f":"' Étape 2 – Nombre d’ETP touchés'!M4","v":"formula\nfor H"},{"$f":"' Étape 2 – Nombre d’ETP touchés'!N4","v":"Base point"},{"$f":"' Étape 2 – Nombre d’ETP touchés'!O4","v":"Score of Change"},{"$f":"' Étape 2 – Nombre d’ETP touchés'!P4","v":"Degree of Change"},{"$f":"' Étape 2 – Nombre d’ETP touchés'!Q4","v":"Weigth of change\nT"},{"$f":"' Étape 2 – Nombre d’ETP touchés'!R4","v":"Weigth of change\nB"},{"$f":"' Étape 2 – Nombre d’ETP touchés'!S4","v":"Weigth of change\nP"},{"$f":"' Étape 2 – Nombre d’ETP touchés'!T4","v":"Weigth of change\nT"},{"$f":"' Étape 2 – Nombre d’ETP touchés'!U4","v":"Weigth of change\nB"},{"$f":"' Étape 2 – Nombre d’ETP touchés'!V4","v":"Weigth of change\nP"},{"$f":"' Étape 2 – Nombre d’ETP touchés'!W4","v":"Overall,how big of a change?"},"Enabling sector","Impact score","Change rank",{"$f":"' Étape 2 – Nombre d’ETP touchés'!X4","v":"Degree of Change"},"Évaluation des répercussions"]
[{"$f":"ROW()-4","v":1},{"$f":"' Étape 2 – Nombre d’ETP touchés'!B5","v":""},{"$f":"' Étape 2 – Nombre d’ETP touchés'!C5","v":0},{"$f":"' Étape 2 – Nombre d’ETP touchés'!D5","v":{"$error":"#DIV/0!"}},{"$f":"' Étape 2 – Nombre d’ETP touchés'!E5","v":""},{"$f":"' Étape 2 – Nombre d’ETP touchés'!F5","v":""},{"$f":"' Étape 2 – Nombre d’ETP touchés'!G5","v":""},{"$f":"' Étape 2 – Nombre d’ETP touchés'!H5","v":""},{"$f":"' Étape 2 – Nombre d’ETP touchés'!I5","v":""},{"$f":"' Étape 2 – Nombre d’ETP touchés'!J5","v":""},{"$f":"' Étape 2 – Nombre d’ETP touchés'!K5","v":""},{"$f":"' Étape 2 – Nombre d’ETP touchés'!L5","v":""},{"$f":"' Étape 2 – Nombre d’ETP touchés'!M5","v":""},{"$f":"' Étape 2 – Nombre d’ETP touchés'!N5","v":""},{"$f":"' Étape 2 – Nombre d’ETP touchés'!O5","v":""},{"$f":"' Étape 2 – Nombre d’ETP touchés'!P5","v":""},{"$f":"' Étape 2 – Nombre d’ETP touchés'!Q5","v":""},{"$f":"' Étape 2 – Nombre d’ETP touchés'!R5","v":""},{"$f":"' Étape 2 – Nombre d’ETP touchés'!S5","v":""},{"$f":"' Étape 2 – Nombre d’ETP touchés'!T5","v":""},{"$f":"' Étape 2 – Nombre d’ETP touchés'!U5","v":""},{"$f":"' Étape 2 – Nombre d’ETP touchés'!V5","v":""},{"$f":"' Étape 2 – Nombre d’ETP touchés'!W5","v":""},{"$f":"IF(_xlfn.NUMBERVALUE(LEFT(B5,1))=0,\"\",_xlfn.NUMBERVALUE(LEFT(B5,1)))","v":""},{"$f":"IF(AB5=\"LOW\",1,\nIF(AB5=\"MED\",2,\nIF(AB5=\"HIGH\",3,\"N/A\")))","v":{"$error":"#DIV/0!"}},{"$f":"_xlfn.RANK.EQ(Y5:Y104,Y5:Y104)","v":{"$error":"#DIV/0!"}},{"$f":"' Étape 2 – Nombre d’ETP touchés'!X5","v":""},{"$f":"IF(AND(AA5=\"LOW\",D5<50),\"LOW\",\nIF(AND(AA5=\"LOW\",D5>=50),\"MED\",\nIF(AND(AA5=\"MED\",D5<50),\"MED\",\nIF(AND(AA5=\"MED\",D5>=50),\"HIGH\",\nIF(AND(AA5=\"HIGH\",D5<50),\"MED\",\nIF(AND(AA5=\"HIGH\",D5>=50),\"HIGH\",\nIF(AA5=\"Minimal Change for Employee\",\"N/A\",\n\"ERROR\")))))))","v":{"$error":"#DIV/0!"}}]
[{"$f":"ROW()-4","v":2},{"$f":"' Étape 2 – Nombre d’ETP touchés'!B6","v":""},{"$f":"' Étape 2 – Nombre d’ETP touchés'!C6","v":0},{"$f":"' Étape 2 – Nombre d’ETP touchés'!D6","v":{"$error":"#DIV/0!"}},{"$f":"' Étape 2 – Nombre d’ETP touchés'!E6","v":""},{"$f":"' Étape 2 – Nombre d’ETP touchés'!F6","v":""},{"$f":"' Étape 2 – Nombre d’ETP touchés'!G6","v":""},{"$f":"' Étape 2 – Nombre d’ETP touchés'!H6","v":""},{"$f":"' Étape 2 – Nombre d’ETP touchés'!I6","v":""},{"$f":"' Étape 2 – Nombre d’ETP touchés'!J6","v":""},{"$f":"' Étape 2 – Nombre d’ETP touchés'!K6","v":""},{"$f":"' Étape 2 – Nombre d’ETP touchés'!L6","v":""},{"$f":"' Étape 2 – Nombre d’ETP touchés'!M6","v":""},{"$f":"' Étape 2 – Nombre d’ETP touchés'!N6","v":""},{"$f":"' Étape 2 – Nombre d’ETP touchés'!O6","v":""},{"$f":"' Étape 2 – Nombre d’ETP touchés'!P6","v":""},{"$f":"' Étape 2 – Nombre d’ETP touchés'!Q6","v":""},{"$f":"' Étape 2 – Nombre d’ETP touchés'!R6","v":""},{"$f":"' Étape 2 – Nombre d’ETP touchés'!S6","v":""},{"$f":"' Étape 2 – Nombre d’ETP touchés'!T6","v":""},{"$f":"' Étape 2 – Nombre d’ETP touchés'!U6","v":""},{"$f":"' Étape 2 – Nombre d’ETP touchés'!V6","v":""},{"$f":"' Étape 2 – Nombre d’ETP touchés'!W6","v":""},{"$f":"IF(_xlfn.NUMBERVALUE(LEFT(B6,1))=0,\"\",_xlfn.NUMBERVALUE(LEFT(B6,1)))","v":""},{"$f":"IF(AB6=\"LOW\",1,\nIF(AB6=\"MED\",2,\nIF(AB6=\"HIGH\",3,\"N/A\")))","v":{"$error":"#DIV/0!"}},{"$error":"#DIV/0!"},{"$f":"' Étape 2 – Nombre d’ETP touchés'!X6","v":""},{"$error":"#DIV/0!"}]
[3,{"$f":"' Étape 2 – Nombre d’ETP touchés'!B7","v":""},{"$f":"' Étape 2 – Nombre d’ETP touchés'!C7","v":0},{"$f":"' Étape 2 – Nombre d’ETP touchés'!D7","v":{"$error":"#DIV/0!"}},{"$f":"' Étape 2 – Nombre d’ETP touchés'!E7","v":""},{"$f":"' Étape 2 – Nombre d’ETP touchés'!F7","v":""},{"$f":"' Étape 2 – Nombre d’ETP touchés'!G7","v":""},{"$f":"' Étape 2 – Nombre d’ETP touchés'!H7","v":""},{"$f":"' Étape 2 – Nombre d’ETP touchés'!I7","v":""},{"$f":"' Étape 2 – Nombre d’ETP touchés'!J7","v":""},{"$f":"' Étape 2 – Nombre d’ETP touchés'!K7","v":""},{"$f":"' Étape 2 – Nombre d’ETP touchés'!L7","v":""},{"$f":"' Étape 2 – Nombre d’ETP touchés'!M7","v":""},{"$f":"' Étape 2 – Nombre d’ETP touchés'!N7","v":""},{"$f":"' Étape 2 – Nombre d’ETP touchés'!O7","v":""},{"$f":"' Étape 2 – Nombre d’ETP touchés'!P7","v":""},{"$f":"' Étape 2 – Nombre d’ETP touchés'!Q7","v":""},{"$f":"' Étape 2 – Nombre d’ETP touchés'!R7","v":""},{"$f":"' Étape 2 – Nombre d’ETP touchés'!S7","v":""},{"$f":"' Étape 2 – Nombre d’ETP touchés'!T7","v":""},{"$f":"' Étape 2 – Nombre d’ETP touchés'!U7","v":""},{"$f":"' Étape 2 – Nombre d’ETP touchés'!V7","v":""},{"$f":"' Étape 2 – Nombre d’ETP touchés'!W7","v":""},"",{"$error":"#DIV/0!"},{"$error":"#DIV/0!"},{"$f":"' Étape 2 – Nombre d’ETP touchés'!X7","v":""},{"$error":"#DIV/0!"}]
[4,{"$f":"' Étape 2 – Nombre d’ETP touchés'!B8","v":""},{"$f":"' Étape 2 – Nombre d’ETP touchés'!C8","v":0},{"$f":"' Étape 2 – Nombre d’ETP touchés'!D8","v":{"$error":"#DIV/0!"}},{"$f":"' Étape 2 – Nombre d’ETP touchés'!E8","v":""},{"$f":"' Étape 2 – Nombre d’ETP touchés'!F8","v":""},{"$f":"' Étape 2 – Nombre d’ETP touchés'!G8","v":""},{"$f":"' Étape 2 – Nombre d’ETP touchés'!H8","v":""},{"$f":"' Étape 2 – Nombre d’ETP touchés'!I8","v":""},{"$f":"' Étape 2 – Nombre d’ETP touchés'!J8","v":""},{"$f":"' Étape 2 – Nombre d’ETP touchés'!K8","v":""},{"$f":"' Étape 2 – Nombre d’ETP touchés'!L8","v":""},{"$f":"' Étape 2 – Nombre d’ETP touchés'!M8","v":""},{"$f":"' Étape 2 – Nombre d’ETP touchés'!N8","v":""},{"$f":"' Étape 2 – Nombre d’ETP touchés'!O8","v":""},{"$f":"' Étape 2 – Nombre d’ETP touchés'!P8","v":""},{"$f":"' Étape 2 – Nombre d’ETP touchés'!Q8","v":""},{"$f":"' Étape 2 – Nombre d’ETP touchés'!R8","v":""},{"$f":"' Étape 2 – Nombre d’ETP touchés'!S8","v":""},{"$f":"' Étape 2 – Nombre d’ETP touchés'!T8","v":""},{"$f":"' Étape 2 – Nombre d’ETP touchés'!U8","v":""},{"$f":"' Étape 2 – Nombre d’ETP touchés'!V8","v":""},{"$f":"' Étape 2 – Nombre d’ETP touchés'!W8","v":""},"",{"$error":"#DIV/0!"},{"$error":"#DIV/0!"},{"$f":"' Étape 2 – Nombre d’ETP touchés'!X8","v":""},{"$error":"#DIV/0!"}]
[5,{"$f":"' Étape 2 – Nombre d’ETP touchés'!B9","v":""},{"$f":"' Étape 2 – Nombre d’ETP touchés'!C9","v":0},{"$f":"' Étape 2 – Nombre d’ETP touchés'!D9","v":{"$error":"#DIV/0!"}},{"$f":"' Étape 2 – Nombre d’ETP touchés'!E9","v":""},{"$f":"' Étape 2 – Nombre d’ETP touchés'!F9","v":""},{"$f":"' Étape 2 – Nombre d’ETP touchés'!G9","v":""},{"$f":"' Étape 2 – Nombre d’ETP touchés'!H9","v":""},{"$f":"' Étape 2 – Nombre d’ETP touchés'!I9","v":""},{"$f":"' Étape 2 – Nombre d’ETP touchés'!J9","v":""},{"$f":"' Étape 2 – Nombre d’ETP touchés'!K9","v":""},{"$f":"' Étape 2 – Nombre d’ETP touchés'!L9","v":""},{"$f":"' Étape 2 – Nombre d’ETP touchés'!M9","v":""},{"$f":"' Étape 2 – Nombre d’ETP touchés'!N9","v":""},{"$f":"' Étape 2 – Nombre d’ETP touchés'!O9","v":""},{"$f":"' Étape 2 – Nombre d’ETP touchés'!P9","v":""},{"$f":"' Étape 2 – Nombre d’ETP touchés'!Q9","v":""},{"$f":"' Étape 2 – Nombre d’ETP touchés'!R9","v":""},{"$f":"' Étape 2 – Nombre d’ETP touchés'!S9","v":""},{"$f":"' Étape 2 – Nombre d’ETP touchés'!T9","v":""},{"$f":"' Étape 2 – Nombre d’ETP touchés'!U9","v":""},{"$f":"' Étape 2 – Nombre d’ETP touchés'!V9","v":""},{"$f":"' Étape 2 – Nombre d’ETP touchés'!W9","v":""},"",{"$error":"#DIV/0!"},{"$error":"#DIV/0!"},{"$f":"' Étape 2 – Nombre d’ETP touchés'!X9","v":""},{"$error":"#DIV/0!"}]
[6,{"$f":"' Étape 2 – Nombre d’ETP touchés'!B10","v":""},{"$f":"' Étape 2 – Nombre d’ETP touchés'!C10","v":0},{"$f":"' Étape 2 – Nombre d’ETP touchés'!D10","v":{"$error":"#DIV/0!"}},{"$f":"' Étape 2 – Nombre d’ETP touchés'!E10","v":""},{"$f":"' Étape 2 – Nombre d’ETP touchés'!F10","v":""},{"$f":"' Étape 2 – Nombre d’ETP touchés'!G10","v":""},{"$f":"' Étape 2 – Nombre d’ETP touchés'!H10","v":""},{"$f":"' Étape 2 – Nombre d’ETP touchés'!I10","v":""},{"$f":"' Étape 2 – Nombre d’ETP touchés'!J10","v":""},{"$f":"' Étape 2 – Nombre d’ETP touchés'!K10","v":""},{"$f":"' Étape 2 – Nombre d’ETP touchés'!L10","v":""},{"$f":"' Étape 2 – Nombre d’ETP touchés'!M10","v":""},{"$f":"' Étape 2 – Nombre d’ETP touchés'!N10","v":""},{"$f":"' Étape 2 – Nombre d’ETP touchés'!O10","v":""},{"$f":"' Étape 2 – Nombre d’ETP touchés'!P10","v":""},{"$f":"' Étape 2 – Nombre d’ETP touchés'!Q10","v":""},{"$f":"' Étape 2 – Nombre d’ETP touchés'!R10","v":""},{"$f":"' Étape 2 – Nombre d’ETP touchés'!S10","v":""},{"$f":"' Étape 2 – Nombre d’ETP touchés'!T10","v":""},{"$f":"' Étape 2 – Nombre d’ETP touchés'!U10","v":""},{"$f":"' Étape 2 – Nombre d’ETP touchés'!V10","v":""},{"$f":"' Étape 2 – Nombre d’ETP touchés'!W10","v":""},"",{"$error":"#DIV/0!"},{"$error":"#DIV/0!"},{"$f":"' Étape 2 – Nombre d’ETP touchés'!X10","v":""},{"$error":"#DIV/0!"}]
[7,{"$f":"' Étape 2 – Nombre d’ETP touchés'!B11","v":""},{"$f":"' Étape 2 – Nombre d’ETP touchés'!C11","v":0},{"$f":"' Étape 2 – Nombre d’ETP touchés'!D11","v":{"$error":"#DIV/0!"}},{"$f":"' Étape 2 – Nombre d’ETP touchés'!E11","v":""},{"$f":"' Étape 2 – Nombre d’ETP touchés'!F11","v":""},{"$f":"' Étape 2 – Nombre d’ETP touchés'!G11","v":""},{"$f":"' Étape 2 – Nombre d’ETP touchés'!H11","v":""},{"$f":"' Étape 2 – Nombre d’ETP touchés'!I11","v":""},{"$f":"' Étape 2 – Nombre d’ETP touchés'!J11","v":""},{"$f":"' Étape 2 – Nombre d’ETP touchés'!K11","v":""},{"$f":"' Étape 2 – Nombre d’ETP touchés'!L11","v":""},{"$f":"' Étape 2 – Nombre d’ETP touchés'!M11","v":""},{"$f":"' Étape 2 – Nombre d’ETP touchés'!N11","v":""},{"$f":"' Étape 2 – Nombre d’ETP touchés'!O11","v":""},{"$f":"' Étape 2 – Nombre d’ETP touchés'!P11","v":""},{"$f":"' Étape 2 – Nombre d’ETP touchés'!Q11","v":""},{"$f":"' Étape 2 – Nombre d’ETP touchés'!R11","v":""},{"$f":"' Étape 2 – Nombre d’ETP touchés'!S11","v":""},{"$f":"' Étape 2 – Nombre d’ETP touchés'!T11","v":""},{"$f":"' Étape 2 – Nombre d’ETP touchés'!U11","v":""},{"$f":"' Étape 2 – Nombre d’ETP touchés'!V11","v":""},{"$f":"' Étape 2 – Nombre d’ETP touchés'!W11","v":""},"",{"$error":"#DIV/0!"},{"$error":"#DIV/0!"},{"$f":"' Étape 2 – Nombre d’ETP touchés'!X11","v":""},{"$error":"#DIV/0!"}]
[8,{"$f":"' Étape 2 – Nombre d’ETP touchés'!B12","v":""},{"$f":"' Étape 2 – Nombre d’ETP touchés'!C12","v":0},{"$f":"' Étape 2 – Nombre d’ETP touchés'!D12","v":{"$error":"#DIV/0!"}},{"$f":"' Étape 2 – Nombre d’ETP touchés'!E12","v":""},{"$f":"' Étape 2 – Nombre d’ETP touchés'!F12","v":""},{"$f":"' Étape 2 – Nombre d’ETP touchés'!G12","v":""},{"$f":"' Étape 2 – Nombre d’ETP touchés'!H12","v":""},{"$f":"' Étape 2 – Nombre d’ETP touchés'!I12","v":""},{"$f":"' Étape 2 – Nombre d’ETP touchés'!J12","v":""},{"$f":"' Étape 2 – Nombre d’ETP touchés'!K12","v":""},{"$f":"' Étape 2 – Nombre d’ETP touchés'!L12","v":""},{"$f":"' Étape 2 – Nombre d’ETP touchés'!M12","v":""},{"$f":"' Étape 2 – Nombre d’ETP touchés'!N12","v":""},{"$f":"' Étape 2 – Nombre d’ETP touchés'!O12","v":""},{"$f":"' Étape 2 – Nombre d’ETP touchés'!P12","v":""},{"$f":"' Étape 2 – Nombre d’ETP touchés'!Q12","v":""},{"$f":"' Étape 2 – Nombre d’ETP touchés'!R12","v":""},{"$f":"' Étape 2 – Nombre d’ETP touchés'!S12","v":""},{"$f":"' Étape 2 – Nombre d’ETP touchés'!T12","v":""},{"$f":"' Étape 2 – Nombre d’ETP touchés'!U12","v":""},{"$f":"' Étape 2 – Nombre d’ETP touchés'!V12","v":""},{"$f":"' Étape 2 – Nombre d’ETP touchés'!W12","v":""},"",{"$error":"#DIV/0!"},{"$error":"#DIV/0!"},{"$f":"' Étape 2 – Nombre d’ETP touchés'!X12","v":""},{"$error":"#DIV/0!"}]
[9,{"$f":"' Étape 2 – Nombre d’ETP touchés'!B13","v":""},{"$f":"' Étape 2 – Nombre d’ETP touchés'!C13","v":0},{"$f":"' Étape 2 – Nombre d’ETP touchés'!D13","v":{"$error":"#DIV/0!"}},{"$f":"' Étape 2 – Nombre d’ETP touchés'!E13","v":""},{"$f":"' Étape 2 – Nombre d’ETP touchés'!F13","v":""},{"$f":"' Étape 2 – Nombre d’ETP touchés'!G13","v":""},{"$f":"' Étape 2 – Nombre d’ETP touchés'!H13","v":""},{"$f":"' Étape 2 – Nombre d’ETP touchés'!I13","v":""},{"$f":"' Étape 2 – Nombre d’ETP touchés'!J13","v":""},{"$f":"' Étape 2 – Nombre d’ETP touchés'!K13","v":""},{"$f":"' Étape 2 – Nombre d’ETP touchés'!L13","v":""},{"$f":"' Étape 2 – Nombre d’ETP touchés'!M13","v":""},{"$f":"' Étape 2 – Nombre d’ETP touchés'!N13","v":""},{"$f":"' Étape 2 – Nombre d’ETP touchés'!O13","v":""},{"$f":"' Étape 2 – Nombre d’ETP touchés'!P13","v":""},{"$f":"' Étape 2 – Nombre d’ETP touchés'!Q13","v":""},{"$f":"' Étape 2 – Nombre d’ETP touchés'!R13","v":""},{"$f":"' Étape 2 – Nombre d’ETP touchés'!S13","v":""},{"$f":"' Étape 2 – Nombre d’ETP touchés'!T13","v":""},{"$f":"' Étape 2 – Nombre d’ETP touchés'!U13","v":""},{"$f":"' Étape 2 – Nombre d’ETP touchés'!V13","v":""},{"$f":"' Étape 2 – Nombre d’ETP touchés'!W13","v":""},"",{"$error":"#DIV/0!"},{"$error":"#DIV/0!"},{"$f":"' Étape 2 – Nombre d’ETP touchés'!X13","v":""},{"$error":"#DIV/0!"}]
[10,{"$f":"' Étape 2 – Nombre d’ETP touchés'!B14","v":""},{"$f":"' Étape 2 – Nombre d’ETP touchés'!C14","v":0},{"$f":"' Étape 2 – Nombre d’ETP touchés'!D14","v":{"$error":"#DIV/0!"}},{"$f":"' Étape 2 – Nombre d’ETP touchés'!E14","v":""},{"$f":"' Étape 2 – Nombre d’ETP touchés'!F14","v":""},{"$f":"' Étape 2 – Nombre d’ETP touchés'!G14","v":""},{"$f":"' Étape 2 – Nombre d’ETP touchés'!H14","v":""},{"$f":"' Étape 2 – Nombre d’ETP touchés'!I14","v":""},{"$f":"' Étape 2 – Nombre d’ETP touchés'!J14","v":""},{"$f":"' Étape 2 – Nombre d’ETP touchés'!K14","v":""},{"$f":"' Étape 2 – Nombre d’ETP touchés'!L14","v":""},{"$f":"' Étape 2 – Nombre d’ETP touchés'!M14","v":""},{"$f":"' Étape 2 – Nombre d’ETP touchés'!N14","v":""},{"$f":"' Étape 2 – Nombre d’ETP touchés'!O14","v":""},{"$f":"' Étape 2 – Nombre d’ETP touchés'!P14","v":""},{"$f":"' Étape 2 – Nombre d’ETP touchés'!Q14","v":""},{"$f":"' Étape 2 – Nombre d’ETP touchés'!R14","v":""},{"$f":"' Étape 2 – Nombre d’ETP touchés'!S14","v":""},{"$f":"' Étape 2 – Nombre d’ETP touchés'!T14","v":""},{"$f":"' Étape 2 – Nombre d’ETP touchés'!U14","v":""},{"$f":"' Étape 2 – Nombre d’ETP touchés'!V14","v":""},{"$f":"' Étape 2 – Nombre d’ETP touchés'!W14","v":""},"",{"$error":"#DIV/0!"},{"$error":"#DIV/0!"},{"$f":"' Étape 2 – Nombre d’ETP touchés'!X14","v":""},{"$error":"#DIV/0!"}]
[11,{"$f":"' Étape 2 – Nombre d’ETP touchés'!B15","v":""},{"$f":"' Étape 2 – Nombre d’ETP touchés'!C15","v":0},{"$f":"' Étape 2 – Nombre d’ETP touchés'!D15","v":{"$error":"#DIV/0!"}},{"$f":"' Étape 2 – Nombre d’ETP touchés'!E15","v":""},{"$f":"' Étape 2 – Nombre d’ETP touchés'!F15","v":""},{"$f":"' Étape 2 – Nombre d’ETP touchés'!G15","v":""},{"$f":"' Étape 2 – Nombre d’ETP touchés'!H15","v":""},{"$f":"' Étape 2 – Nombre d’ETP touchés'!I15","v":""},{"$f":"' Étape 2 – Nombre d’ETP touchés'!J15","v":""},{"$f":"' Étape 2 – Nombre d’ETP touchés'!K15","v":""},{"$f":"' Étape 2 – Nombre d’ETP touchés'!L15","v":""},{"$f":"' Étape 2 – Nombre d’ETP touchés'!M15","v":""},{"$f":"' Étape 2 – Nombre d’ETP touchés'!N15","v":""},{"$f":"' Étape 2 – Nombre d’ETP touchés'!O15","v":""},{"$f":"' Étape 2 – Nombre d’ETP touchés'!P15","v":""},{"$f":"' Étape 2 – Nombre d’ETP touchés'!Q15","v":""},{"$f":"' Étape 2 – Nombre d’ETP touchés'!R15","v":""},{"$f":"' Étape 2 – Nombre d’ETP touchés'!S15","v":""},{"$f":"' Étape 2 – Nombre d’ETP touchés'!T15","v":""},{"$f":"' Étape 2 – Nombre d’ETP touchés'!U15","v":""},{"$f":"' Étape 2 – Nombre d’ETP touchés'!V15","v":""},{"$f":"' Étape 2 – Nombre d’ETP touchés'!W15","v":""},"",{"$error":"#DIV/0!"},{"$error":"#DIV/0!"},{"$f":"' Étape 2 – Nombre d’ETP touchés'!X15","v":""},{"$error":"#DIV/0!"}]
[12,{"$f":"' Étape 2 – Nombre d’ETP touchés'!B16","v":""},{"$f":"' Étape 2 – Nombre d’ETP touchés'!C16","v":0},{"$f":"' Étape 2 – Nombre d’ETP touchés'!D16","v":{"$error":"#DIV/0!"}},{"$f":"' Étape 2 – Nombre d’ETP touchés'!E16","v":""},{"$f":"' Étape 2 – Nombre d’ETP touchés'!F16","v":""},{"$f":"' Étape 2 – Nombre d’ETP touchés'!G16","v":""},{"$f":"' Étape 2 – Nombre d’ETP touchés'!H16","v":""},{"$f":"' Étape 2 – Nombre d’ETP touchés'!I16","v":""},{"$f":"' Étape 2 – Nombre d’ETP touchés'!J16","v":""},{"$f":"' Étape 2 – Nombre d’ETP touchés'!K16","v":""},{"$f":"' Étape 2 – Nombre d’ETP touchés'!L16","v":""},{"$f":"' Étape 2 – Nombre d’ETP touchés'!M16","v":""},{"$f":"' Étape 2 – Nombre d’ETP touchés'!N16","v":""},{"$f":"' Étape 2 – Nombre d’ETP touchés'!O16","v":""},{"$f":"' Étape 2 – Nombre d’ETP touchés'!P16","v":""},{"$f":"' Étape 2 – Nombre d’ETP touchés'!Q16","v":""},{"$f":"' Étape 2 – Nombre d’ETP touchés'!R16","v":""},{"$f":"' Étape 2 – Nombre d’ETP touchés'!S16","v":""},{"$f":"' Étape 2 – Nombre d’ETP touchés'!T16","v":""},{"$f":"' Étape 2 – Nombre d’ETP touchés'!U16","v":""},{"$f":"' Étape 2 – Nombre d’ETP touchés'!V16","v":""},{"$f":"' Étape 2 – Nombre d’ETP touchés'!W16","v":""},"",{"$error":"#DIV/0!"},{"$error":"#DIV/0!"},{"$f":"' Étape 2 – Nombre d’ETP touchés'!X16","v":""},{"$error":"#DIV/0!"}]
[13,{"$f":"' Étape 2 – Nombre d’ETP touchés'!B17","v":""},{"$f":"' Étape 2 – Nombre d’ETP touchés'!C17","v":0},{"$f":"' Étape 2 – Nombre d’ETP touchés'!D17","v":{"$error":"#DIV/0!"}},{"$f":"' Étape 2 – Nombre d’ETP touchés'!E17","v":""},{"$f":"' Étape 2 – Nombre d’ETP touchés'!F17","v":""},{"$f":"' Étape 2 – Nombre d’ETP touchés'!G17","v":""},{"$f":"' Étape 2 – Nombre d’ETP touchés'!H17","v":""},{"$f":"' Étape 2 – Nombre d’ETP touchés'!I17","v":""},{"$f":"' Étape 2 – Nombre d’ETP touchés'!J17","v":""},{"$f":"' Étape 2 – Nombre d’ETP touchés'!K17","v":""},{"$f":"' Étape 2 – Nombre d’ETP touchés'!L17","v":""},{"$f":"' Étape 2 – Nombre d’ETP touchés'!M17","v":""},{"$f":"' Étape 2 – Nombre d’ETP touchés'!N17","v":""},{"$f":"' Étape 2 – Nombre d’ETP touchés'!O17","v":""},{"$f":"' Étape 2 – Nombre d’ETP touchés'!P17","v":""},{"$f":"' Étape 2 – Nombre d’ETP touchés'!Q17","v":""},{"$f":"' Étape 2 – Nombre d’ETP touchés'!R17","v":""},{"$f":"' Étape 2 – Nombre d’ETP touchés'!S17","v":""},{"$f":"' Étape 2 – Nombre d’ETP touchés'!T17","v":""},{"$f":"' Étape 2 – Nombre d’ETP touchés'!U17","v":""},{"$f":"' Étape 2 – Nombre d’ETP touchés'!V17","v":""},{"$f":"' Étape 2 – Nombre d’ETP touchés'!W17","v":""},"",{"$error":"#DIV/0!"},{"$error":"#DIV/0!"},{"$f":"' Étape 2 – Nombre d’ETP touchés'!X17","v":""},{"$error":"#DIV/0!"}]
[14,{"$f":"' Étape 2 – Nombre d’ETP touchés'!B18","v":""},{"$f":"' Étape 2 – Nombre d’ETP touchés'!C18","v":0},{"$f":"' Étape 2 – Nombre d’ETP touchés'!D18","v":{"$error":"#DIV/0!"}},{"$f":"' Étape 2 – Nombre d’ETP touchés'!E18","v":""},{"$f":"' Étape 2 – Nombre d’ETP touchés'!F18","v":""},{"$f":"' Étape 2 – Nombre d’ETP touchés'!G18","v":""},{"$f":"' Étape 2 – Nombre d’ETP touchés'!H18","v":""},{"$f":"' Étape 2 – Nombre d’ETP touchés'!I18","v":""},{"$f":"' Étape 2 – Nombre d’ETP touchés'!J18","v":""},{"$f":"' Étape 2 – Nombre d’ETP touchés'!K18","v":""},{"$f":"' Étape 2 – Nombre d’ETP touchés'!L18","v":""},{"$f":"' Étape 2 – Nombre d’ETP touchés'!M18","v":""},{"$f":"' Étape 2 – Nombre d’ETP touchés'!N18","v":""},{"$f":"' Étape 2 – Nombre d’ETP touchés'!O18","v":""},{"$f":"' Étape 2 – Nombre d’ETP touchés'!P18","v":""},{"$f":"' Étape 2 – Nombre d’ETP touchés'!Q18","v":""},{"$f":"' Étape 2 – Nombre d’ETP touchés'!R18","v":""},{"$f":"' Étape 2 – Nombre d’ETP touchés'!S18","v":""},{"$f":"' Étape 2 – Nombre d’ETP touchés'!T18","v":""},{"$f":"' Étape 2 – Nombre d’ETP touchés'!U18","v":""},{"$f":"' Étape 2 – Nombre d’ETP touchés'!V18","v":""},{"$f":"' Étape 2 – Nombre d’ETP touchés'!W18","v":""},"",{"$error":"#DIV/0!"},{"$error":"#DIV/0!"},{"$f":"' Étape 2 – Nombre d’ETP touchés'!X18","v":""},{"$error":"#DIV/0!"}]
[15,{"$f":"' Étape 2 – Nombre d’ETP touchés'!B19","v":""},{"$f":"' Étape 2 – Nombre d’ETP touchés'!C19","v":0},{"$f":"' Étape 2 – Nombre d’ETP touchés'!D19","v":{"$error":"#DIV/0!"}},{"$f":"' Étape 2 – Nombre d’ETP touchés'!E19","v":""},{"$f":"' Étape 2 – Nombre d’ETP touchés'!F19","v":""},{"$f":"' Étape 2 – Nombre d’ETP touchés'!G19","v":""},{"$f":"' Étape 2 – Nombre d’ETP touchés'!H19","v":""},{"$f":"' Étape 2 – Nombre d’ETP touchés'!I19","v":""},{"$f":"' Étape 2 – Nombre d’ETP touchés'!J19","v":""},{"$f":"' Étape 2 – Nombre d’ETP touchés'!K19","v":""},{"$f":"' Étape 2 – Nombre d’ETP touchés'!L19","v":""},{"$f":"' Étape 2 – Nombre d’ETP touchés'!M19","v":""},{"$f":"' Étape 2 – Nombre d’ETP touchés'!N19","v":""},{"$f":"' Étape 2 – Nombre d’ETP touchés'!O19","v":""},{"$f":"' Étape 2 – Nombre d’ETP touchés'!P19","v":""},{"$f":"' Étape 2 – Nombre d’ETP touchés'!Q19","v":""},{"$f":"' Étape 2 – Nombre d’ETP touchés'!R19","v":""},{"$f":"' Étape 2 – Nombre d’ETP touchés'!S19","v":""},{"$f":"' Étape 2 – Nombre d’ETP touchés'!T19","v":""},{"$f":"' Étape 2 – Nombre d’ETP touchés'!U19","v":""},{"$f":"' Étape 2 – Nombre d’ETP touchés'!V19","v":""},{"$f":"' Étape 2 – Nombre d’ETP touchés'!W19","v":""},"",{"$error":"#DIV/0!"},{"$error":"#DIV/0!"},{"$f":"' Étape 2 – Nombre d’ETP touchés'!X19","v":""},{"$error":"#DIV/0!"}]
[16,{"$f":"' Étape 2 – Nombre d’ETP touchés'!B20","v":""},{"$f":"' Étape 2 – Nombre d’ETP touchés'!C20","v":0},{"$f":"' Étape 2 – Nombre d’ETP touchés'!D20","v":{"$error":"#DIV/0!"}},{"$f":"' Étape 2 – Nombre d’ETP touchés'!E20","v":""},{"$f":"' Étape 2 – Nombre d’ETP touchés'!F20","v":""},{"$f":"' Étape 2 – Nombre d’ETP touchés'!G20","v":""},{"$f":"' Étape 2 – Nombre d’ETP touchés'!H20","v":""},{"$f":"' Étape 2 – Nombre d’ETP touchés'!I20","v":""},{"$f":"' Étape 2 – Nombre d’ETP touchés'!J20","v":""},{"$f":"' Étape 2 – Nombre d’ETP touchés'!K20","v":""},{"$f":"' Étape 2 – Nombre d’ETP touchés'!L20","v":""},{"$f":"' Étape 2 – Nombre d’ETP touchés'!M20","v":""},{"$f":"' Étape 2 – Nombre d’ETP touchés'!N20","v":""},{"$f":"' Étape 2 – Nombre d’ETP touchés'!O20","v":""},{"$f":"' Étape 2 – Nombre d’ETP touchés'!P20","v":""},{"$f":"' Étape 2 – Nombre d’ETP touchés'!Q20","v":""},{"$f":"' Étape 2 – Nombre d’ETP touchés'!R20","v":""},{"$f":"' Étape 2 – Nombre d’ETP touchés'!S20","v":""},{"$f":"' Étape 2 – Nombre d’ETP touchés'!T20","v":""},{"$f":"' Étape 2 – Nombre d’ETP touchés'!U20","v":""},{"$f":"' Étape 2 – Nombre d’ETP touchés'!V20","v":""},{"$f":"' Étape 2 – Nombre d’ETP touchés'!W20","v":""},"",{"$error":"#DIV/0!"},{"$error":"#DIV/0!"},{"$f":"' Étape 2 – Nombre d’ETP touchés'!X20","v":""},{"$error":"#DIV/0!"}]
[17,{"$f":"' Étape 2 – Nombre d’ETP touchés'!B21","v":""},{"$f":"' Étape 2 – Nombre d’ETP touchés'!C21","v":0},{"$f":"' Étape 2 – Nombre d’ETP touchés'!D21","v":{"$error":"#DIV/0!"}},{"$f":"' Étape 2 – Nombre d’ETP touchés'!E21","v":""},{"$f":"' Étape 2 – Nombre d’ETP touchés'!F21","v":""},{"$f":"' Étape 2 – Nombre d’ETP touchés'!G21","v":""},{"$f":"' Étape 2 – Nombre d’ETP touchés'!H21","v":""},{"$f":"' Étape 2 – Nombre d’ETP touchés'!I21","v":""},{"$f":"' Étape 2 – Nombre d’ETP touchés'!J21","v":""},{"$f":"' Étape 2 – Nombre d’ETP touchés'!K21","v":""},{"$f":"' Étape 2 – Nombre d’ETP touchés'!L21","v":""},{"$f":"' Étape 2 – Nombre d’ETP touchés'!M21","v":""},{"$f":"' Étape 2 – Nombre d’ETP touchés'!N21","v":""},{"$f":"' Étape 2 – Nombre d’ETP touchés'!O21","v":""},{"$f":"' Étape 2 – Nombre d’ETP touchés'!P21","v":""},{"$f":"' Étape 2 – Nombre d’ETP touchés'!Q21","v":""},{"$f":"' Étape 2 – Nombre d’ETP touchés'!R21","v":""},{"$f":"' Étape 2 – Nombre d’ETP touchés'!S21","v":""},{"$f":"' Étape 2 – Nombre d’ETP touchés'!T21","v":""},{"$f":"' Étape 2 – Nombre d’ETP touchés'!U21","v":""},{"$f":"' Étape 2 – Nombre d’ETP touchés'!V21","v":""},{"$f":"' Étape 2 – Nombre d’ETP touchés'!W21","v":""},"",{"$error":"#DIV/0!"},{"$error":"#DIV/0!"},{"$f":"' Étape 2 – Nombre d’ETP touchés'!X21","v":""},{"$error":"#DIV/0!"}]
[18,{"$f":"' Étape 2 – Nombre d’ETP touchés'!B22","v":""},{"$f":"' Étape 2 – Nombre d’ETP touchés'!C22","v":0},{"$f":"' Étape 2 – Nombre d’ETP touchés'!D22","v":{"$error":"#DIV/0!"}},{"$f":"' Étape 2 – Nombre d’ETP touchés'!E22","v":0},{"$f":"' Étape 2 – Nombre d’ETP touchés'!F22","v":""},{"$f":"' Étape 2 – Nombre d’ETP touchés'!G22","v":""},{"$f":"' Étape 2 – Nombre d’ETP touchés'!H22","v":""},{"$f":"' Étape 2 – Nombre d’ETP touchés'!I22","v":""},{"$f":"' Étape 2 – Nombre d’ETP touchés'!J22","v":""},{"$f":"' Étape 2 – Nombre d’ETP touchés'!K22","v":""},{"$f":"' Étape 2 – Nombre d’ETP touchés'!L22","v":""},{"$f":"' Étape 2 – Nombre d’ETP touchés'!M22","v":""},{"$f":"' Étape 2 – Nombre d’ETP touchés'!N22","v":""},{"$f":"' Étape 2 – Nombre d’ETP touchés'!O22","v":""},{"$f":"' Étape 2 – Nombre d’ETP touchés'!P22","v":""},{"$f":"' Étape 2 – Nombre d’ETP touchés'!Q22","v":""},{"$f":"' Étape 2 – Nombre d’ETP touchés'!R22","v":""},{"$f":"' Étape 2 – Nombre d’ETP touchés'!S22","v":""},{"$f":"' Étape 2 – Nombre d’ETP touchés'!T22","v":""},{"$f":"' Étape 2 – Nombre d’ETP touchés'!U22","v":""},{"$f":"' Étape 2 – Nombre d’ETP touchés'!V22","v":""},{"$f":"' Étape 2 – Nombre d’ETP touchés'!W22","v":""},"",{"$error":"#DIV/0!"},{"$error":"#DIV/0!"},{"$f":"' Étape 2 – Nombre d’ETP touchés'!X22","v":""},{"$error":"#DIV/0!"}]
[19,{"$f":"' Étape 2 – Nombre d’ETP touchés'!B23","v":""},{"$f":"' Étape 2 – Nombre d’ETP touchés'!C23","v":0},{"$f":"' Étape 2 – Nombre d’ETP touchés'!D23","v":{"$error":"#DIV/0!"}},{"$f":"' Étape 2 – Nombre d’ETP touchés'!E23","v":""},{"$f":"' Étape 2 – Nombre d’ETP touchés'!F23","v":""},{"$f":"' Étape 2 – Nombre d’ETP touchés'!G23","v":""},{"$f":"' Étape 2 – Nombre d’ETP touchés'!H23","v":""},{"$f":"' Étape 2 – Nombre d’ETP touchés'!I23","v":""},{"$f":"' Étape 2 – Nombre d’ETP touchés'!J23","v":""},{"$f":"' Étape 2 – Nombre d’ETP touchés'!K23","v":""},{"$f":"' Étape 2 – Nombre d’ETP touchés'!L23","v":""},{"$f":"' Étape 2 – Nombre d’ETP touchés'!M23","v":""},{"$f":"' Étape 2 – Nombre d’ETP touchés'!N23","v":""},{"$f":"' Étape 2 – Nombre d’ETP touchés'!O23","v":""},{"$f":"' Étape 2 – Nombre d’ETP touchés'!P23","v":""},{"$f":"' Étape 2 – Nombre d’ETP touchés'!Q23","v":""},{"$f":"' Étape 2 – Nombre d’ETP touchés'!R23","v":""},{"$f":"' Étape 2 – Nombre d’ETP touchés'!S23","v":""},{"$f":"' Étape 2 – Nombre d’ETP touchés'!T23","v":""},{"$f":"' Étape 2 – Nombre d’ETP touchés'!U23","v":""},{"$f":"' Étape 2 – Nombre d’ETP touchés'!V23","v":""},{"$f":"' Étape 2 – Nombre d’ETP touchés'!W23","v":""},"",{"$error":"#DIV/0!"},{"$error":"#DIV/0!"},{"$f":"' Étape 2 – Nombre d’ETP touchés'!X23","v":""},{"$error":"#DIV/0!"}]
[20,{"$f":"' Étape 2 – Nombre d’ETP touchés'!B24","v":""},{"$f":"' Étape 2 – Nombre d’ETP touchés'!C24","v":0},{"$f":"' Étape 2 – Nombre d’ETP touchés'!D24","v":{"$error":"#DIV/0!"}},{"$f":"' Étape 2 – Nombre d’ETP touchés'!E24","v":""},{"$f":"' Étape 2 – Nombre d’ETP touchés'!F24","v":""},{"$f":"' Étape 2 – Nombre d’ETP touchés'!G24","v":""},{"$f":"' Étape 2 – Nombre d’ETP touchés'!H24","v":""},{"$f":"' Étape 2 – Nombre d’ETP touchés'!I24","v":""},{"$f":"' Étape 2 – Nombre d’ETP touchés'!J24","v":""},{"$f":"' Étape 2 – Nombre d’ETP touchés'!K24","v":""},{"$f":"' Étape 2 – Nombre d’ETP touchés'!L24","v":""},{"$f":"' Étape 2 – Nombre d’ETP touchés'!M24","v":""},{"$f":"' Étape 2 – Nombre d’ETP touchés'!N24","v":""},{"$f":"' Étape 2 – Nombre d’ETP touchés'!O24","v":""},{"$f":"' Étape 2 – Nombre d’ETP touchés'!P24","v":""},{"$f":"' Étape 2 – Nombre d’ETP touchés'!Q24","v":""},{"$f":"' Étape 2 – Nombre d’ETP touchés'!R24","v":""},{"$f":"' Étape 2 – Nombre d’ETP touchés'!S24","v":""},{"$f":"' Étape 2 – Nombre d’ETP touchés'!T24","v":""},{"$f":"' Étape 2 – Nombre d’ETP touchés'!U24","v":""},{"$f":"' Étape 2 – Nombre d’ETP touchés'!V24","v":""},{"$f":"' Étape 2 – Nombre d’ETP touchés'!W24","v":""},"",{"$error":"#DIV/0!"},{"$error":"#DIV/0!"},{"$f":"' Étape 2 – Nombre d’ETP touchés'!X24","v":""},{"$error":"#DIV/0!"}]
[21,{"$f":"' Étape 2 – Nombre d’ETP touchés'!B25","v":""},{"$f":"' Étape 2 – Nombre d’ETP touchés'!C25","v":0},{"$f":"' Étape 2 – Nombre d’ETP touchés'!D25","v":{"$error":"#DIV/0!"}},{"$f":"' Étape 2 – Nombre d’ETP touchés'!E25","v":""},{"$f":"' Étape 2 – Nombre d’ETP touchés'!F25","v":""},{"$f":"' Étape 2 – Nombre d’ETP touchés'!G25","v":""},{"$f":"' Étape 2 – Nombre d’ETP touchés'!H25","v":""},{"$f":"' Étape 2 – Nombre d’ETP touchés'!I25","v":""},{"$f":"' Étape 2 – Nombre d’ETP touchés'!J25","v":""},{"$f":"' Étape 2 – Nombre d’ETP touchés'!K25","v":""},{"$f":"' Étape 2 – Nombre d’ETP touchés'!L25","v":""},{"$f":"' Étape 2 – Nombre d’ETP touchés'!M25","v":""},{"$f":"' Étape 2 – Nombre d’ETP touchés'!N25","v":""},{"$f":"' Étape 2 – Nombre d’ETP touchés'!O25","v":""},{"$f":"' Étape 2 – Nombre d’ETP touchés'!P25","v":""},{"$f":"' Étape 2 – Nombre d’ETP touchés'!Q25","v":""},{"$f":"' Étape 2 – Nombre d’ETP touchés'!R25","v":""},{"$f":"' Étape 2 – Nombre d’ETP touchés'!S25","v":""},{"$f":"' Étape 2 – Nombre d’ETP touchés'!T25","v":""},{"$f":"' Étape 2 – Nombre d’ETP touchés'!U25","v":""},{"$f":"' Étape 2 – Nombre d’ETP touchés'!V25","v":""},{"$f":"' Étape 2 – Nombre d’ETP touchés'!W25","v":""},"",{"$error":"#DIV/0!"},{"$error":"#DIV/0!"},{"$f":"' Étape 2 – Nombre d’ETP touchés'!X25","v":""},{"$error":"#DIV/0!"}]
[22,{"$f":"' Étape 2 – Nombre d’ETP touchés'!B26","v":""},{"$f":"' Étape 2 – Nombre d’ETP touchés'!C26","v":0},{"$f":"' Étape 2 – Nombre d’ETP touchés'!D26","v":{"$error":"#DIV/0!"}},{"$f":"' Étape 2 – Nombre d’ETP touchés'!E26","v":""},{"$f":"' Étape 2 – Nombre d’ETP touchés'!F26","v":""},{"$f":"' Étape 2 – Nombre d’ETP touchés'!G26","v":""},{"$f":"' Étape 2 – Nombre d’ETP touchés'!H26","v":""},{"$f":"' Étape 2 – Nombre d’ETP touchés'!I26","v":""},{"$f":"' Étape 2 – Nombre d’ETP touchés'!J26","v":""},{"$f":"' Étape 2 – Nombre d’ETP touchés'!K26","v":""},{"$f":"' Étape 2 – Nombre d’ETP touchés'!L26","v":""},{"$f":"' Étape 2 – Nombre d’ETP touchés'!M26","v":""},{"$f":"' Étape 2 – Nombre d’ETP touchés'!N26","v":""},{"$f":"' Étape 2 – Nombre d’ETP touchés'!O26","v":""},{"$f":"' Étape 2 – Nombre d’ETP touchés'!P26","v":""},{"$f":"' Étape 2 – Nombre d’ETP touchés'!Q26","v":""},{"$f":"' Étape 2 – Nombre d’ETP touchés'!R26","v":""},{"$f":"' Étape 2 – Nombre d’ETP touchés'!S26","v":""},{"$f":"' Étape 2 – Nombre d’ETP touchés'!T26","v":""},{"$f":"' Étape 2 – Nombre d’ETP touchés'!U26","v":""},{"$f":"' Étape 2 – Nombre d’ETP touchés'!V26","v":""},{"$f":"' Étape 2 – Nombre d’ETP touchés'!W26","v":""},"",{"$error":"#DIV/0!"},{"$error":"#DIV/0!"},{"$f":"' Étape 2 – Nombre d’ETP touchés'!X26","v":""},{"$error":"#DIV/0!"}]
[23,{"$f":"' Étape 2 – Nombre d’ETP touchés'!B27","v":""},{"$f":"' Étape 2 – Nombre d’ETP touchés'!C27","v":0},{"$f":"' Étape 2 – Nombre d’ETP touchés'!D27","v":{"$error":"#DIV/0!"}},{"$f":"' Étape 2 – Nombre d’ETP touchés'!E27","v":""},{"$f":"' Étape 2 – Nombre d’ETP touchés'!F27","v":""},{"$f":"' Étape 2 – Nombre d’ETP touchés'!G27","v":""},{"$f":"' Étape 2 – Nombre d’ETP touchés'!H27","v":""},{"$f":"' Étape 2 – Nombre d’ETP touchés'!I27","v":""},{"$f":"' Étape 2 – Nombre d’ETP touchés'!J27","v":""},{"$f":"' Étape 2 – Nombre d’ETP touchés'!K27","v":""},{"$f":"' Étape 2 – Nombre d’ETP touchés'!L27","v":""},{"$f":"' Étape 2 – Nombre d’ETP touchés'!M27","v":""},{"$f":"' Étape 2 – Nombre d’ETP touchés'!N27","v":""},{"$f":"' Étape 2 – Nombre d’ETP touchés'!O27","v":""},{"$f":"' Étape 2 – Nombre d’ETP touchés'!P27","v":""},{"$f":"' Étape 2 – Nombre d’ETP touchés'!Q27","v":""},{"$f":"' Étape 2 – Nombre d’ETP touchés'!R27","v":""},{"$f":"' Étape 2 – Nombre d’ETP touchés'!S27","v":""},{"$f":"' Étape 2 – Nombre d’ETP touchés'!T27","v":""},{"$f":"' Étape 2 – Nombre d’ETP touchés'!U27","v":""},{"$f":"' Étape 2 – Nombre d’ETP touchés'!V27","v":""},{"$f":"' Étape 2 – Nombre d’ETP touchés'!W27","v":""},"",{"$error":"#DIV/0!"},{"$error":"#DIV/0!"},{"$f":"' Étape 2 – Nombre d’ETP touchés'!X27","v":""},{"$error":"#DIV/0!"}]
[24,{"$f":"' Étape 2 – Nombre d’ETP touchés'!B28","v":""},{"$f":"' Étape 2 – Nombre d’ETP touchés'!C28","v":0},{"$f":"' Étape 2 – Nombre d’ETP touchés'!D28","v":{"$error":"#DIV/0!"}},{"$f":"' Étape 2 – Nombre d’ETP touchés'!E28","v":""},{"$f":"' Étape 2 – Nombre d’ETP touchés'!F28","v":""},{"$f":"' Étape 2 – Nombre d’ETP touchés'!G28","v":""},{"$f":"' Étape 2 – Nombre d’ETP touchés'!H28","v":""},{"$f":"' Étape 2 – Nombre d’ETP touchés'!I28","v":""},{"$f":"' Étape 2 – Nombre d’ETP touchés'!J28","v":""},{"$f":"' Étape 2 – Nombre d’ETP touchés'!K28","v":""},{"$f":"' Étape 2 – Nombre d’ETP touchés'!L28","v":""},{"$f":"' Étape 2 – Nombre d’ETP touchés'!M28","v":""},{"$f":"' Étape 2 – Nombre d’ETP touchés'!N28","v":""},{"$f":"' Étape 2 – Nombre d’ETP touchés'!O28","v":""},{"$f":"' Étape 2 – Nombre d’ETP touchés'!P28","v":""},{"$f":"' Étape 2 – Nombre d’ETP touchés'!Q28","v":""},{"$f":"' Étape 2 – Nombre d’ETP touchés'!R28","v":""},{"$f":"' Étape 2 – Nombre d’ETP touchés'!S28","v":""},{"$f":"' Étape 2 – Nombre d’ETP touchés'!T28","v":""},{"$f":"' Étape 2 – Nombre d’ETP touchés'!U28","v":""},{"$f":"' Étape 2 – Nombre d’ETP touchés'!V28","v":""},{"$f":"' Étape 2 – Nombre d’ETP touchés'!W28","v":""},"",{"$error":"#DIV/0!"},{"$error":"#DIV/0!"},{"$f":"' Étape 2 – Nombre d’ETP touchés'!X28","v":""},{"$error":"#DIV/0!"}]
[25,{"$f":"' Étape 2 – Nombre d’ETP touchés'!B29","v":""},{"$f":"' Étape 2 – Nombre d’ETP touchés'!C29","v":0},{"$f":"' Étape 2 – Nombre d’ETP touchés'!D29","v":{"$error":"#DIV/0!"}},{"$f":"' Étape 2 – Nombre d’ETP touchés'!E29","v":""},{"$f":"' Étape 2 – Nombre d’ETP touchés'!F29","v":""},{"$f":"' Étape 2 – Nombre d’ETP touchés'!G29","v":""},{"$f":"' Étape 2 – Nombre d’ETP touchés'!H29","v":""},{"$f":"' Étape 2 – Nombre d’ETP touchés'!I29","v":""},{"$f":"' Étape 2 – Nombre d’ETP touchés'!J29","v":""},{"$f":"' Étape 2 – Nombre d’ETP touchés'!K29","v":""},{"$f":"' Étape 2 – Nombre d’ETP touchés'!L29","v":""},{"$f":"' Étape 2 – Nombre d’ETP touchés'!M29","v":""},{"$f":"' Étape 2 – Nombre d’ETP touchés'!N29","v":""},{"$f":"' Étape 2 – Nombre d’ETP touchés'!O29","v":""},{"$f":"' Étape 2 – Nombre d’ETP touchés'!P29","v":""},{"$f":"' Étape 2 – Nombre d’ETP touchés'!Q29","v":""},{"$f":"' Étape 2 – Nombre d’ETP touchés'!R29","v":""},{"$f":"' Étape 2 – Nombre d’ETP touchés'!S29","v":""},{"$f":"' Étape 2 – Nombre d’ETP touchés'!T29","v":""},{"$f":"' Étape 2 – Nombre d’ETP touchés'!U29","v":""},{"$f":"' Étape 2 – Nombre d’ETP touchés'!V29","v":""},{"$f":"' Étape 2 – Nombre d’ETP touchés'!W29","v":""},"",{"$error":"#DIV/0!"},{"$error":"#DIV/0!"},{"$f":"' Étape 2 – Nombre d’ETP touchés'!X29","v":""},{"$error":"#DIV/0!"}]
[26,{"$f":"' Étape 2 – Nombre d’ETP touchés'!B30","v":""},{"$f":"' Étape 2 – Nombre d’ETP touchés'!C30","v":0},{"$f":"' Étape 2 – Nombre d’ETP touchés'!D30","v":{"$error":"#DIV/0!"}},{"$f":"' Étape 2 – Nombre d’ETP touchés'!E30","v":""},{"$f":"' Étape 2 – Nombre d’ETP touchés'!F30","v":""},{"$f":"' Étape 2 – Nombre d’ETP touchés'!G30","v":""},{"$f":"' Étape 2 – Nombre d’ETP touchés'!H30","v":""},{"$f":"' Étape 2 – Nombre d’ETP touchés'!I30","v":""},{"$f":"' Étape 2 – Nombre d’ETP touchés'!J30","v":""},{"$f":"' Étape 2 – Nombre d’ETP touchés'!K30","v":""},{"$f":"' Étape 2 – Nombre d’ETP touchés'!L30","v":""},{"$f":"' Étape 2 – Nombre d’ETP touchés'!M30","v":""},{"$f":"' Étape 2 – Nombre d’ETP touchés'!N30","v":""},{"$f":"' Étape 2 – Nombre d’ETP touchés'!O30","v":""},{"$f":"' Étape 2 – Nombre d’ETP touchés'!P30","v":""},{"$f":"' Étape 2 – Nombre d’ETP touchés'!Q30","v":""},{"$f":"' Étape 2 – Nombre d’ETP touchés'!R30","v":""},{"$f":"' Étape 2 – Nombre d’ETP touchés'!S30","v":""},{"$f":"' Étape 2 – Nombre d’ETP touchés'!T30","v":""},{"$f":"' Étape 2 – Nombre d’ETP touchés'!U30","v":""},{"$f":"' Étape 2 – Nombre d’ETP touchés'!V30","v":""},{"$f":"' Étape 2 – Nombre d’ETP touchés'!W30","v":""},"",{"$error":"#DIV/0!"},{"$error":"#DIV/0!"},{"$f":"' Étape 2 – Nombre d’ETP touchés'!X30","v":""},{"$error":"#DIV/0!"}]
[27,{"$f":"' Étape 2 – Nombre d’ETP touchés'!B31","v":""},{"$f":"' Étape 2 – Nombre d’ETP touchés'!C31","v":0},{"$f":"' Étape 2 – Nombre d’ETP touchés'!D31","v":{"$error":"#DIV/0!"}},{"$f":"' Étape 2 – Nombre d’ETP touchés'!E31","v":""},{"$f":"' Étape 2 – Nombre d’ETP touchés'!F31","v":""},{"$f":"' Étape 2 – Nombre d’ETP touchés'!G31","v":""},{"$f":"' Étape 2 – Nombre d’ETP touchés'!H31","v":""},{"$f":"' Étape 2 – Nombre d’ETP touchés'!I31","v":""},{"$f":"' Étape 2 – Nombre d’ETP touchés'!J31","v":""},{"$f":"' Étape 2 – Nombre d’ETP touchés'!K31","v":""},{"$f":"' Étape 2 – Nombre d’ETP touchés'!L31","v":""},{"$f":"' Étape 2 – Nombre d’ETP touchés'!M31","v":""},{"$f":"' Étape 2 – Nombre d’ETP touchés'!N31","v":""},{"$f":"' Étape 2 – Nombre d’ETP touchés'!O31","v":""},{"$f":"' Étape 2 – Nombre d’ETP touchés'!P31","v":""},{"$f":"' Étape 2 – Nombre d’ETP touchés'!Q31","v":""},{"$f":"' Étape 2 – Nombre d’ETP touchés'!R31","v":""},{"$f":"' Étape 2 – Nombre d’ETP touchés'!S31","v":""},{"$f":"' Étape 2 – Nombre d’ETP touchés'!T31","v":""},{"$f":"' Étape 2 – Nombre d’ETP touchés'!U31","v":""},{"$f":"' Étape 2 – Nombre d’ETP touchés'!V31","v":""},{"$f":"' Étape 2 – Nombre d’ETP touchés'!W31","v":""},"",{"$error":"#DIV/0!"},{"$error":"#DIV/0!"},{"$f":"' Étape 2 – Nombre d’ETP touchés'!X31","v":""},{"$error":"#DIV/0!"}]
[28,{"$f":"' Étape 2 – Nombre d’ETP touchés'!B32","v":""},{"$f":"' Étape 2 – Nombre d’ETP touchés'!C32","v":0},{"$f":"' Étape 2 – Nombre d’ETP touchés'!D32","v":{"$error":"#DIV/0!"}},{"$f":"' Étape 2 – Nombre d’ETP touchés'!E32","v":""},{"$f":"' Étape 2 – Nombre d’ETP touchés'!F32","v":""},{"$f":"' Étape 2 – Nombre d’ETP touchés'!G32","v":""},{"$f":"' Étape 2 – Nombre d’ETP touchés'!H32","v":""},{"$f":"' Étape 2 – Nombre d’ETP touchés'!I32","v":""},{"$f":"' Étape 2 – Nombre d’ETP touchés'!J32","v":""},{"$f":"' Étape 2 – Nombre d’ETP touchés'!K32","v":""},{"$f":"' Étape 2 – Nombre d’ETP touchés'!L32","v":""},{"$f":"' Étape 2 – Nombre d’ETP touchés'!M32","v":""},{"$f":"' Étape 2 – Nombre d’ETP touchés'!N32","v":""},{"$f":"' Étape 2 – Nombre d’ETP touchés'!O32","v":""},{"$f":"' Étape 2 – Nombre d’ETP touchés'!P32","v":""},{"$f":"' Étape 2 – Nombre d’ETP touchés'!Q32","v":""},{"$f":"' Étape 2 – Nombre d’ETP touchés'!R32","v":""},{"$f":"' Étape 2 – Nombre d’ETP touchés'!S32","v":""},{"$f":"' Étape 2 – Nombre d’ETP touchés'!T32","v":""},{"$f":"' Étape 2 – Nombre d’ETP touchés'!U32","v":""},{"$f":"' Étape 2 – Nombre d’ETP touchés'!V32","v":""},{"$f":"' Étape 2 – Nombre d’ETP touchés'!W32","v":""},"",{"$error":"#DIV/0!"},{"$error":"#DIV/0!"},{"$f":"' Étape 2 – Nombre d’ETP touchés'!X32","v":""},{"$error":"#DIV/0!"}]
[29,{"$f":"' Étape 2 – Nombre d’ETP touchés'!B33","v":""},{"$f":"' Étape 2 – Nombre d’ETP touchés'!C33","v":0},{"$f":"' Étape 2 – Nombre d’ETP touchés'!D33","v":{"$error":"#DIV/0!"}},{"$f":"' Étape 2 – Nombre d’ETP touchés'!E33","v":""},{"$f":"' Étape 2 – Nombre d’ETP touchés'!F33","v":""},{"$f":"' Étape 2 – Nombre d’ETP touchés'!G33","v":""},{"$f":"' Étape 2 – Nombre d’ETP touchés'!H33","v":""},{"$f":"' Étape 2 – Nombre d’ETP touchés'!I33","v":""},{"$f":"' Étape 2 – Nombre d’ETP touchés'!J33","v":""},{"$f":"' Étape 2 – Nombre d’ETP touchés'!K33","v":""},{"$f":"' Étape 2 – Nombre d’ETP touchés'!L33","v":""},{"$f":"' Étape 2 – Nombre d’ETP touchés'!M33","v":""},{"$f":"' Étape 2 – Nombre d’ETP touchés'!N33","v":""},{"$f":"' Étape 2 – Nombre d’ETP touchés'!O33","v":""},{"$f":"' Étape 2 – Nombre d’ETP touchés'!P33","v":""},{"$f":"' Étape 2 – Nombre d’ETP touchés'!Q33","v":""},{"$f":"' Étape 2 – Nombre d’ETP touchés'!R33","v":""},{"$f":"' Étape 2 – Nombre d’ETP touchés'!S33","v":""},{"$f":"' Étape 2 – Nombre d’ETP touchés'!T33","v":""},{"$f":"' Étape 2 – Nombre d’ETP touchés'!U33","v":""},{"$f":"' Étape 2 – Nombre d’ETP touchés'!V33","v":""},{"$f":"' Étape 2 – Nombre d’ETP touchés'!W33","v":""},"",{"$error":"#DIV/0!"},{"$error":"#DIV/0!"},{"$f":"' Étape 2 – Nombre d’ETP touchés'!X33","v":""},{"$error":"#DIV/0!"}]
[30,{"$f":"' Étape 2 – Nombre d’ETP touchés'!B34","v":""},{"$f":"' Étape 2 – Nombre d’ETP touchés'!C34","v":0},{"$f":"' Étape 2 – Nombre d’ETP touchés'!D34","v":{"$error":"#DIV/0!"}},{"$f":"' Étape 2 – Nombre d’ETP touchés'!E34","v":""},{"$f":"' Étape 2 – Nombre d’ETP touchés'!F34","v":""},{"$f":"' Étape 2 – Nombre d’ETP touchés'!G34","v":""},{"$f":"' Étape 2 – Nombre d’ETP touchés'!H34","v":""},{"$f":"' Étape 2 – Nombre d’ETP touchés'!I34","v":""},{"$f":"' Étape 2 – Nombre d’ETP touchés'!J34","v":""},{"$f":"' Étape 2 – Nombre d’ETP touchés'!K34","v":""},{"$f":"' Étape 2 – Nombre d’ETP touchés'!L34","v":""},{"$f":"' Étape 2 – Nombre d’ETP touchés'!M34","v":""},{"$f":"' Étape 2 – Nombre d’ETP touchés'!N34","v":""},{"$f":"' Étape 2 – Nombre d’ETP touchés'!O34","v":""},{"$f":"' Étape 2 – Nombre d’ETP touchés'!P34","v":""},{"$f":"' Étape 2 – Nombre d’ETP touchés'!Q34","v":""},{"$f":"' Étape 2 – Nombre d’ETP touchés'!R34","v":""},{"$f":"' Étape 2 – Nombre d’ETP touchés'!S34","v":""},{"$f":"' Étape 2 – Nombre d’ETP touchés'!T34","v":""},{"$f":"' Étape 2 – Nombre d’ETP touchés'!U34","v":""},{"$f":"' Étape 2 – Nombre d’ETP touchés'!V34","v":""},{"$f":"' Étape 2 – Nombre d’ETP touchés'!W34","v":""},"",{"$error":"#DIV/0!"},{"$error":"#DIV/0!"},{"$f":"' Étape 2 – Nombre d’ETP touchés'!X34","v":""},{"$error":"#DIV/0!"}]
[31,{"$f":"' Étape 2 – Nombre d’ETP touchés'!B35","v":""},{"$f":"' Étape 2 – Nombre d’ETP touchés'!C35","v":0},{"$f":"' Étape 2 – Nombre d’ETP touchés'!D35","v":{"$error":"#DIV/0!"}},{"$f":"' Étape 2 – Nombre d’ETP touchés'!E35","v":""},{"$f":"' Étape 2 – Nombre d’ETP touchés'!F35","v":""},{"$f":"' Étape 2 – Nombre d’ETP touchés'!G35","v":""},{"$f":"' Étape 2 – Nombre d’ETP touchés'!H35","v":""},{"$f":"' Étape 2 – Nombre d’ETP touchés'!I35","v":""},{"$f":"' Étape 2 – Nombre d’ETP touchés'!J35","v":""},{"$f":"' Étape 2 – Nombre d’ETP touchés'!K35","v":""},{"$f":"' Étape 2 – Nombre d’ETP touchés'!L35","v":""},{"$f":"' Étape 2 – Nombre d’ETP touchés'!M35","v":""},{"$f":"' Étape 2 – Nombre d’ETP touchés'!N35","v":""},{"$f":"' Étape 2 – Nombre d’ETP touchés'!O35","v":""},{"$f":"' Étape 2 – Nombre d’ETP touchés'!P35","v":""},{"$f":"' Étape 2 – Nombre d’ETP touchés'!Q35","v":""},{"$f":"' Étape 2 – Nombre d’ETP touchés'!R35","v":""},{"$f":"' Étape 2 – Nombre d’ETP touchés'!S35","v":""},{"$f":"' Étape 2 – Nombre d’ETP touchés'!T35","v":""},{"$f":"' Étape 2 – Nombre d’ETP touchés'!U35","v":""},{"$f":"' Étape 2 – Nombre d’ETP touchés'!V35","v":""},{"$f":"' Étape 2 – Nombre d’ETP touchés'!W35","v":""},"",{"$error":"#DIV/0!"},{"$error":"#DIV/0!"},{"$f":"' Étape 2 – Nombre d’ETP touchés'!X35","v":""},{"$error":"#DIV/0!"}]
[32,{"$f":"' Étape 2 – Nombre d’ETP touchés'!B36","v":""},{"$f":"' Étape 2 – Nombre d’ETP touchés'!C36","v":0},{"$f":"' Étape 2 – Nombre d’ETP touchés'!D36","v":{"$error":"#DIV/0!"}},{"$f":"' Étape 2 – Nombre d’ETP touchés'!E36","v":""},{"$f":"' Étape 2 – Nombre d’ETP touchés'!F36","v":""},{"$f":"' Étape 2 – Nombre d’ETP touchés'!G36","v":""},{"$f":"' Étape 2 – Nombre d’ETP touchés'!H36","v":""},{"$f":"' Étape 2 – Nombre d’ETP touchés'!I36","v":""},{"$f":"' Étape 2 – Nombre d’ETP touchés'!J36","v":""},{"$f":"' Étape 2 – Nombre d’ETP touchés'!K36","v":""},{"$f":"' Étape 2 – Nombre d’ETP touchés'!L36","v":""},{"$f":"' Étape 2 – Nombre d’ETP touchés'!M36","v":""},{"$f":"' Étape 2 – Nombre d’ETP touchés'!N36","v":""},{"$f":"' Étape 2 – Nombre d’ETP touchés'!O36","v":""},{"$f":"' Étape 2 – Nombre d’ETP touchés'!P36","v":""},{"$f":"' Étape 2 – Nombre d’ETP touchés'!Q36","v":""},{"$f":"' Étape 2 – Nombre d’ETP touchés'!R36","v":""},{"$f":"' Étape 2 – Nombre d’ETP touchés'!S36","v":""},{"$f":"' Étape 2 – Nombre d’ETP touchés'!T36","v":""},{"$f":"' Étape 2 – Nombre d’ETP touchés'!U36","v":""},{"$f":"' Étape 2 – Nombre d’ETP touchés'!V36","v":""},{"$f":"' Étape 2 – Nombre d’ETP touchés'!W36","v":""},"",{"$error":"#DIV/0!"},{"$error":"#DIV/0!"},{"$f":"' Étape 2 – Nombre d’ETP touchés'!X36","v":""},{"$error":"#DIV/0!"}]
[33,{"$f":"' Étape 2 – Nombre d’ETP touchés'!B37","v":""},{"$f":"' Étape 2 – Nombre d’ETP touchés'!C37","v":0},{"$f":"' Étape 2 – Nombre d’ETP touchés'!D37","v":{"$error":"#DIV/0!"}},{"$f":"' Étape 2 – Nombre d’ETP touchés'!E37","v":""},{"$f":"' Étape 2 – Nombre d’ETP touchés'!F37","v":""},{"$f":"' Étape 2 – Nombre d’ETP touchés'!G37","v":""},{"$f":"' Étape 2 – Nombre d’ETP touchés'!H37","v":""},{"$f":"' Étape 2 – Nombre d’ETP touchés'!I37","v":""},{"$f":"' Étape 2 – Nombre d’ETP touchés'!J37","v":""},{"$f":"' Étape 2 – Nombre d’ETP touchés'!K37","v":""},{"$f":"' Étape 2 – Nombre d’ETP touchés'!L37","v":""},{"$f":"' Étape 2 – Nombre d’ETP touchés'!M37","v":""},{"$f":"' Étape 2 – Nombre d’ETP touchés'!N37","v":""},{"$f":"' Étape 2 – Nombre d’ETP touchés'!O37","v":""},{"$f":"' Étape 2 – Nombre d’ETP touchés'!P37","v":""},{"$f":"' Étape 2 – Nombre d’ETP touchés'!Q37","v":""},{"$f":"' Étape 2 – Nombre d’ETP touchés'!R37","v":""},{"$f":"' Étape 2 – Nombre d’ETP touchés'!S37","v":""},{"$f":"' Étape 2 – Nombre d’ETP touchés'!T37","v":""},{"$f":"' Étape 2 – Nombre d’ETP touchés'!U37","v":""},{"$f":"' Étape 2 – Nombre d’ETP touchés'!V37","v":""},{"$f":"' Étape 2 – Nombre d’ETP touchés'!W37","v":""},"",{"$error":"#DIV/0!"},{"$error":"#DIV/0!"},{"$f":"' Étape 2 – Nombre d’ETP touchés'!X37","v":""},{"$f":"IF(AND(AA37=\"LOW\",D37<50),\"LOW\",\nIF(AND(AA37=\"LOW\",D37>=50),\"MED\",\nIF(AND(AA37=\"MED\",D37<50),\"MED\",\nIF(AND(AA37=\"MED\",D37>=50),\"HIGH\",\nIF(AND(AA37=\"HIGH\",D37<50),\"MED\",\nIF(AND(AA37=\"HIGH\",D37>=50),\"HIGH\",\nIF(AA37=\"Minimal Change for Employee\",\"N/A\",\n\"ERROR\")))))))","v":{"$error":"#DIV/0!"}}]
[34,{"$f":"' Étape 2 – Nombre d’ETP touchés'!B38","v":""},{"$f":"' Étape 2 – Nombre d’ETP touchés'!C38","v":0},{"$f":"' Étape 2 – Nombre d’ETP touchés'!D38","v":{"$error":"#DIV/0!"}},{"$f":"' Étape 2 – Nombre d’ETP touchés'!E38","v":""},{"$f":"' Étape 2 – Nombre d’ETP touchés'!F38","v":""},{"$f":"' Étape 2 – Nombre d’ETP touchés'!G38","v":""},{"$f":"' Étape 2 – Nombre d’ETP touchés'!H38","v":""},{"$f":"' Étape 2 – Nombre d’ETP touchés'!I38","v":""},{"$f":"' Étape 2 – Nombre d’ETP touchés'!J38","v":""},{"$f":"' Étape 2 – Nombre d’ETP touchés'!K38","v":""},{"$f":"' Étape 2 – Nombre d’ETP touchés'!L38","v":""},{"$f":"' Étape 2 – Nombre d’ETP touchés'!M38","v":""},{"$f":"' Étape 2 – Nombre d’ETP touchés'!N38","v":""},{"$f":"' Étape 2 – Nombre d’ETP touchés'!O38","v":""},{"$f":"' Étape 2 – Nombre d’ETP touchés'!P38","v":""},{"$f":"' Étape 2 – Nombre d’ETP touchés'!Q38","v":""},{"$f":"' Étape 2 – Nombre d’ETP touchés'!R38","v":""},{"$f":"' Étape 2 – Nombre d’ETP touchés'!S38","v":""},{"$f":"' Étape 2 – Nombre d’ETP touchés'!T38","v":""},{"$f":"' Étape 2 – Nombre d’ETP touchés'!U38","v":""},{"$f":"' Étape 2 – Nombre d’ETP touchés'!V38","v":""},{"$f":"' Étape 2 – Nombre d’ETP touchés'!W38","v":""},"",{"$error":"#DIV/0!"},{"$error":"#DIV/0!"},{"$f":"' Étape 2 – Nombre d’ETP touchés'!X38","v":""},{"$error":"#DIV/0!"}]
[35,{"$f":"' Étape 2 – Nombre d’ETP touchés'!B39","v":""},{"$f":"' Étape 2 – Nombre d’ETP touchés'!C39","v":0},{"$f":"' Étape 2 – Nombre d’ETP touchés'!D39","v":{"$error":"#DIV/0!"}},{"$f":"' Étape 2 – Nombre d’ETP touchés'!E39","v":""},{"$f":"' Étape 2 – Nombre d’ETP touchés'!F39","v":""},{"$f":"' Étape 2 – Nombre d’ETP touchés'!G39","v":""},{"$f":"' Étape 2 – Nombre d’ETP touchés'!H39","v":""},{"$f":"' Étape 2 – Nombre d’ETP touchés'!I39","v":""},{"$f":"' Étape 2 – Nombre d’ETP touchés'!J39","v":""},{"$f":"' Étape 2 – Nombre d’ETP touchés'!K39","v":""},{"$f":"' Étape 2 – Nombre d’ETP touchés'!L39","v":""},{"$f":"' Étape 2 – Nombre d’ETP touchés'!M39","v":""},{"$f":"' Étape 2 – Nombre d’ETP touchés'!N39","v":""},{"$f":"' Étape 2 – Nombre d’ETP touchés'!O39","v":""},{"$f":"' Étape 2 – Nombre d’ETP touchés'!P39","v":""},{"$f":"' Étape 2 – Nombre d’ETP touchés'!Q39","v":""},{"$f":"' Étape 2 – Nombre d’ETP touchés'!R39","v":""},{"$f":"' Étape 2 – Nombre d’ETP touchés'!S39","v":""},{"$f":"' Étape 2 – Nombre d’ETP touchés'!T39","v":""},{"$f":"' Étape 2 – Nombre d’ETP touchés'!U39","v":""},{"$f":"' Étape 2 – Nombre d’ETP touchés'!V39","v":""},{"$f":"' Étape 2 – Nombre d’ETP touchés'!W39","v":""},"",{"$error":"#DIV/0!"},{"$error":"#DIV/0!"},{"$f":"' Étape 2 – Nombre d’ETP touchés'!X39","v":""},{"$error":"#DIV/0!"}]
[36,{"$f":"' Étape 2 – Nombre d’ETP touchés'!B40","v":""},{"$f":"' Étape 2 – Nombre d’ETP touchés'!C40","v":0},{"$f":"' Étape 2 – Nombre d’ETP touchés'!D40","v":{"$error":"#DIV/0!"}},{"$f":"' Étape 2 – Nombre d’ETP touchés'!E40","v":""},{"$f":"' Étape 2 – Nombre d’ETP touchés'!F40","v":""},{"$f":"' Étape 2 – Nombre d’ETP touchés'!G40","v":""},{"$f":"' Étape 2 – Nombre d’ETP touchés'!H40","v":""},{"$f":"' Étape 2 – Nombre d’ETP touchés'!I40","v":""},{"$f":"' Étape 2 – Nombre d’ETP touchés'!J40","v":""},{"$f":"' Étape 2 – Nombre d’ETP touchés'!K40","v":""},{"$f":"' Étape 2 – Nombre d’ETP touchés'!L40","v":""},{"$f":"' Étape 2 – Nombre d’ETP touchés'!M40","v":""},{"$f":"' Étape 2 – Nombre d’ETP touchés'!N40","v":""},{"$f":"' Étape 2 – Nombre d’ETP touchés'!O40","v":""},{"$f":"' Étape 2 – Nombre d’ETP touchés'!P40","v":""},{"$f":"' Étape 2 – Nombre d’ETP touchés'!Q40","v":""},{"$f":"' Étape 2 – Nombre d’ETP touchés'!R40","v":""},{"$f":"' Étape 2 – Nombre d’ETP touchés'!S40","v":""},{"$f":"' Étape 2 – Nombre d’ETP touchés'!T40","v":""},{"$f":"' Étape 2 – Nombre d’ETP touchés'!U40","v":""},{"$f":"' Étape 2 – Nombre d’ETP touchés'!V40","v":""},{"$f":"' Étape 2 – Nombre d’ETP touchés'!W40","v":""},"",{"$error":"#DIV/0!"},{"$error":"#DIV/0!"},{"$f":"' Étape 2 – Nombre d’ETP touchés'!X40","v":""},{"$error":"#DIV/0!"}]
[37,{"$f":"' Étape 2 – Nombre d’ETP touchés'!B41","v":""},{"$f":"' Étape 2 – Nombre d’ETP touchés'!C41","v":0},{"$f":"' Étape 2 – Nombre d’ETP touchés'!D41","v":{"$error":"#DIV/0!"}},{"$f":"' Étape 2 – Nombre d’ETP touchés'!E41","v":""},{"$f":"' Étape 2 – Nombre d’ETP touchés'!F41","v":""},{"$f":"' Étape 2 – Nombre d’ETP touchés'!G41","v":""},{"$f":"' Étape 2 – Nombre d’ETP touchés'!H41","v":""},{"$f":"' Étape 2 – Nombre d’ETP touchés'!I41","v":""},{"$f":"' Étape 2 – Nombre d’ETP touchés'!J41","v":""},{"$f":"' Étape 2 – Nombre d’ETP touchés'!K41","v":""},{"$f":"' Étape 2 – Nombre d’ETP touchés'!L41","v":""},{"$f":"' Étape 2 – Nombre d’ETP touchés'!M41","v":""},{"$f":"' Étape 2 – Nombre d’ETP touchés'!N41","v":""},{"$f":"' Étape 2 – Nombre d’ETP touchés'!O41","v":""},{"$f":"' Étape 2 – Nombre d’ETP touchés'!P41","v":""},{"$f":"' Étape 2 – Nombre d’ETP touchés'!Q41","v":""},{"$f":"' Étape 2 – Nombre d’ETP touchés'!R41","v":""},{"$f":"' Étape 2 – Nombre d’ETP touchés'!S41","v":""},{"$f":"' Étape 2 – Nombre d’ETP touchés'!T41","v":""},{"$f":"' Étape 2 – Nombre d’ETP touchés'!U41","v":""},{"$f":"' Étape 2 – Nombre d’ETP touchés'!V41","v":""},{"$f":"' Étape 2 – Nombre d’ETP touchés'!W41","v":""},"",{"$error":"#DIV/0!"},{"$error":"#DIV/0!"},{"$f":"' Étape 2 – Nombre d’ETP touchés'!X41","v":""},{"$error":"#DIV/0!"}]
[38,{"$f":"' Étape 2 – Nombre d’ETP touchés'!B42","v":""},{"$f":"' Étape 2 – Nombre d’ETP touchés'!C42","v":0},{"$f":"' Étape 2 – Nombre d’ETP touchés'!D42","v":{"$error":"#DIV/0!"}},{"$f":"' Étape 2 – Nombre d’ETP touchés'!E42","v":""},{"$f":"' Étape 2 – Nombre d’ETP touchés'!F42","v":""},{"$f":"' Étape 2 – Nombre d’ETP touchés'!G42","v":""},{"$f":"' Étape 2 – Nombre d’ETP touchés'!H42","v":""},{"$f":"' Étape 2 – Nombre d’ETP touchés'!I42","v":""},{"$f":"' Étape 2 – Nombre d’ETP touchés'!J42","v":""},{"$f":"' Étape 2 – Nombre d’ETP touchés'!K42","v":""},{"$f":"' Étape 2 – Nombre d’ETP touchés'!L42","v":""},{"$f":"' Étape 2 – Nombre d’ETP touchés'!M42","v":""},{"$f":"' Étape 2 – Nombre d’ETP touchés'!N42","v":""},{"$f":"' Étape 2 – Nombre d’ETP touchés'!O42","v":""},{"$f":"' Étape 2 – Nombre d’ETP touchés'!P42","v":""},{"$f":"' Étape 2 – Nombre d’ETP touchés'!Q42","v":""},{"$f":"' Étape 2 – Nombre d’ETP touchés'!R42","v":""},{"$f":"' Étape 2 – Nombre d’ETP touchés'!S42","v":""},{"$f":"' Étape 2 – Nombre d’ETP touchés'!T42","v":""},{"$f":"' Étape 2 – Nombre d’ETP touchés'!U42","v":""},{"$f":"' Étape 2 – Nombre d’ETP touchés'!V42","v":""},{"$f":"' Étape 2 – Nombre d’ETP touchés'!W42","v":""},"",{"$error":"#DIV/0!"},{"$error":"#DIV/0!"},{"$f":"' Étape 2 – Nombre d’ETP touchés'!X42","v":""},{"$error":"#DIV/0!"}]
[39,{"$f":"' Étape 2 – Nombre d’ETP touchés'!B43","v":""},{"$f":"' Étape 2 – Nombre d’ETP touchés'!C43","v":0},{"$f":"' Étape 2 – Nombre d’ETP touchés'!D43","v":{"$error":"#DIV/0!"}},{"$f":"' Étape 2 – Nombre d’ETP touchés'!E43","v":""},{"$f":"' Étape 2 – Nombre d’ETP touchés'!F43","v":""},{"$f":"' Étape 2 – Nombre d’ETP touchés'!G43","v":""},{"$f":"' Étape 2 – Nombre d’ETP touchés'!H43","v":""},{"$f":"' Étape 2 – Nombre d’ETP touchés'!I43","v":""},{"$f":"' Étape 2 – Nombre d’ETP touchés'!J43","v":""},{"$f":"' Étape 2 – Nombre d’ETP touchés'!K43","v":""},{"$f":"' Étape 2 – Nombre d’ETP touchés'!L43","v":""},{"$f":"' Étape 2 – Nombre d’ETP touchés'!M43","v":""},{"$f":"' Étape 2 – Nombre d’ETP touchés'!N43","v":""},{"$f":"' Étape 2 – Nombre d’ETP touchés'!O43","v":""},{"$f":"' Étape 2 – Nombre d’ETP touchés'!P43","v":""},{"$f":"' Étape 2 – Nombre d’ETP touchés'!Q43","v":""},{"$f":"' Étape 2 – Nombre d’ETP touchés'!R43","v":""},{"$f":"' Étape 2 – Nombre d’ETP touchés'!S43","v":""},{"$f":"' Étape 2 – Nombre d’ETP touchés'!T43","v":""},{"$f":"' Étape 2 – Nombre d’ETP touchés'!U43","v":""},{"$f":"' Étape 2 – Nombre d’ETP touchés'!V43","v":""},{"$f":"' Étape 2 – Nombre d’ETP touchés'!W43","v":""},"",{"$error":"#DIV/0!"},{"$error":"#DIV/0!"},{"$f":"' Étape 2 – Nombre d’ETP touchés'!X43","v":""},{"$error":"#DIV/0!"}]
[40,{"$f":"' Étape 2 – Nombre d’ETP touchés'!B44","v":""},{"$f":"' Étape 2 – Nombre d’ETP touchés'!C44","v":0},{"$f":"' Étape 2 – Nombre d’ETP touchés'!D44","v":{"$error":"#DIV/0!"}},{"$f":"' Étape 2 – Nombre d’ETP touchés'!E44","v":""},{"$f":"' Étape 2 – Nombre d’ETP touchés'!F44","v":""},{"$f":"' Étape 2 – Nombre d’ETP touchés'!G44","v":""},{"$f":"' Étape 2 – Nombre d’ETP touchés'!H44","v":""},{"$f":"' Étape 2 – Nombre d’ETP touchés'!I44","v":""},{"$f":"' Étape 2 – Nombre d’ETP touchés'!J44","v":""},{"$f":"' Étape 2 – Nombre d’ETP touchés'!K44","v":""},{"$f":"' Étape 2 – Nombre d’ETP touchés'!L44","v":""},{"$f":"' Étape 2 – Nombre d’ETP touchés'!M44","v":""},{"$f":"' Étape 2 – Nombre d’ETP touchés'!N44","v":""},{"$f":"' Étape 2 – Nombre d’ETP touchés'!O44","v":""},{"$f":"' Étape 2 – Nombre d’ETP touchés'!P44","v":""},{"$f":"' Étape 2 – Nombre d’ETP touchés'!Q44","v":""},{"$f":"' Étape 2 – Nombre d’ETP touchés'!R44","v":""},{"$f":"' Étape 2 – Nombre d’ETP touchés'!S44","v":""},{"$f":"' Étape 2 – Nombre d’ETP touchés'!T44","v":""},{"$f":"' Étape 2 – Nombre d’ETP touchés'!U44","v":""},{"$f":"' Étape 2 – Nombre d’ETP touchés'!V44","v":""},{"$f":"' Étape 2 – Nombre d’ETP touchés'!W44","v":""},"",{"$error":"#DIV/0!"},{"$error":"#DIV/0!"},{"$f":"' Étape 2 – Nombre d’ETP touchés'!X44","v":""},{"$error":"#DIV/0!"}]
[41,{"$f":"' Étape 2 – Nombre d’ETP touchés'!B45","v":""},{"$f":"' Étape 2 – Nombre d’ETP touchés'!C45","v":0},{"$f":"' Étape 2 – Nombre d’ETP touchés'!D45","v":{"$error":"#DIV/0!"}},{"$f":"' Étape 2 – Nombre d’ETP touchés'!E45","v":""},{"$f":"' Étape 2 – Nombre d’ETP touchés'!F45","v":""},{"$f":"' Étape 2 – Nombre d’ETP touchés'!G45","v":""},{"$f":"' Étape 2 – Nombre d’ETP touchés'!H45","v":""},{"$f":"' Étape 2 – Nombre d’ETP touchés'!I45","v":""},{"$f":"' Étape 2 – Nombre d’ETP touchés'!J45","v":""},{"$f":"' Étape 2 – Nombre d’ETP touchés'!K45","v":""},{"$f":"' Étape 2 – Nombre d’ETP touchés'!L45","v":""},{"$f":"' Étape 2 – Nombre d’ETP touchés'!M45","v":""},{"$f":"' Étape 2 – Nombre d’ETP touchés'!N45","v":""},{"$f":"' Étape 2 – Nombre d’ETP touchés'!O45","v":""},{"$f":"' Étape 2 – Nombre d’ETP touchés'!P45","v":""},{"$f":"' Étape 2 – Nombre d’ETP touchés'!Q45","v":""},{"$f":"' Étape 2 – Nombre d’ETP touchés'!R45","v":""},{"$f":"' Étape 2 – Nombre d’ETP touchés'!S45","v":""},{"$f":"' Étape 2 – Nombre d’ETP touchés'!T45","v":""},{"$f":"' Étape 2 – Nombre d’ETP touchés'!U45","v":""},{"$f":"' Étape 2 – Nombre d’ETP touchés'!V45","v":""},{"$f":"' Étape 2 – Nombre d’ETP touchés'!W45","v":""},"",{"$error":"#DIV/0!"},{"$error":"#DIV/0!"},{"$f":"' Étape 2 – Nombre d’ETP touchés'!X45","v":""},{"$error":"#DIV/0!"}]
[42,{"$f":"' Étape 2 – Nombre d’ETP touchés'!B46","v":""},{"$f":"' Étape 2 – Nombre d’ETP touchés'!C46","v":0},{"$f":"' Étape 2 – Nombre d’ETP touchés'!D46","v":{"$error":"#DIV/0!"}},{"$f":"' Étape 2 – Nombre d’ETP touchés'!E46","v":""},{"$f":"' Étape 2 – Nombre d’ETP touchés'!F46","v":""},{"$f":"' Étape 2 – Nombre d’ETP touchés'!G46","v":""},{"$f":"' Étape 2 – Nombre d’ETP touchés'!H46","v":""},{"$f":"' Étape 2 – Nombre d’ETP touchés'!I46","v":""},{"$f":"' Étape 2 – Nombre d’ETP touchés'!J46","v":""},{"$f":"' Étape 2 – Nombre d’ETP touchés'!K46","v":""},{"$f":"' Étape 2 – Nombre d’ETP touchés'!L46","v":""},{"$f":"' Étape 2 – Nombre d’ETP touchés'!M46","v":""},{"$f":"' Étape 2 – Nombre d’ETP touchés'!N46","v":""},{"$f":"' Étape 2 – Nombre d’ETP touchés'!O46","v":""},{"$f":"' Étape 2 – Nombre d’ETP touchés'!P46","v":""},{"$f":"' Étape 2 – Nombre d’ETP touchés'!Q46","v":""},{"$f":"' Étape 2 – Nombre d’ETP touchés'!R46","v":""},{"$f":"' Étape 2 – Nombre d’ETP touchés'!S46","v":""},{"$f":"' Étape 2 – Nombre d’ETP touchés'!T46","v":""},{"$f":"' Étape 2 – Nombre d’ETP touchés'!U46","v":""},{"$f":"' Étape 2 – Nombre d’ETP touchés'!V46","v":""},{"$f":"' Étape 2 – Nombre d’ETP touchés'!W46","v":""},"",{"$error":"#DIV/0!"},{"$error":"#DIV/0!"},{"$f":"' Étape 2 – Nombre d’ETP touchés'!X46","v":""},{"$error":"#DIV/0!"}]
[43,{"$f":"' Étape 2 – Nombre d’ETP touchés'!B47","v":""},{"$f":"' Étape 2 – Nombre d’ETP touchés'!C47","v":0},{"$f":"' Étape 2 – Nombre d’ETP touchés'!D47","v":{"$error":"#DIV/0!"}},{"$f":"' Étape 2 – Nombre d’ETP touchés'!E47","v":""},{"$f":"' Étape 2 – Nombre d’ETP touchés'!F47","v":""},{"$f":"' Étape 2 – Nombre d’ETP touchés'!G47","v":""},{"$f":"' Étape 2 – Nombre d’ETP touchés'!H47","v":""},{"$f":"' Étape 2 – Nombre d’ETP touchés'!I47","v":""},{"$f":"' Étape 2 – Nombre d’ETP touchés'!J47","v":""},{"$f":"' Étape 2 – Nombre d’ETP touchés'!K47","v":""},{"$f":"' Étape 2 – Nombre d’ETP touchés'!L47","v":""},{"$f":"' Étape 2 – Nombre d’ETP touchés'!M47","v":""},{"$f":"' Étape 2 – Nombre d’ETP touchés'!N47","v":""},{"$f":"' Étape 2 – Nombre d’ETP touchés'!O47","v":""},{"$f":"' Étape 2 – Nombre d’ETP touchés'!P47","v":""},{"$f":"' Étape 2 – Nombre d’ETP touchés'!Q47","v":""},{"$f":"' Étape 2 – Nombre d’ETP touchés'!R47","v":""},{"$f":"' Étape 2 – Nombre d’ETP touchés'!S47","v":""},{"$f":"' Étape 2 – Nombre d’ETP touchés'!T47","v":""},{"$f":"' Étape 2 – Nombre d’ETP touchés'!U47","v":""},{"$f":"' Étape 2 – Nombre d’ETP touchés'!V47","v":""},{"$f":"' Étape 2 – Nombre d’ETP touchés'!W47","v":""},"",{"$error":"#DIV/0!"},{"$error":"#DIV/0!"},{"$f":"' Étape 2 – Nombre d’ETP touchés'!X47","v":""},{"$error":"#DIV/0!"}]
[44,{"$f":"' Étape 2 – Nombre d’ETP touchés'!B48","v":""},{"$f":"' Étape 2 – Nombre d’ETP touchés'!C48","v":0},{"$f":"' Étape 2 – Nombre d’ETP touchés'!D48","v":{"$error":"#DIV/0!"}},{"$f":"' Étape 2 – Nombre d’ETP touchés'!E48","v":""},{"$f":"' Étape 2 – Nombre d’ETP touchés'!F48","v":""},{"$f":"' Étape 2 – Nombre d’ETP touchés'!G48","v":""},{"$f":"' Étape 2 – Nombre d’ETP touchés'!H48","v":""},{"$f":"' Étape 2 – Nombre d’ETP touchés'!I48","v":""},{"$f":"' Étape 2 – Nombre d’ETP touchés'!J48","v":""},{"$f":"' Étape 2 – Nombre d’ETP touchés'!K48","v":""},{"$f":"' Étape 2 – Nombre d’ETP touchés'!L48","v":""},{"$f":"' Étape 2 – Nombre d’ETP touchés'!M48","v":""},{"$f":"' Étape 2 – Nombre d’ETP touchés'!N48","v":""},{"$f":"' Étape 2 – Nombre d’ETP touchés'!O48","v":""},{"$f":"' Étape 2 – Nombre d’ETP touchés'!P48","v":""},{"$f":"' Étape 2 – Nombre d’ETP touchés'!Q48","v":""},{"$f":"' Étape 2 – Nombre d’ETP touchés'!R48","v":""},{"$f":"' Étape 2 – Nombre d’ETP touchés'!S48","v":""},{"$f":"' Étape 2 – Nombre d’ETP touchés'!T48","v":""},{"$f":"' Étape 2 – Nombre d’ETP touchés'!U48","v":""},{"$f":"' Étape 2 – Nombre d’ETP touchés'!V48","v":""},{"$f":"' Étape 2 – Nombre d’ETP touchés'!W48","v":""},"",{"$error":"#DIV/0!"},{"$error":"#DIV/0!"},{"$f":"' Étape 2 – Nombre d’ETP touchés'!X48","v":""},{"$error":"#DIV/0!"}]
[45,{"$f":"' Étape 2 – Nombre d’ETP touchés'!B49","v":""},{"$f":"' Étape 2 – Nombre d’ETP touchés'!C49","v":0},{"$f":"' Étape 2 – Nombre d’ETP touchés'!D49","v":{"$error":"#DIV/0!"}},{"$f":"' Étape 2 – Nombre d’ETP touchés'!E49","v":""},{"$f":"' Étape 2 – Nombre d’ETP touchés'!F49","v":""},{"$f":"' Étape 2 – Nombre d’ETP touchés'!G49","v":""},{"$f":"' Étape 2 – Nombre d’ETP touchés'!H49","v":""},{"$f":"' Étape 2 – Nombre d’ETP touchés'!I49","v":""},{"$f":"' Étape 2 – Nombre d’ETP touchés'!J49","v":""},{"$f":"' Étape 2 – Nombre d’ETP touchés'!K49","v":""},{"$f":"' Étape 2 – Nombre d’ETP touchés'!L49","v":""},{"$f":"' Étape 2 – Nombre d’ETP touchés'!M49","v":""},{"$f":"' Étape 2 – Nombre d’ETP touchés'!N49","v":""},{"$f":"' Étape 2 – Nombre d’ETP touchés'!O49","v":""},{"$f":"' Étape 2 – Nombre d’ETP touchés'!P49","v":""},{"$f":"' Étape 2 – Nombre d’ETP touchés'!Q49","v":""},{"$f":"' Étape 2 – Nombre d’ETP touchés'!R49","v":""},{"$f":"' Étape 2 – Nombre d’ETP touchés'!S49","v":""},{"$f":"' Étape 2 – Nombre d’ETP touchés'!T49","v":""},{"$f":"' Étape 2 – Nombre d’ETP touchés'!U49","v":""},{"$f":"' Étape 2 – Nombre d’ETP touchés'!V49","v":""},{"$f":"' Étape 2 – Nombre d’ETP touchés'!W49","v":""},"",{"$error":"#DIV/0!"},{"$error":"#DIV/0!"},{"$f":"' Étape 2 – Nombre d’ETP touchés'!X49","v":""},{"$error":"#DIV/0!"}]
[46,{"$f":"' Étape 2 – Nombre d’ETP touchés'!B50","v":""},{"$f":"' Étape 2 – Nombre d’ETP touchés'!C50","v":0},{"$f":"' Étape 2 – Nombre d’ETP touchés'!D50","v":{"$error":"#DIV/0!"}},{"$f":"' Étape 2 – Nombre d’ETP touchés'!E50","v":""},{"$f":"' Étape 2 – Nombre d’ETP touchés'!F50","v":""},{"$f":"' Étape 2 – Nombre d’ETP touchés'!G50","v":""},{"$f":"' Étape 2 – Nombre d’ETP touchés'!H50","v":""},{"$f":"' Étape 2 – Nombre d’ETP touchés'!I50","v":""},{"$f":"' Étape 2 – Nombre d’ETP touchés'!J50","v":""},{"$f":"' Étape 2 – Nombre d’ETP touchés'!K50","v":""},{"$f":"' Étape 2 – Nombre d’ETP touchés'!L50","v":""},{"$f":"' Étape 2 – Nombre d’ETP touchés'!M50","v":""},{"$f":"' Étape 2 – Nombre d’ETP touchés'!N50","v":""},{"$f":"' Étape 2 – Nombre d’ETP touchés'!O50","v":""},{"$f":"' Étape 2 – Nombre d’ETP touchés'!P50","v":""},{"$f":"' Étape 2 – Nombre d’ETP touchés'!Q50","v":""},{"$f":"' Étape 2 – Nombre d’ETP touchés'!R50","v":""},{"$f":"' Étape 2 – Nombre d’ETP touchés'!S50","v":""},{"$f":"' Étape 2 – Nombre d’ETP touchés'!T50","v":""},{"$f":"' Étape 2 – Nombre d’ETP touchés'!U50","v":""},{"$f":"' Étape 2 – Nombre d’ETP touchés'!V50","v":""},{"$f":"' Étape 2 – Nombre d’ETP touchés'!W50","v":""},"",{"$error":"#DIV/0!"},{"$error":"#DIV/0!"},{"$f":"' Étape 2 – Nombre d’ETP touchés'!X50","v":""},{"$error":"#DIV/0!"}]
[47,{"$f":"' Étape 2 – Nombre d’ETP touchés'!B51","v":""},{"$f":"' Étape 2 – Nombre d’ETP touchés'!C51","v":0},{"$f":"' Étape 2 – Nombre d’ETP touchés'!D51","v":{"$error":"#DIV/0!"}},{"$f":"' Étape 2 – Nombre d’ETP touchés'!E51","v":""},{"$f":"' Étape 2 – Nombre d’ETP touchés'!F51","v":""},{"$f":"' Étape 2 – Nombre d’ETP touchés'!G51","v":""},{"$f":"' Étape 2 – Nombre d’ETP touchés'!H51","v":""},{"$f":"' Étape 2 – Nombre d’ETP touchés'!I51","v":""},{"$f":"' Étape 2 – Nombre d’ETP touchés'!J51","v":""},{"$f":"' Étape 2 – Nombre d’ETP touchés'!K51","v":""},{"$f":"' Étape 2 – Nombre d’ETP touchés'!L51","v":""},{"$f":"' Étape 2 – Nombre d’ETP touchés'!M51","v":""},{"$f":"' Étape 2 – Nombre d’ETP touchés'!N51","v":""},{"$f":"' Étape 2 – Nombre d’ETP touchés'!O51","v":""},{"$f":"' Étape 2 – Nombre d’ETP touchés'!P51","v":""},{"$f":"' Étape 2 – Nombre d’ETP touchés'!Q51","v":""},{"$f":"' Étape 2 – Nombre d’ETP touchés'!R51","v":""},{"$f":"' Étape 2 – Nombre d’ETP touchés'!S51","v":""},{"$f":"' Étape 2 – Nombre d’ETP touchés'!T51","v":""},{"$f":"' Étape 2 – Nombre d’ETP touchés'!U51","v":""},{"$f":"' Étape 2 – Nombre d’ETP touchés'!V51","v":""},{"$f":"' Étape 2 – Nombre d’ETP touchés'!W51","v":""},"",{"$error":"#DIV/0!"},{"$error":"#DIV/0!"},{"$f":"' Étape 2 – Nombre d’ETP touchés'!X51","v":""},{"$error":"#DIV/0!"}]
[48,{"$f":"' Étape 2 – Nombre d’ETP touchés'!B52","v":""},{"$f":"' Étape 2 – Nombre d’ETP touchés'!C52","v":0},{"$f":"' Étape 2 – Nombre d’ETP touchés'!D52","v":{"$error":"#DIV/0!"}},{"$f":"' Étape 2 – Nombre d’ETP touchés'!E52","v":""},{"$f":"' Étape 2 – Nombre d’ETP touchés'!F52","v":""},{"$f":"' Étape 2 – Nombre d’ETP touchés'!G52","v":""},{"$f":"' Étape 2 – Nombre d’ETP touchés'!H52","v":""},{"$f":"' Étape 2 – Nombre d’ETP touchés'!I52","v":""},{"$f":"' Étape 2 – Nombre d’ETP touchés'!J52","v":""},{"$f":"' Étape 2 – Nombre d’ETP touchés'!K52","v":""},{"$f":"' Étape 2 – Nombre d’ETP touchés'!L52","v":""},{"$f":"' Étape 2 – Nombre d’ETP touchés'!M52","v":""},{"$f":"' Étape 2 – Nombre d’ETP touchés'!N52","v":""},{"$f":"' Étape 2 – Nombre d’ETP touchés'!O52","v":""},{"$f":"' Étape 2 – Nombre d’ETP touchés'!P52","v":""},{"$f":"' Étape 2 – Nombre d’ETP touchés'!Q52","v":""},{"$f":"' Étape 2 – Nombre d’ETP touchés'!R52","v":""},{"$f":"' Étape 2 – Nombre d’ETP touchés'!S52","v":""},{"$f":"' Étape 2 – Nombre d’ETP touchés'!T52","v":""},{"$f":"' Étape 2 – Nombre d’ETP touchés'!U52","v":""},{"$f":"' Étape 2 – Nombre d’ETP touchés'!V52","v":""},{"$f":"' Étape 2 – Nombre d’ETP touchés'!W52","v":""},"",{"$error":"#DIV/0!"},{"$error":"#DIV/0!"},{"$f":"' Étape 2 – Nombre d’ETP touchés'!X52","v":""},{"$error":"#DIV/0!"}]
[49,{"$f":"' Étape 2 – Nombre d’ETP touchés'!B53","v":""},{"$f":"' Étape 2 – Nombre d’ETP touchés'!C53","v":0},{"$f":"' Étape 2 – Nombre d’ETP touchés'!D53","v":{"$error":"#DIV/0!"}},{"$f":"' Étape 2 – Nombre d’ETP touchés'!E53","v":""},{"$f":"' Étape 2 – Nombre d’ETP touchés'!F53","v":""},{"$f":"' Étape 2 – Nombre d’ETP touchés'!G53","v":""},{"$f":"' Étape 2 – Nombre d’ETP touchés'!H53","v":""},{"$f":"' Étape 2 – Nombre d’ETP touchés'!I53","v":""},{"$f":"' Étape 2 – Nombre d’ETP touchés'!J53","v":""},{"$f":"' Étape 2 – Nombre d’ETP touchés'!K53","v":""},{"$f":"' Étape 2 – Nombre d’ETP touchés'!L53","v":""},{"$f":"' Étape 2 – Nombre d’ETP touchés'!M53","v":""},{"$f":"' Étape 2 – Nombre d’ETP touchés'!N53","v":""},{"$f":"' Étape 2 – Nombre d’ETP touchés'!O53","v":""},{"$f":"' Étape 2 – Nombre d’ETP touchés'!P53","v":""},{"$f":"' Étape 2 – Nombre d’ETP touchés'!Q53","v":""},{"$f":"' Étape 2 – Nombre d’ETP touchés'!R53","v":""},{"$f":"' Étape 2 – Nombre d’ETP touchés'!S53","v":""},{"$f":"' Étape 2 – Nombre d’ETP touchés'!T53","v":""},{"$f":"' Étape 2 – Nombre d’ETP touchés'!U53","v":""},{"$f":"' Étape 2 – Nombre d’ETP touchés'!V53","v":""},{"$f":"' Étape 2 – Nombre d’ETP touchés'!W53","v":""},"",{"$error":"#DIV/0!"},{"$error":"#DIV/0!"},{"$f":"' Étape 2 – Nombre d’ETP touchés'!X53","v":""},{"$error":"#DIV/0!"}]
[50,{"$f":"' Étape 2 – Nombre d’ETP touchés'!B54","v":""},{"$f":"' Étape 2 – Nombre d’ETP touchés'!C54","v":0},{"$f":"' Étape 2 – Nombre d’ETP touchés'!D54","v":{"$error":"#DIV/0!"}},{"$f":"' Étape 2 – Nombre d’ETP touchés'!E54","v":""},{"$f":"' Étape 2 – Nombre d’ETP touchés'!F54","v":""},{"$f":"' Étape 2 – Nombre d’ETP touchés'!G54","v":""},{"$f":"' Étape 2 – Nombre d’ETP touchés'!H54","v":""},{"$f":"' Étape 2 – Nombre d’ETP touchés'!I54","v":""},{"$f":"' Étape 2 – Nombre d’ETP touchés'!J54","v":""},{"$f":"' Étape 2 – Nombre d’ETP touchés'!K54","v":""},{"$f":"' Étape 2 – Nombre d’ETP touchés'!L54","v":""},{"$f":"' Étape 2 – Nombre d’ETP touchés'!M54","v":""},{"$f":"' Étape 2 – Nombre d’ETP touchés'!N54","v":""},{"$f":"' Étape 2 – Nombre d’ETP touchés'!O54","v":""},{"$f":"' Étape 2 – Nombre d’ETP touchés'!P54","v":""},{"$f":"' Étape 2 – Nombre d’ETP touchés'!Q54","v":""},{"$f":"' Étape 2 – Nombre d’ETP touchés'!R54","v":""},{"$f":"' Étape 2 – Nombre d’ETP touchés'!S54","v":""},{"$f":"' Étape 2 – Nombre d’ETP touchés'!T54","v":""},{"$f":"' Étape 2 – Nombre d’ETP touchés'!U54","v":""},{"$f":"' Étape 2 – Nombre d’ETP touchés'!V54","v":""},{"$f":"' Étape 2 – Nombre d’ETP touchés'!W54","v":""},"",{"$error":"#DIV/0!"},{"$error":"#DIV/0!"},{"$f":"' Étape 2 – Nombre d’ETP touchés'!X54","v":""},{"$error":"#DIV/0!"}]
[51,{"$f":"' Étape 2 – Nombre d’ETP touchés'!B55","v":""},{"$f":"' Étape 2 – Nombre d’ETP touchés'!C55","v":0},{"$f":"' Étape 2 – Nombre d’ETP touchés'!D55","v":{"$error":"#DIV/0!"}},{"$f":"' Étape 2 – Nombre d’ETP touchés'!E55","v":""},{"$f":"' Étape 2 – Nombre d’ETP touchés'!F55","v":""},{"$f":"' Étape 2 – Nombre d’ETP touchés'!G55","v":""},{"$f":"' Étape 2 – Nombre d’ETP touchés'!H55","v":""},{"$f":"' Étape 2 – Nombre d’ETP touchés'!I55","v":""},{"$f":"' Étape 2 – Nombre d’ETP touchés'!J55","v":""},{"$f":"' Étape 2 – Nombre d’ETP touchés'!K55","v":""},{"$f":"' Étape 2 – Nombre d’ETP touchés'!L55","v":""},{"$f":"' Étape 2 – Nombre d’ETP touchés'!M55","v":""},{"$f":"' Étape 2 – Nombre d’ETP touchés'!N55","v":""},{"$f":"' Étape 2 – Nombre d’ETP touchés'!O55","v":""},{"$f":"' Étape 2 – Nombre d’ETP touchés'!P55","v":""},{"$f":"' Étape 2 – Nombre d’ETP touchés'!Q55","v":""},{"$f":"' Étape 2 – Nombre d’ETP touchés'!R55","v":""},{"$f":"' Étape 2 – Nombre d’ETP touchés'!S55","v":""},{"$f":"' Étape 2 – Nombre d’ETP touchés'!T55","v":""},{"$f":"' Étape 2 – Nombre d’ETP touchés'!U55","v":""},{"$f":"' Étape 2 – Nombre d’ETP touchés'!V55","v":""},{"$f":"' Étape 2 – Nombre d’ETP touchés'!W55","v":""},"",{"$error":"#DIV/0!"},{"$error":"#DIV/0!"},{"$f":"' Étape 2 – Nombre d’ETP touchés'!X55","v":""},{"$error":"#DIV/0!"}]
[52,{"$f":"' Étape 2 – Nombre d’ETP touchés'!B56","v":""},{"$f":"' Étape 2 – Nombre d’ETP touchés'!C56","v":0},{"$f":"' Étape 2 – Nombre d’ETP touchés'!D56","v":{"$error":"#DIV/0!"}},{"$f":"' Étape 2 – Nombre d’ETP touchés'!E56","v":""},{"$f":"' Étape 2 – Nombre d’ETP touchés'!F56","v":""},{"$f":"' Étape 2 – Nombre d’ETP touchés'!G56","v":""},{"$f":"' Étape 2 – Nombre d’ETP touchés'!H56","v":""},{"$f":"' Étape 2 – Nombre d’ETP touchés'!I56","v":""},{"$f":"' Étape 2 – Nombre d’ETP touchés'!J56","v":""},{"$f":"' Étape 2 – Nombre d’ETP touchés'!K56","v":""},{"$f":"' Étape 2 – Nombre d’ETP touchés'!L56","v":""},{"$f":"' Étape 2 – Nombre d’ETP touchés'!M56","v":""},{"$f":"' Étape 2 – Nombre d’ETP touchés'!N56","v":""},{"$f":"' Étape 2 – Nombre d’ETP touchés'!O56","v":""},{"$f":"' Étape 2 – Nombre d’ETP touchés'!P56","v":""},{"$f":"' Étape 2 – Nombre d’ETP touchés'!Q56","v":""},{"$f":"' Étape 2 – Nombre d’ETP touchés'!R56","v":""},{"$f":"' Étape 2 – Nombre d’ETP touchés'!S56","v":""},{"$f":"' Étape 2 – Nombre d’ETP touchés'!T56","v":""},{"$f":"' Étape 2 – Nombre d’ETP touchés'!U56","v":""},{"$f":"' Étape 2 – Nombre d’ETP touchés'!V56","v":""},{"$f":"' Étape 2 – Nombre d’ETP touchés'!W56","v":""},"",{"$error":"#DIV/0!"},{"$error":"#DIV/0!"},{"$f":"' Étape 2 – Nombre d’ETP touchés'!X56","v":""},{"$error":"#DIV/0!"}]
[53,{"$f":"' Étape 2 – Nombre d’ETP touchés'!B57","v":""},{"$f":"' Étape 2 – Nombre d’ETP touchés'!C57","v":0},{"$f":"' Étape 2 – Nombre d’ETP touchés'!D57","v":{"$error":"#DIV/0!"}},{"$f":"' Étape 2 – Nombre d’ETP touchés'!E57","v":""},{"$f":"' Étape 2 – Nombre d’ETP touchés'!F57","v":""},{"$f":"' Étape 2 – Nombre d’ETP touchés'!G57","v":""},{"$f":"' Étape 2 – Nombre d’ETP touchés'!H57","v":""},{"$f":"' Étape 2 – Nombre d’ETP touchés'!I57","v":""},{"$f":"' Étape 2 – Nombre d’ETP touchés'!J57","v":""},{"$f":"' Étape 2 – Nombre d’ETP touchés'!K57","v":""},{"$f":"' Étape 2 – Nombre d’ETP touchés'!L57","v":""},{"$f":"' Étape 2 – Nombre d’ETP touchés'!M57","v":""},{"$f":"' Étape 2 – Nombre d’ETP touchés'!N57","v":""},{"$f":"' Étape 2 – Nombre d’ETP touchés'!O57","v":""},{"$f":"' Étape 2 – Nombre d’ETP touchés'!P57","v":""},{"$f":"' Étape 2 – Nombre d’ETP touchés'!Q57","v":""},{"$f":"' Étape 2 – Nombre d’ETP touchés'!R57","v":""},{"$f":"' Étape 2 – Nombre d’ETP touchés'!S57","v":""},{"$f":"' Étape 2 – Nombre d’ETP touchés'!T57","v":""},{"$f":"' Étape 2 – Nombre d’ETP touchés'!U57","v":""},{"$f":"' Étape 2 – Nombre d’ETP touchés'!V57","v":""},{"$f":"' Étape 2 – Nombre d’ETP touchés'!W57","v":""},"",{"$error":"#DIV/0!"},{"$error":"#DIV/0!"},{"$f":"' Étape 2 – Nombre d’ETP touchés'!X57","v":""},{"$error":"#DIV/0!"}]
[54,{"$f":"' Étape 2 – Nombre d’ETP touchés'!B58","v":""},{"$f":"' Étape 2 – Nombre d’ETP touchés'!C58","v":0},{"$f":"' Étape 2 – Nombre d’ETP touchés'!D58","v":{"$error":"#DIV/0!"}},{"$f":"' Étape 2 – Nombre d’ETP touchés'!E58","v":""},{"$f":"' Étape 2 – Nombre d’ETP touchés'!F58","v":""},{"$f":"' Étape 2 – Nombre d’ETP touchés'!G58","v":""},{"$f":"' Étape 2 – Nombre d’ETP touchés'!H58","v":""},{"$f":"' Étape 2 – Nombre d’ETP touchés'!I58","v":""},{"$f":"' Étape 2 – Nombre d’ETP touchés'!J58","v":""},{"$f":"' Étape 2 – Nombre d’ETP touchés'!K58","v":""},{"$f":"' Étape 2 – Nombre d’ETP touchés'!L58","v":""},{"$f":"' Étape 2 – Nombre d’ETP touchés'!M58","v":""},{"$f":"' Étape 2 – Nombre d’ETP touchés'!N58","v":""},{"$f":"' Étape 2 – Nombre d’ETP touchés'!O58","v":""},{"$f":"' Étape 2 – Nombre d’ETP touchés'!P58","v":""},{"$f":"' Étape 2 – Nombre d’ETP touchés'!Q58","v":""},{"$f":"' Étape 2 – Nombre d’ETP touchés'!R58","v":""},{"$f":"' Étape 2 – Nombre d’ETP touchés'!S58","v":""},{"$f":"' Étape 2 – Nombre d’ETP touchés'!T58","v":""},{"$f":"' Étape 2 – Nombre d’ETP touchés'!U58","v":""},{"$f":"' Étape 2 – Nombre d’ETP touchés'!V58","v":""},{"$f":"' Étape 2 – Nombre d’ETP touchés'!W58","v":""},"",{"$error":"#DIV/0!"},{"$error":"#DIV/0!"},{"$f":"' Étape 2 – Nombre d’ETP touchés'!X58","v":""},{"$error":"#DIV/0!"}]
[55,{"$f":"' Étape 2 – Nombre d’ETP touchés'!B59","v":""},{"$f":"' Étape 2 – Nombre d’ETP touchés'!C59","v":0},{"$f":"' Étape 2 – Nombre d’ETP touchés'!D59","v":{"$error":"#DIV/0!"}},{"$f":"' Étape 2 – Nombre d’ETP touchés'!E59","v":""},{"$f":"' Étape 2 – Nombre d’ETP touchés'!F59","v":""},{"$f":"' Étape 2 – Nombre d’ETP touchés'!G59","v":""},{"$f":"' Étape 2 – Nombre d’ETP touchés'!H59","v":""},{"$f":"' Étape 2 – Nombre d’ETP touchés'!I59","v":""},{"$f":"' Étape 2 – Nombre d’ETP touchés'!J59","v":""},{"$f":"' Étape 2 – Nombre d’ETP touchés'!K59","v":""},{"$f":"' Étape 2 – Nombre d’ETP touchés'!L59","v":""},{"$f":"' Étape 2 – Nombre d’ETP touchés'!M59","v":""},{"$f":"' Étape 2 – Nombre d’ETP touchés'!N59","v":""},{"$f":"' Étape 2 – Nombre d’ETP touchés'!O59","v":""},{"$f":"' Étape 2 – Nombre d’ETP touchés'!P59","v":""},{"$f":"' Étape 2 – Nombre d’ETP touchés'!Q59","v":""},{"$f":"' Étape 2 – Nombre d’ETP touchés'!R59","v":""},{"$f":"' Étape 2 – Nombre d’ETP touchés'!S59","v":""},{"$f":"' Étape 2 – Nombre d’ETP touchés'!T59","v":""},{"$f":"' Étape 2 – Nombre d’ETP touchés'!U59","v":""},{"$f":"' Étape 2 – Nombre d’ETP touchés'!V59","v":""},{"$f":"' Étape 2 – Nombre d’ETP touchés'!W59","v":""},"",{"$error":"#DIV/0!"},{"$error":"#DIV/0!"},{"$f":"' Étape 2 – Nombre d’ETP touchés'!X59","v":""},{"$error":"#DIV/0!"}]
[56,{"$f":"' Étape 2 – Nombre d’ETP touchés'!B60","v":""},{"$f":"' Étape 2 – Nombre d’ETP touchés'!C60","v":0},{"$f":"' Étape 2 – Nombre d’ETP touchés'!D60","v":{"$error":"#DIV/0!"}},{"$f":"' Étape 2 – Nombre d’ETP touchés'!E60","v":""},{"$f":"' Étape 2 – Nombre d’ETP touchés'!F60","v":""},{"$f":"' Étape 2 – Nombre d’ETP touchés'!G60","v":""},{"$f":"' Étape 2 – Nombre d’ETP touchés'!H60","v":""},{"$f":"' Étape 2 – Nombre d’ETP touchés'!I60","v":""},{"$f":"' Étape 2 – Nombre d’ETP touchés'!J60","v":""},{"$f":"' Étape 2 – Nombre d’ETP touchés'!K60","v":""},{"$f":"' Étape 2 – Nombre d’ETP touchés'!L60","v":""},{"$f":"' Étape 2 – Nombre d’ETP touchés'!M60","v":""},{"$f":"' Étape 2 – Nombre d’ETP touchés'!N60","v":""},{"$f":"' Étape 2 – Nombre d’ETP touchés'!O60","v":""},{"$f":"' Étape 2 – Nombre d’ETP touchés'!P60","v":""},{"$f":"' Étape 2 – Nombre d’ETP touchés'!Q60","v":""},{"$f":"' Étape 2 – Nombre d’ETP touchés'!R60","v":""},{"$f":"' Étape 2 – Nombre d’ETP touchés'!S60","v":""},{"$f":"' Étape 2 – Nombre d’ETP touchés'!T60","v":""},{"$f":"' Étape 2 – Nombre d’ETP touchés'!U60","v":""},{"$f":"' Étape 2 – Nombre d’ETP touchés'!V60","v":""},{"$f":"' Étape 2 – Nombre d’ETP touchés'!W60","v":""},"",{"$error":"#DIV/0!"},{"$error":"#DIV/0!"},{"$f":"' Étape 2 – Nombre d’ETP touchés'!X60","v":""},{"$error":"#DIV/0!"}]
[57,{"$f":"' Étape 2 – Nombre d’ETP touchés'!B61","v":""},{"$f":"' Étape 2 – Nombre d’ETP touchés'!C61","v":0},{"$f":"' Étape 2 – Nombre d’ETP touchés'!D61","v":{"$error":"#DIV/0!"}},{"$f":"' Étape 2 – Nombre d’ETP touchés'!E61","v":""},{"$f":"' Étape 2 – Nombre d’ETP touchés'!F61","v":""},{"$f":"' Étape 2 – Nombre d’ETP touchés'!G61","v":""},{"$f":"' Étape 2 – Nombre d’ETP touchés'!H61","v":""},{"$f":"' Étape 2 – Nombre d’ETP touchés'!I61","v":""},{"$f":"' Étape 2 – Nombre d’ETP touchés'!J61","v":""},{"$f":"' Étape 2 – Nombre d’ETP touchés'!K61","v":""},{"$f":"' Étape 2 – Nombre d’ETP touchés'!L61","v":""},{"$f":"' Étape 2 – Nombre d’ETP touchés'!M61","v":""},{"$f":"' Étape 2 – Nombre d’ETP touchés'!N61","v":""},{"$f":"' Étape 2 – Nombre d’ETP touchés'!O61","v":""},{"$f":"' Étape 2 – Nombre d’ETP touchés'!P61","v":""},{"$f":"' Étape 2 – Nombre d’ETP touchés'!Q61","v":""},{"$f":"' Étape 2 – Nombre d’ETP touchés'!R61","v":""},{"$f":"' Étape 2 – Nombre d’ETP touchés'!S61","v":""},{"$f":"' Étape 2 – Nombre d’ETP touchés'!T61","v":""},{"$f":"' Étape 2 – Nombre d’ETP touchés'!U61","v":""},{"$f":"' Étape 2 – Nombre d’ETP touchés'!V61","v":""},{"$f":"' Étape 2 – Nombre d’ETP touchés'!W61","v":""},"",{"$error":"#DIV/0!"},{"$error":"#DIV/0!"},{"$f":"' Étape 2 – Nombre d’ETP touchés'!X61","v":""},{"$error":"#DIV/0!"}]
[58,{"$f":"' Étape 2 – Nombre d’ETP touchés'!B62","v":""},{"$f":"' Étape 2 – Nombre d’ETP touchés'!C62","v":0},{"$f":"' Étape 2 – Nombre d’ETP touchés'!D62","v":{"$error":"#DIV/0!"}},{"$f":"' Étape 2 – Nombre d’ETP touchés'!E62","v":""},{"$f":"' Étape 2 – Nombre d’ETP touchés'!F62","v":""},{"$f":"' Étape 2 – Nombre d’ETP touchés'!G62","v":""},{"$f":"' Étape 2 – Nombre d’ETP touchés'!H62","v":""},{"$f":"' Étape 2 – Nombre d’ETP touchés'!I62","v":""},{"$f":"' Étape 2 – Nombre d’ETP touchés'!J62","v":""},{"$f":"' Étape 2 – Nombre d’ETP touchés'!K62","v":""},{"$f":"' Étape 2 – Nombre d’ETP touchés'!L62","v":""},{"$f":"' Étape 2 – Nombre d’ETP touchés'!M62","v":""},{"$f":"' Étape 2 – Nombre d’ETP touchés'!N62","v":""},{"$f":"' Étape 2 – Nombre d’ETP touchés'!O62","v":""},{"$f":"' Étape 2 – Nombre d’ETP touchés'!P62","v":""},{"$f":"' Étape 2 – Nombre d’ETP touchés'!Q62","v":""},{"$f":"' Étape 2 – Nombre d’ETP touchés'!R62","v":""},{"$f":"' Étape 2 – Nombre d’ETP touchés'!S62","v":""},{"$f":"' Étape 2 – Nombre d’ETP touchés'!T62","v":""},{"$f":"' Étape 2 – Nombre d’ETP touchés'!U62","v":""},{"$f":"' Étape 2 – Nombre d’ETP touchés'!V62","v":""},{"$f":"' Étape 2 – Nombre d’ETP touchés'!W62","v":""},"",{"$error":"#DIV/0!"},{"$error":"#DIV/0!"},{"$f":"' Étape 2 – Nombre d’ETP touchés'!X62","v":""},{"$error":"#DIV/0!"}]
[59,{"$f":"' Étape 2 – Nombre d’ETP touchés'!B63","v":""},{"$f":"' Étape 2 – Nombre d’ETP touchés'!C63","v":0},{"$f":"' Étape 2 – Nombre d’ETP touchés'!D63","v":{"$error":"#DIV/0!"}},{"$f":"' Étape 2 – Nombre d’ETP touchés'!E63","v":""},{"$f":"' Étape 2 – Nombre d’ETP touchés'!F63","v":""},{"$f":"' Étape 2 – Nombre d’ETP touchés'!G63","v":""},{"$f":"' Étape 2 – Nombre d’ETP touchés'!H63","v":""},{"$f":"' Étape 2 – Nombre d’ETP touchés'!I63","v":""},{"$f":"' Étape 2 – Nombre d’ETP touchés'!J63","v":""},{"$f":"' Étape 2 – Nombre d’ETP touchés'!K63","v":""},{"$f":"' Étape 2 – Nombre d’ETP touchés'!L63","v":""},{"$f":"' Étape 2 – Nombre d’ETP touchés'!M63","v":""},{"$f":"' Étape 2 – Nombre d’ETP touchés'!N63","v":""},{"$f":"' Étape 2 – Nombre d’ETP touchés'!O63","v":""},{"$f":"' Étape 2 – Nombre d’ETP touchés'!P63","v":""},{"$f":"' Étape 2 – Nombre d’ETP touchés'!Q63","v":""},{"$f":"' Étape 2 – Nombre d’ETP touchés'!R63","v":""},{"$f":"' Étape 2 – Nombre d’ETP touchés'!S63","v":""},{"$f":"' Étape 2 – Nombre d’ETP touchés'!T63","v":""},{"$f":"' Étape 2 – Nombre d’ETP touchés'!U63","v":""},{"$f":"' Étape 2 – Nombre d’ETP touchés'!V63","v":""},{"$f":"' Étape 2 – Nombre d’ETP touchés'!W63","v":""},"",{"$error":"#DIV/0!"},{"$error":"#DIV/0!"},{"$f":"' Étape 2 – Nombre d’ETP touchés'!X63","v":""},{"$error":"#DIV/0!"}]
[60,{"$f":"' Étape 2 – Nombre d’ETP touchés'!B64","v":""},{"$f":"' Étape 2 – Nombre d’ETP touchés'!C64","v":0},{"$f":"' Étape 2 – Nombre d’ETP touchés'!D64","v":{"$error":"#DIV/0!"}},{"$f":"' Étape 2 – Nombre d’ETP touchés'!E64","v":""},{"$f":"' Étape 2 – Nombre d’ETP touchés'!F64","v":""},{"$f":"' Étape 2 – Nombre d’ETP touchés'!G64","v":""},{"$f":"' Étape 2 – Nombre d’ETP touchés'!H64","v":""},{"$f":"' Étape 2 – Nombre d’ETP touchés'!I64","v":""},{"$f":"' Étape 2 – Nombre d’ETP touchés'!J64","v":""},{"$f":"' Étape 2 – Nombre d’ETP touchés'!K64","v":""},{"$f":"' Étape 2 – Nombre d’ETP touchés'!L64","v":""},{"$f":"' Étape 2 – Nombre d’ETP touchés'!M64","v":""},{"$f":"' Étape 2 – Nombre d’ETP touchés'!N64","v":""},{"$f":"' Étape 2 – Nombre d’ETP touchés'!O64","v":""},{"$f":"' Étape 2 – Nombre d’ETP touchés'!P64","v":""},{"$f":"' Étape 2 – Nombre d’ETP touchés'!Q64","v":""},{"$f":"' Étape 2 – Nombre d’ETP touchés'!R64","v":""},{"$f":"' Étape 2 – Nombre d’ETP touchés'!S64","v":""},{"$f":"' Étape 2 – Nombre d’ETP touchés'!T64","v":""},{"$f":"' Étape 2 – Nombre d’ETP touchés'!U64","v":""},{"$f":"' Étape 2 – Nombre d’ETP touchés'!V64","v":""},{"$f":"' Étape 2 – Nombre d’ETP touchés'!W64","v":""},"",{"$error":"#DIV/0!"},{"$error":"#DIV/0!"},{"$f":"' Étape 2 – Nombre d’ETP touchés'!X64","v":""},{"$error":"#DIV/0!"}]
[61,{"$f":"' Étape 2 – Nombre d’ETP touchés'!B65","v":""},{"$f":"' Étape 2 – Nombre d’ETP touchés'!C65","v":0},{"$f":"' Étape 2 – Nombre d’ETP touchés'!D65","v":{"$error":"#DIV/0!"}},{"$f":"' Étape 2 – Nombre d’ETP touchés'!E65","v":""},{"$f":"' Étape 2 – Nombre d’ETP touchés'!F65","v":""},{"$f":"' Étape 2 – Nombre d’ETP touchés'!G65","v":""},{"$f":"' Étape 2 – Nombre d’ETP touchés'!H65","v":""},{"$f":"' Étape 2 – Nombre d’ETP touchés'!I65","v":""},{"$f":"' Étape 2 – Nombre d’ETP touchés'!J65","v":""},{"$f":"' Étape 2 – Nombre d’ETP touchés'!K65","v":""},{"$f":"' Étape 2 – Nombre d’ETP touchés'!L65","v":""},{"$f":"' Étape 2 – Nombre d’ETP touchés'!M65","v":""},{"$f":"' Étape 2 – Nombre d’ETP touchés'!N65","v":""},{"$f":"' Étape 2 – Nombre d’ETP touchés'!O65","v":""},{"$f":"' Étape 2 – Nombre d’ETP touchés'!P65","v":""},{"$f":"' Étape 2 – Nombre d’ETP touchés'!Q65","v":""},{"$f":"' Étape 2 – Nombre d’ETP touchés'!R65","v":""},{"$f":"' Étape 2 – Nombre d’ETP touchés'!S65","v":""},{"$f":"' Étape 2 – Nombre d’ETP touchés'!T65","v":""},{"$f":"' Étape 2 – Nombre d’ETP touchés'!U65","v":""},{"$f":"' Étape 2 – Nombre d’ETP touchés'!V65","v":""},{"$f":"' Étape 2 – Nombre d’ETP touchés'!W65","v":""},"",{"$error":"#DIV/0!"},{"$error":"#DIV/0!"},{"$f":"' Étape 2 – Nombre d’ETP touchés'!X65","v":""},{"$error":"#DIV/0!"}]
[62,{"$f":"' Étape 2 – Nombre d’ETP touchés'!B66","v":""},{"$f":"' Étape 2 – Nombre d’ETP touchés'!C66","v":0},{"$f":"' Étape 2 – Nombre d’ETP touchés'!D66","v":{"$error":"#DIV/0!"}},{"$f":"' Étape 2 – Nombre d’ETP touchés'!E66","v":""},{"$f":"' Étape 2 – Nombre d’ETP touchés'!F66","v":""},{"$f":"' Étape 2 – Nombre d’ETP touchés'!G66","v":""},{"$f":"' Étape 2 – Nombre d’ETP touchés'!H66","v":""},{"$f":"' Étape 2 – Nombre d’ETP touchés'!I66","v":""},{"$f":"' Étape 2 – Nombre d’ETP touchés'!J66","v":""},{"$f":"' Étape 2 – Nombre d’ETP touchés'!K66","v":""},{"$f":"' Étape 2 – Nombre d’ETP touchés'!L66","v":""},{"$f":"' Étape 2 – Nombre d’ETP touchés'!M66","v":""},{"$f":"' Étape 2 – Nombre d’ETP touchés'!N66","v":""},{"$f":"' Étape 2 – Nombre d’ETP touchés'!O66","v":""},{"$f":"' Étape 2 – Nombre d’ETP touchés'!P66","v":""},{"$f":"' Étape 2 – Nombre d’ETP touchés'!Q66","v":""},{"$f":"' Étape 2 – Nombre d’ETP touchés'!R66","v":""},{"$f":"' Étape 2 – Nombre d’ETP touchés'!S66","v":""},{"$f":"' Étape 2 – Nombre d’ETP touchés'!T66","v":""},{"$f":"' Étape 2 – Nombre d’ETP touchés'!U66","v":""},{"$f":"' Étape 2 – Nombre d’ETP touchés'!V66","v":""},{"$f":"' Étape 2 – Nombre d’ETP touchés'!W66","v":""},"",{"$error":"#DIV/0!"},{"$error":"#DIV/0!"},{"$f":"' Étape 2 – Nombre d’ETP touchés'!X66","v":""},{"$error":"#DIV/0!"}]
[63,{"$f":"' Étape 2 – Nombre d’ETP touchés'!B67","v":""},{"$f":"' Étape 2 – Nombre d’ETP touchés'!C67","v":0},{"$f":"' Étape 2 – Nombre d’ETP touchés'!D67","v":{"$error":"#DIV/0!"}},{"$f":"' Étape 2 – Nombre d’ETP touchés'!E67","v":""},{"$f":"' Étape 2 – Nombre d’ETP touchés'!F67","v":""},{"$f":"' Étape 2 – Nombre d’ETP touchés'!G67","v":""},{"$f":"' Étape 2 – Nombre d’ETP touchés'!H67","v":""},{"$f":"' Étape 2 – Nombre d’ETP touchés'!I67","v":""},{"$f":"' Étape 2 – Nombre d’ETP touchés'!J67","v":""},{"$f":"' Étape 2 – Nombre d’ETP touchés'!K67","v":""},{"$f":"' Étape 2 – Nombre d’ETP touchés'!L67","v":""},{"$f":"' Étape 2 – Nombre d’ETP touchés'!M67","v":""},{"$f":"' Étape 2 – Nombre d’ETP touchés'!N67","v":""},{"$f":"' Étape 2 – Nombre d’ETP touchés'!O67","v":""},{"$f":"' Étape 2 – Nombre d’ETP touchés'!P67","v":""},{"$f":"' Étape 2 – Nombre d’ETP touchés'!Q67","v":""},{"$f":"' Étape 2 – Nombre d’ETP touchés'!R67","v":""},{"$f":"' Étape 2 – Nombre d’ETP touchés'!S67","v":""},{"$f":"' Étape 2 – Nombre d’ETP touchés'!T67","v":""},{"$f":"' Étape 2 – Nombre d’ETP touchés'!U67","v":""},{"$f":"' Étape 2 – Nombre d’ETP touchés'!V67","v":""},{"$f":"' Étape 2 – Nombre d’ETP touchés'!W67","v":""},"",{"$error":"#DIV/0!"},{"$error":"#DIV/0!"},{"$f":"' Étape 2 – Nombre d’ETP touchés'!X67","v":""},{"$error":"#DIV/0!"}]
[64,{"$f":"' Étape 2 – Nombre d’ETP touchés'!B68","v":""},{"$f":"' Étape 2 – Nombre d’ETP touchés'!C68","v":0},{"$f":"' Étape 2 – Nombre d’ETP touchés'!D68","v":{"$error":"#DIV/0!"}},{"$f":"' Étape 2 – Nombre d’ETP touchés'!E68","v":""},{"$f":"' Étape 2 – Nombre d’ETP touchés'!F68","v":""},{"$f":"' Étape 2 – Nombre d’ETP touchés'!G68","v":""},{"$f":"' Étape 2 – Nombre d’ETP touchés'!H68","v":""},{"$f":"' Étape 2 – Nombre d’ETP touchés'!I68","v":""},{"$f":"' Étape 2 – Nombre d’ETP touchés'!J68","v":""},{"$f":"' Étape 2 – Nombre d’ETP touchés'!K68","v":""},{"$f":"' Étape 2 – Nombre d’ETP touchés'!L68","v":""},{"$f":"' Étape 2 – Nombre d’ETP touchés'!M68","v":""},{"$f":"' Étape 2 – Nombre d’ETP touchés'!N68","v":""},{"$f":"' Étape 2 – Nombre d’ETP touchés'!O68","v":""},{"$f":"' Étape 2 – Nombre d’ETP touchés'!P68","v":""},{"$f":"' Étape 2 – Nombre d’ETP touchés'!Q68","v":""},{"$f":"' Étape 2 – Nombre d’ETP touchés'!R68","v":""},{"$f":"' Étape 2 – Nombre d’ETP touchés'!S68","v":""},{"$f":"' Étape 2 – Nombre d’ETP touchés'!T68","v":""},{"$f":"' Étape 2 – Nombre d’ETP touchés'!U68","v":""},{"$f":"' Étape 2 – Nombre d’ETP touchés'!V68","v":""},{"$f":"' Étape 2 – Nombre d’ETP touchés'!W68","v":""},"",{"$error":"#DIV/0!"},{"$error":"#DIV/0!"},{"$f":"' Étape 2 – Nombre d’ETP touchés'!X68","v":""},{"$error":"#DIV/0!"}]
[65,{"$f":"' Étape 2 – Nombre d’ETP touchés'!B69","v":""},{"$f":"' Étape 2 – Nombre d’ETP touchés'!C69","v":0},{"$f":"' Étape 2 – Nombre d’ETP touchés'!D69","v":{"$error":"#DIV/0!"}},{"$f":"' Étape 2 – Nombre d’ETP touchés'!E69","v":""},{"$f":"' Étape 2 – Nombre d’ETP touchés'!F69","v":""},{"$f":"' Étape 2 – Nombre d’ETP touchés'!G69","v":""},{"$f":"' Étape 2 – Nombre d’ETP touchés'!H69","v":""},{"$f":"' Étape 2 – Nombre d’ETP touchés'!I69","v":""},{"$f":"' Étape 2 – Nombre d’ETP touchés'!J69","v":""},{"$f":"' Étape 2 – Nombre d’ETP touchés'!K69","v":""},{"$f":"' Étape 2 – Nombre d’ETP touchés'!L69","v":""},{"$f":"' Étape 2 – Nombre d’ETP touchés'!M69","v":""},{"$f":"' Étape 2 – Nombre d’ETP touchés'!N69","v":""},{"$f":"' Étape 2 – Nombre d’ETP touchés'!O69","v":""},{"$f":"' Étape 2 – Nombre d’ETP touchés'!P69","v":""},{"$f":"' Étape 2 – Nombre d’ETP touchés'!Q69","v":""},{"$f":"' Étape 2 – Nombre d’ETP touchés'!R69","v":""},{"$f":"' Étape 2 – Nombre d’ETP touchés'!S69","v":""},{"$f":"' Étape 2 – Nombre d’ETP touchés'!T69","v":""},{"$f":"' Étape 2 – Nombre d’ETP touchés'!U69","v":""},{"$f":"' Étape 2 – Nombre d’ETP touchés'!V69","v":""},{"$f":"' Étape 2 – Nombre d’ETP touchés'!W69","v":""},"",{"$error":"#DIV/0!"},{"$error":"#DIV/0!"},{"$f":"' Étape 2 – Nombre d’ETP touchés'!X69","v":""},{"$f":"IF(AND(AA69=\"LOW\",D69<50),\"LOW\",\nIF(AND(AA69=\"LOW\",D69>=50),\"MED\",\nIF(AND(AA69=\"MED\",D69<50),\"MED\",\nIF(AND(AA69=\"MED\",D69>=50),\"HIGH\",\nIF(AND(AA69=\"HIGH\",D69<50),\"MED\",\nIF(AND(AA69=\"HIGH\",D69>=50),\"HIGH\",\nIF(AA69=\"Minimal Change for Employee\",\"N/A\",\n\"ERROR\")))))))","v":{"$error":"#DIV/0!"}}]
[{"$f":"ROW()-4","v":66},{"$f":"' Étape 2 – Nombre d’ETP touchés'!B70","v":""},{"$f":"' Étape 2 – Nombre d’ETP touchés'!C70","v":0},{"$f":"' Étape 2 – Nombre d’ETP touchés'!D70","v":{"$error":"#DIV/0!"}},{"$f":"' Étape 2 – Nombre d’ETP touchés'!E70","v":""},{"$f":"' Étape 2 – Nombre d’ETP touchés'!F70","v":""},{"$f":"' Étape 2 – Nombre d’ETP touchés'!G70","v":""},{"$f":"' Étape 2 – Nombre d’ETP touchés'!H70","v":""},{"$f":"' Étape 2 – Nombre d’ETP touchés'!I70","v":""},{"$f":"' Étape 2 – Nombre d’ETP touchés'!J70","v":""},{"$f":"' Étape 2 – Nombre d’ETP touchés'!K70","v":""},{"$f":"' Étape 2 – Nombre d’ETP touchés'!L70","v":""},{"$f":"' Étape 2 – Nombre d’ETP touchés'!M70","v":""},{"$f":"' Étape 2 – Nombre d’ETP touchés'!N70","v":""},{"$f":"' Étape 2 – Nombre d’ETP touchés'!O70","v":""},{"$f":"' Étape 2 – Nombre d’ETP touchés'!P70","v":""},{"$f":"' Étape 2 – Nombre d’ETP touchés'!Q70","v":""},{"$f":"' Étape 2 – Nombre d’ETP touchés'!R70","v":""},{"$f":"' Étape 2 – Nombre d’ETP touchés'!S70","v":""},{"$f":"' Étape 2 – Nombre d’ETP touchés'!T70","v":""},{"$f":"' Étape 2 – Nombre d’ETP touchés'!U70","v":""},{"$f":"' Étape 2 – Nombre d’ETP touchés'!V70","v":""},{"$f":"' Étape 2 – Nombre d’ETP touchés'!W70","v":""},{"$f":"IF(_xlfn.NUMBERVALUE(LEFT(B70,1))=0,\"\",_xlfn.NUMBERVALUE(LEFT(B70,1)))","v":""},{"$f":"IF(AB70=\"LOW\",1,\nIF(AB70=\"MED\",2,\nIF(AB70=\"HIGH\",3,\"N/A\")))","v":{"$error":"#DIV/0!"}},{"$error":"#DIV/0!"},{"$f":"' Étape 2 – Nombre d’ETP touchés'!X70","v":""},{"$error":"#DIV/0!"}]
[67,{"$f":"' Étape 2 – Nombre d’ETP touchés'!B71","v":""},{"$f":"' Étape 2 – Nombre d’ETP touchés'!C71","v":0},{"$f":"' Étape 2 – Nombre d’ETP touchés'!D71","v":{"$error":"#DIV/0!"}},{"$f":"' Étape 2 – Nombre d’ETP touchés'!E71","v":""},{"$f":"' Étape 2 – Nombre d’ETP touchés'!F71","v":""},{"$f":"' Étape 2 – Nombre d’ETP touchés'!G71","v":""},{"$f":"' Étape 2 – Nombre d’ETP touchés'!H71","v":""},{"$f":"' Étape 2 – Nombre d’ETP touchés'!I71","v":""},{"$f":"' Étape 2 – Nombre d’ETP touchés'!J71","v":""},{"$f":"' Étape 2 – Nombre d’ETP touchés'!K71","v":""},{"$f":"' Étape 2 – Nombre d’ETP touchés'!L71","v":""},{"$f":"' Étape 2 – Nombre d’ETP touchés'!M71","v":""},{"$f":"' Étape 2 – Nombre d’ETP touchés'!N71","v":""},{"$f":"' Étape 2 – Nombre d’ETP touchés'!O71","v":""},{"$f":"' Étape 2 – Nombre d’ETP touchés'!P71","v":""},{"$f":"' Étape 2 – Nombre d’ETP touchés'!Q71","v":""},{"$f":"' Étape 2 – Nombre d’ETP touchés'!R71","v":""},{"$f":"' Étape 2 – Nombre d’ETP touchés'!S71","v":""},{"$f":"' Étape 2 – Nombre d’ETP touchés'!T71","v":""},{"$f":"' Étape 2 – Nombre d’ETP touchés'!U71","v":""},{"$f":"' Étape 2 – Nombre d’ETP touchés'!V71","v":""},{"$f":"' Étape 2 – Nombre d’ETP touchés'!W71","v":""},"",{"$error":"#DIV/0!"},{"$error":"#DIV/0!"},{"$f":"' Étape 2 – Nombre d’ETP touchés'!X71","v":""},{"$error":"#DIV/0!"}]
[68,{"$f":"' Étape 2 – Nombre d’ETP touchés'!B72","v":""},{"$f":"' Étape 2 – Nombre d’ETP touchés'!C72","v":0},{"$f":"' Étape 2 – Nombre d’ETP touchés'!D72","v":{"$error":"#DIV/0!"}},{"$f":"' Étape 2 – Nombre d’ETP touchés'!E72","v":""},{"$f":"' Étape 2 – Nombre d’ETP touchés'!F72","v":""},{"$f":"' Étape 2 – Nombre d’ETP touchés'!G72","v":""},{"$f":"' Étape 2 – Nombre d’ETP touchés'!H72","v":""},{"$f":"' Étape 2 – Nombre d’ETP touchés'!I72","v":""},{"$f":"' Étape 2 – Nombre d’ETP touchés'!J72","v":""},{"$f":"' Étape 2 – Nombre d’ETP touchés'!K72","v":""},{"$f":"' Étape 2 – Nombre d’ETP touchés'!L72","v":""},{"$f":"' Étape 2 – Nombre d’ETP touchés'!M72","v":""},{"$f":"' Étape 2 – Nombre d’ETP touchés'!N72","v":""},{"$f":"' Étape 2 – Nombre d’ETP touchés'!O72","v":""},{"$f":"' Étape 2 – Nombre d’ETP touchés'!P72","v":""},{"$f":"' Étape 2 – Nombre d’ETP touchés'!Q72","v":""},{"$f":"' Étape 2 – Nombre d’ETP touchés'!R72","v":""},{"$f":"' Étape 2 – Nombre d’ETP touchés'!S72","v":""},{"$f":"' Étape 2 – Nombre d’ETP touchés'!T72","v":""},{"$f":"' Étape 2 – Nombre d’ETP touchés'!U72","v":""},{"$f":"' Étape 2 – Nombre d’ETP touchés'!V72","v":""},{"$f":"' Étape 2 – Nombre d’ETP touchés'!W72","v":""},"",{"$error":"#DIV/0!"},{"$error":"#DIV/0!"},{"$f":"' Étape 2 – Nombre d’ETP touchés'!X72","v":""},{"$error":"#DIV/0!"}]
[69,{"$f":"' Étape 2 – Nombre d’ETP touchés'!B73","v":""},{"$f":"' Étape 2 – Nombre d’ETP touchés'!C73","v":0},{"$f":"' Étape 2 – Nombre d’ETP touchés'!D73","v":{"$error":"#DIV/0!"}},{"$f":"' Étape 2 – Nombre d’ETP touchés'!E73","v":""},{"$f":"' Étape 2 – Nombre d’ETP touchés'!F73","v":""},{"$f":"' Étape 2 – Nombre d’ETP touchés'!G73","v":""},{"$f":"' Étape 2 – Nombre d’ETP touchés'!H73","v":""},{"$f":"' Étape 2 – Nombre d’ETP touchés'!I73","v":""},{"$f":"' Étape 2 – Nombre d’ETP touchés'!J73","v":""},{"$f":"' Étape 2 – Nombre d’ETP touchés'!K73","v":""},{"$f":"' Étape 2 – Nombre d’ETP touchés'!L73","v":""},{"$f":"' Étape 2 – Nombre d’ETP touchés'!M73","v":""},{"$f":"' Étape 2 – Nombre d’ETP touchés'!N73","v":""},{"$f":"' Étape 2 – Nombre d’ETP touchés'!O73","v":""},{"$f":"' Étape 2 – Nombre d’ETP touchés'!P73","v":""},{"$f":"' Étape 2 – Nombre d’ETP touchés'!Q73","v":""},{"$f":"' Étape 2 – Nombre d’ETP touchés'!R73","v":""},{"$f":"' Étape 2 – Nombre d’ETP touchés'!S73","v":""},{"$f":"' Étape 2 – Nombre d’ETP touchés'!T73","v":""},{"$f":"' Étape 2 – Nombre d’ETP touchés'!U73","v":""},{"$f":"' Étape 2 – Nombre d’ETP touchés'!V73","v":""},{"$f":"' Étape 2 – Nombre d’ETP touchés'!W73","v":""},"",{"$error":"#DIV/0!"},{"$error":"#DIV/0!"},{"$f":"' Étape 2 – Nombre d’ETP touchés'!X73","v":""},{"$error":"#DIV/0!"}]
[70,{"$f":"' Étape 2 – Nombre d’ETP touchés'!B74","v":""},{"$f":"' Étape 2 – Nombre d’ETP touchés'!C74","v":0},{"$f":"' Étape 2 – Nombre d’ETP touchés'!D74","v":{"$error":"#DIV/0!"}},{"$f":"' Étape 2 – Nombre d’ETP touchés'!E74","v":""},{"$f":"' Étape 2 – Nombre d’ETP touchés'!F74","v":""},{"$f":"' Étape 2 – Nombre d’ETP touchés'!G74","v":""},{"$f":"' Étape 2 – Nombre d’ETP touchés'!H74","v":""},{"$f":"' Étape 2 – Nombre d’ETP touchés'!I74","v":""},{"$f":"' Étape 2 – Nombre d’ETP touchés'!J74","v":""},{"$f":"' Étape 2 – Nombre d’ETP touchés'!K74","v":""},{"$f":"' Étape 2 – Nombre d’ETP touchés'!L74","v":""},{"$f":"' Étape 2 – Nombre d’ETP touchés'!M74","v":""},{"$f":"' Étape 2 – Nombre d’ETP touchés'!N74","v":""},{"$f":"' Étape 2 – Nombre d’ETP touchés'!O74","v":""},{"$f":"' Étape 2 – Nombre d’ETP touchés'!P74","v":""},{"$f":"' Étape 2 – Nombre d’ETP touchés'!Q74","v":""},{"$f":"' Étape 2 – Nombre d’ETP touchés'!R74","v":""},{"$f":"' Étape 2 – Nombre d’ETP touchés'!S74","v":""},{"$f":"' Étape 2 – Nombre d’ETP touchés'!T74","v":""},{"$f":"' Étape 2 – Nombre d’ETP touchés'!U74","v":""},{"$f":"' Étape 2 – Nombre d’ETP touchés'!V74","v":""},{"$f":"' Étape 2 – Nombre d’ETP touchés'!W74","v":""},"",{"$error":"#DIV/0!"},{"$error":"#DIV/0!"},{"$f":"' Étape 2 – Nombre d’ETP touchés'!X74","v":""},{"$error":"#DIV/0!"}]
[71,{"$f":"' Étape 2 – Nombre d’ETP touchés'!B75","v":""},{"$f":"' Étape 2 – Nombre d’ETP touchés'!C75","v":0},{"$f":"' Étape 2 – Nombre d’ETP touchés'!D75","v":{"$error":"#DIV/0!"}},{"$f":"' Étape 2 – Nombre d’ETP touchés'!E75","v":""},{"$f":"' Étape 2 – Nombre d’ETP touchés'!F75","v":""},{"$f":"' Étape 2 – Nombre d’ETP touchés'!G75","v":""},{"$f":"' Étape 2 – Nombre d’ETP touchés'!H75","v":""},{"$f":"' Étape 2 – Nombre d’ETP touchés'!I75","v":""},{"$f":"' Étape 2 – Nombre d’ETP touchés'!J75","v":""},{"$f":"' Étape 2 – Nombre d’ETP touchés'!K75","v":""},{"$f":"' Étape 2 – Nombre d’ETP touchés'!L75","v":""},{"$f":"' Étape 2 – Nombre d’ETP touchés'!M75","v":""},{"$f":"' Étape 2 – Nombre d’ETP touchés'!N75","v":""},{"$f":"' Étape 2 – Nombre d’ETP touchés'!O75","v":""},{"$f":"' Étape 2 – Nombre d’ETP touchés'!P75","v":""},{"$f":"' Étape 2 – Nombre d’ETP touchés'!Q75","v":""},{"$f":"' Étape 2 – Nombre d’ETP touchés'!R75","v":""},{"$f":"' Étape 2 – Nombre d’ETP touchés'!S75","v":""},{"$f":"' Étape 2 – Nombre d’ETP touchés'!T75","v":""},{"$f":"' Étape 2 – Nombre d’ETP touchés'!U75","v":""},{"$f":"' Étape 2 – Nombre d’ETP touchés'!V75","v":""},{"$f":"' Étape 2 – Nombre d’ETP touchés'!W75","v":""},"",{"$error":"#DIV/0!"},{"$error":"#DIV/0!"},{"$f":"' Étape 2 – Nombre d’ETP touchés'!X75","v":""},{"$error":"#DIV/0!"}]
[72,{"$f":"' Étape 2 – Nombre d’ETP touchés'!B76","v":""},{"$f":"' Étape 2 – Nombre d’ETP touchés'!C76","v":0},{"$f":"' Étape 2 – Nombre d’ETP touchés'!D76","v":{"$error":"#DIV/0!"}},{"$f":"' Étape 2 – Nombre d’ETP touchés'!E76","v":""},{"$f":"' Étape 2 – Nombre d’ETP touchés'!F76","v":""},{"$f":"' Étape 2 – Nombre d’ETP touchés'!G76","v":""},{"$f":"' Étape 2 – Nombre d’ETP touchés'!H76","v":""},{"$f":"' Étape 2 – Nombre d’ETP touchés'!I76","v":""},{"$f":"' Étape 2 – Nombre d’ETP touchés'!J76","v":""},{"$f":"' Étape 2 – Nombre d’ETP touchés'!K76","v":""},{"$f":"' Étape 2 – Nombre d’ETP touchés'!L76","v":""},{"$f":"' Étape 2 – Nombre d’ETP touchés'!M76","v":""},{"$f":"' Étape 2 – Nombre d’ETP touchés'!N76","v":""},{"$f":"' Étape 2 – Nombre d’ETP touchés'!O76","v":""},{"$f":"' Étape 2 – Nombre d’ETP touchés'!P76","v":""},{"$f":"' Étape 2 – Nombre d’ETP touchés'!Q76","v":""},{"$f":"' Étape 2 – Nombre d’ETP touchés'!R76","v":""},{"$f":"' Étape 2 – Nombre d’ETP touchés'!S76","v":""},{"$f":"' Étape 2 – Nombre d’ETP touchés'!T76","v":""},{"$f":"' Étape 2 – Nombre d’ETP touchés'!U76","v":""},{"$f":"' Étape 2 – Nombre d’ETP touchés'!V76","v":""},{"$f":"' Étape 2 – Nombre d’ETP touchés'!W76","v":""},"",{"$error":"#DIV/0!"},{"$error":"#DIV/0!"},{"$f":"' Étape 2 – Nombre d’ETP touchés'!X76","v":""},{"$error":"#DIV/0!"}]
[73,{"$f":"' Étape 2 – Nombre d’ETP touchés'!B77","v":""},{"$f":"' Étape 2 – Nombre d’ETP touchés'!C77","v":0},{"$f":"' Étape 2 – Nombre d’ETP touchés'!D77","v":{"$error":"#DIV/0!"}},{"$f":"' Étape 2 – Nombre d’ETP touchés'!E77","v":""},{"$f":"' Étape 2 – Nombre d’ETP touchés'!F77","v":""},{"$f":"' Étape 2 – Nombre d’ETP touchés'!G77","v":""},{"$f":"' Étape 2 – Nombre d’ETP touchés'!H77","v":""},{"$f":"' Étape 2 – Nombre d’ETP touchés'!I77","v":""},{"$f":"' Étape 2 – Nombre d’ETP touchés'!J77","v":""},{"$f":"' Étape 2 – Nombre d’ETP touchés'!K77","v":""},{"$f":"' Étape 2 – Nombre d’ETP touchés'!L77","v":""},{"$f":"' Étape 2 – Nombre d’ETP touchés'!M77","v":""},{"$f":"' Étape 2 – Nombre d’ETP touchés'!N77","v":""},{"$f":"' Étape 2 – Nombre d’ETP touchés'!O77","v":""},{"$f":"' Étape 2 – Nombre d’ETP touchés'!P77","v":""},{"$f":"' Étape 2 – Nombre d’ETP touchés'!Q77","v":""},{"$f":"' Étape 2 – Nombre d’ETP touchés'!R77","v":""},{"$f":"' Étape 2 – Nombre d’ETP touchés'!S77","v":""},{"$f":"' Étape 2 – Nombre d’ETP touchés'!T77","v":""},{"$f":"' Étape 2 – Nombre d’ETP touchés'!U77","v":""},{"$f":"' Étape 2 – Nombre d’ETP touchés'!V77","v":""},{"$f":"' Étape 2 – Nombre d’ETP touchés'!W77","v":""},"",{"$error":"#DIV/0!"},{"$error":"#DIV/0!"},{"$f":"' Étape 2 – Nombre d’ETP touchés'!X77","v":""},{"$error":"#DIV/0!"}]
[74,{"$f":"' Étape 2 – Nombre d’ETP touchés'!B78","v":""},{"$f":"' Étape 2 – Nombre d’ETP touchés'!C78","v":0},{"$f":"' Étape 2 – Nombre d’ETP touchés'!D78","v":{"$error":"#DIV/0!"}},{"$f":"' Étape 2 – Nombre d’ETP touchés'!E78","v":""},{"$f":"' Étape 2 – Nombre d’ETP touchés'!F78","v":""},{"$f":"' Étape 2 – Nombre d’ETP touchés'!G78","v":""},{"$f":"' Étape 2 – Nombre d’ETP touchés'!H78","v":""},{"$f":"' Étape 2 – Nombre d’ETP touchés'!I78","v":""},{"$f":"' Étape 2 – Nombre d’ETP touchés'!J78","v":""},{"$f":"' Étape 2 – Nombre d’ETP touchés'!K78","v":""},{"$f":"' Étape 2 – Nombre d’ETP touchés'!L78","v":""},{"$f":"' Étape 2 – Nombre d’ETP touchés'!M78","v":""},{"$f":"' Étape 2 – Nombre d’ETP touchés'!N78","v":""},{"$f":"' Étape 2 – Nombre d’ETP touchés'!O78","v":""},{"$f":"' Étape 2 – Nombre d’ETP touchés'!P78","v":""},{"$f":"' Étape 2 – Nombre d’ETP touchés'!Q78","v":""},{"$f":"' Étape 2 – Nombre d’ETP touchés'!R78","v":""},{"$f":"' Étape 2 – Nombre d’ETP touchés'!S78","v":""},{"$f":"' Étape 2 – Nombre d’ETP touchés'!T78","v":""},{"$f":"' Étape 2 – Nombre d’ETP touchés'!U78","v":""},{"$f":"' Étape 2 – Nombre d’ETP touchés'!V78","v":""},{"$f":"' Étape 2 – Nombre d’ETP touchés'!W78","v":""},"",{"$error":"#DIV/0!"},{"$error":"#DIV/0!"},{"$f":"' Étape 2 – Nombre d’ETP touchés'!X78","v":""},{"$error":"#DIV/0!"}]
[75,{"$f":"' Étape 2 – Nombre d’ETP touchés'!B79","v":""},{"$f":"' Étape 2 – Nombre d’ETP touchés'!C79","v":0},{"$f":"' Étape 2 – Nombre d’ETP touchés'!D79","v":{"$error":"#DIV/0!"}},{"$f":"' Étape 2 – Nombre d’ETP touchés'!E79","v":""},{"$f":"' Étape 2 – Nombre d’ETP touchés'!F79","v":""},{"$f":"' Étape 2 – Nombre d’ETP touchés'!G79","v":""},{"$f":"' Étape 2 – Nombre d’ETP touchés'!H79","v":""},{"$f":"' Étape 2 – Nombre d’ETP touchés'!I79","v":""},{"$f":"' Étape 2 – Nombre d’ETP touchés'!J79","v":""},{"$f":"' Étape 2 – Nombre d’ETP touchés'!K79","v":""},{"$f":"' Étape 2 – Nombre d’ETP touchés'!L79","v":""},{"$f":"' Étape 2 – Nombre d’ETP touchés'!M79","v":""},{"$f":"' Étape 2 – Nombre d’ETP touchés'!N79","v":""},{"$f":"' Étape 2 – Nombre d’ETP touchés'!O79","v":""},{"$f":"' Étape 2 – Nombre d’ETP touchés'!P79","v":""},{"$f":"' Étape 2 – Nombre d’ETP touchés'!Q79","v":""},{"$f":"' Étape 2 – Nombre d’ETP touchés'!R79","v":""},{"$f":"' Étape 2 – Nombre d’ETP touchés'!S79","v":""},{"$f":"' Étape 2 – Nombre d’ETP touchés'!T79","v":""},{"$f":"' Étape 2 – Nombre d’ETP touchés'!U79","v":""},{"$f":"' Étape 2 – Nombre d’ETP touchés'!V79","v":""},{"$f":"' Étape 2 – Nombre d’ETP touchés'!W79","v":""},"",{"$error":"#DIV/0!"},{"$error":"#DIV/0!"},{"$f":"' Étape 2 – Nombre d’ETP touchés'!X79","v":""},{"$error":"#DIV/0!"}]
[76,{"$f":"' Étape 2 – Nombre d’ETP touchés'!B80","v":""},{"$f":"' Étape 2 – Nombre d’ETP touchés'!C80","v":0},{"$f":"' Étape 2 – Nombre d’ETP touchés'!D80","v":{"$error":"#DIV/0!"}},{"$f":"' Étape 2 – Nombre d’ETP touchés'!E80","v":""},{"$f":"' Étape 2 – Nombre d’ETP touchés'!F80","v":""},{"$f":"' Étape 2 – Nombre d’ETP touchés'!G80","v":""},{"$f":"' Étape 2 – Nombre d’ETP touchés'!H80","v":""},{"$f":"' Étape 2 – Nombre d’ETP touchés'!I80","v":""},{"$f":"' Étape 2 – Nombre d’ETP touchés'!J80","v":""},{"$f":"' Étape 2 – Nombre d’ETP touchés'!K80","v":""},{"$f":"' Étape 2 – Nombre d’ETP touchés'!L80","v":""},{"$f":"' Étape 2 – Nombre d’ETP touchés'!M80","v":""},{"$f":"' Étape 2 – Nombre d’ETP touchés'!N80","v":""},{"$f":"' Étape 2 – Nombre d’ETP touchés'!O80","v":""},{"$f":"' Étape 2 – Nombre d’ETP touchés'!P80","v":""},{"$f":"' Étape 2 – Nombre d’ETP touchés'!Q80","v":""},{"$f":"' Étape 2 – Nombre d’ETP touchés'!R80","v":""},{"$f":"' Étape 2 – Nombre d’ETP touchés'!S80","v":""},{"$f":"' Étape 2 – Nombre d’ETP touchés'!T80","v":""},{"$f":"' Étape 2 – Nombre d’ETP touchés'!U80","v":""},{"$f":"' Étape 2 – Nombre d’ETP touchés'!V80","v":""},{"$f":"' Étape 2 – Nombre d’ETP touchés'!W80","v":""},"",{"$error":"#DIV/0!"},{"$error":"#DIV/0!"},{"$f":"' Étape 2 – Nombre d’ETP touchés'!X80","v":""},{"$error":"#DIV/0!"}]
[77,{"$f":"' Étape 2 – Nombre d’ETP touchés'!B81","v":""},{"$f":"' Étape 2 – Nombre d’ETP touchés'!C81","v":0},{"$f":"' Étape 2 – Nombre d’ETP touchés'!D81","v":{"$error":"#DIV/0!"}},{"$f":"' Étape 2 – Nombre d’ETP touchés'!E81","v":""},{"$f":"' Étape 2 – Nombre d’ETP touchés'!F81","v":""},{"$f":"' Étape 2 – Nombre d’ETP touchés'!G81","v":""},{"$f":"' Étape 2 – Nombre d’ETP touchés'!H81","v":""},{"$f":"' Étape 2 – Nombre d’ETP touchés'!I81","v":""},{"$f":"' Étape 2 – Nombre d’ETP touchés'!J81","v":""},{"$f":"' Étape 2 – Nombre d’ETP touchés'!K81","v":""},{"$f":"' Étape 2 – Nombre d’ETP touchés'!L81","v":""},{"$f":"' Étape 2 – Nombre d’ETP touchés'!M81","v":""},{"$f":"' Étape 2 – Nombre d’ETP touchés'!N81","v":""},{"$f":"' Étape 2 – Nombre d’ETP touchés'!O81","v":""},{"$f":"' Étape 2 – Nombre d’ETP touchés'!P81","v":""},{"$f":"' Étape 2 – Nombre d’ETP touchés'!Q81","v":""},{"$f":"' Étape 2 – Nombre d’ETP touchés'!R81","v":""},{"$f":"' Étape 2 – Nombre d’ETP touchés'!S81","v":""},{"$f":"' Étape 2 – Nombre d’ETP touchés'!T81","v":""},{"$f":"' Étape 2 – Nombre d’ETP touchés'!U81","v":""},{"$f":"' Étape 2 – Nombre d’ETP touchés'!V81","v":""},{"$f":"' Étape 2 – Nombre d’ETP touchés'!W81","v":""},"",{"$error":"#DIV/0!"},{"$error":"#DIV/0!"},{"$f":"' Étape 2 – Nombre d’ETP touchés'!X81","v":""},{"$error":"#DIV/0!"}]
[78,{"$f":"' Étape 2 – Nombre d’ETP touchés'!B82","v":""},{"$f":"' Étape 2 – Nombre d’ETP touchés'!C82","v":0},{"$f":"' Étape 2 – Nombre d’ETP touchés'!D82","v":{"$error":"#DIV/0!"}},{"$f":"' Étape 2 – Nombre d’ETP touchés'!E82","v":""},{"$f":"' Étape 2 – Nombre d’ETP touchés'!F82","v":""},{"$f":"' Étape 2 – Nombre d’ETP touchés'!G82","v":""},{"$f":"' Étape 2 – Nombre d’ETP touchés'!H82","v":""},{"$f":"' Étape 2 – Nombre d’ETP touchés'!I82","v":""},{"$f":"' Étape 2 – Nombre d’ETP touchés'!J82","v":""},{"$f":"' Étape 2 – Nombre d’ETP touchés'!K82","v":""},{"$f":"' Étape 2 – Nombre d’ETP touchés'!L82","v":""},{"$f":"' Étape 2 – Nombre d’ETP touchés'!M82","v":""},{"$f":"' Étape 2 – Nombre d’ETP touchés'!N82","v":""},{"$f":"' Étape 2 – Nombre d’ETP touchés'!O82","v":""},{"$f":"' Étape 2 – Nombre d’ETP touchés'!P82","v":""},{"$f":"' Étape 2 – Nombre d’ETP touchés'!Q82","v":""},{"$f":"' Étape 2 – Nombre d’ETP touchés'!R82","v":""},{"$f":"' Étape 2 – Nombre d’ETP touchés'!S82","v":""},{"$f":"' Étape 2 – Nombre d’ETP touchés'!T82","v":""},{"$f":"' Étape 2 – Nombre d’ETP touchés'!U82","v":""},{"$f":"' Étape 2 – Nombre d’ETP touchés'!V82","v":""},{"$f":"' Étape 2 – Nombre d’ETP touchés'!W82","v":""},"",{"$error":"#DIV/0!"},{"$error":"#DIV/0!"},{"$f":"' Étape 2 – Nombre d’ETP touchés'!X82","v":""},{"$error":"#DIV/0!"}]
[79,{"$f":"' Étape 2 – Nombre d’ETP touchés'!B83","v":""},{"$f":"' Étape 2 – Nombre d’ETP touchés'!C83","v":0},{"$f":"' Étape 2 – Nombre d’ETP touchés'!D83","v":{"$error":"#DIV/0!"}},{"$f":"' Étape 2 – Nombre d’ETP touchés'!E83","v":""},{"$f":"' Étape 2 – Nombre d’ETP touchés'!F83","v":""},{"$f":"' Étape 2 – Nombre d’ETP touchés'!G83","v":""},{"$f":"' Étape 2 – Nombre d’ETP touchés'!H83","v":""},{"$f":"' Étape 2 – Nombre d’ETP touchés'!I83","v":""},{"$f":"' Étape 2 – Nombre d’ETP touchés'!J83","v":""},{"$f":"' Étape 2 – Nombre d’ETP touchés'!K83","v":""},{"$f":"' Étape 2 – Nombre d’ETP touchés'!L83","v":""},{"$f":"' Étape 2 – Nombre d’ETP touchés'!M83","v":""},{"$f":"' Étape 2 – Nombre d’ETP touchés'!N83","v":""},{"$f":"' Étape 2 – Nombre d’ETP touchés'!O83","v":""},{"$f":"' Étape 2 – Nombre d’ETP touchés'!P83","v":""},{"$f":"' Étape 2 – Nombre d’ETP touchés'!Q83","v":""},{"$f":"' Étape 2 – Nombre d’ETP touchés'!R83","v":""},{"$f":"' Étape 2 – Nombre d’ETP touchés'!S83","v":""},{"$f":"' Étape 2 – Nombre d’ETP touchés'!T83","v":""},{"$f":"' Étape 2 – Nombre d’ETP touchés'!U83","v":""},{"$f":"' Étape 2 – Nombre d’ETP touchés'!V83","v":""},{"$f":"' Étape 2 – Nombre d’ETP touchés'!W83","v":""},"",{"$error":"#DIV/0!"},{"$error":"#DIV/0!"},{"$f":"' Étape 2 – Nombre d’ETP touchés'!X83","v":""},{"$error":"#DIV/0!"}]
[80,{"$f":"' Étape 2 – Nombre d’ETP touchés'!B84","v":""},{"$f":"' Étape 2 – Nombre d’ETP touchés'!C84","v":0},{"$f":"' Étape 2 – Nombre d’ETP touchés'!D84","v":{"$error":"#DIV/0!"}},{"$f":"' Étape 2 – Nombre d’ETP touchés'!E84","v":""},{"$f":"' Étape 2 – Nombre d’ETP touchés'!F84","v":""},{"$f":"' Étape 2 – Nombre d’ETP touchés'!G84","v":""},{"$f":"' Étape 2 – Nombre d’ETP touchés'!H84","v":""},{"$f":"' Étape 2 – Nombre d’ETP touchés'!I84","v":""},{"$f":"' Étape 2 – Nombre d’ETP touchés'!J84","v":""},{"$f":"' Étape 2 – Nombre d’ETP touchés'!K84","v":""},{"$f":"' Étape 2 – Nombre d’ETP touchés'!L84","v":""},{"$f":"' Étape 2 – Nombre d’ETP touchés'!M84","v":""},{"$f":"' Étape 2 – Nombre d’ETP touchés'!N84","v":""},{"$f":"' Étape 2 – Nombre d’ETP touchés'!O84","v":""},{"$f":"' Étape 2 – Nombre d’ETP touchés'!P84","v":""},{"$f":"' Étape 2 – Nombre d’ETP touchés'!Q84","v":""},{"$f":"' Étape 2 – Nombre d’ETP touchés'!R84","v":""},{"$f":"' Étape 2 – Nombre d’ETP touchés'!S84","v":""},{"$f":"' Étape 2 – Nombre d’ETP touchés'!T84","v":""},{"$f":"' Étape 2 – Nombre d’ETP touchés'!U84","v":""},{"$f":"' Étape 2 – Nombre d’ETP touchés'!V84","v":""},{"$f":"' Étape 2 – Nombre d’ETP touchés'!W84","v":""},"",{"$error":"#DIV/0!"},{"$error":"#DIV/0!"},{"$f":"' Étape 2 – Nombre d’ETP touchés'!X84","v":""},{"$error":"#DIV/0!"}]
[81,{"$f":"' Étape 2 – Nombre d’ETP touchés'!B85","v":""},{"$f":"' Étape 2 – Nombre d’ETP touchés'!C85","v":0},{"$f":"' Étape 2 – Nombre d’ETP touchés'!D85","v":{"$error":"#DIV/0!"}},{"$f":"' Étape 2 – Nombre d’ETP touchés'!E85","v":""},{"$f":"' Étape 2 – Nombre d’ETP touchés'!F85","v":""},{"$f":"' Étape 2 – Nombre d’ETP touchés'!G85","v":""},{"$f":"' Étape 2 – Nombre d’ETP touchés'!H85","v":""},{"$f":"' Étape 2 – Nombre d’ETP touchés'!I85","v":""},{"$f":"' Étape 2 – Nombre d’ETP touchés'!J85","v":""},{"$f":"' Étape 2 – Nombre d’ETP touchés'!K85","v":""},{"$f":"' Étape 2 – Nombre d’ETP touchés'!L85","v":""},{"$f":"' Étape 2 – Nombre d’ETP touchés'!M85","v":""},{"$f":"' Étape 2 – Nombre d’ETP touchés'!N85","v":""},{"$f":"' Étape 2 – Nombre d’ETP touchés'!O85","v":""},{"$f":"' Étape 2 – Nombre d’ETP touchés'!P85","v":""},{"$f":"' Étape 2 – Nombre d’ETP touchés'!Q85","v":""},{"$f":"' Étape 2 – Nombre d’ETP touchés'!R85","v":""},{"$f":"' Étape 2 – Nombre d’ETP touchés'!S85","v":""},{"$f":"' Étape 2 – Nombre d’ETP touchés'!T85","v":""},{"$f":"' Étape 2 – Nombre d’ETP touchés'!U85","v":""},{"$f":"' Étape 2 – Nombre d’ETP touchés'!V85","v":""},{"$f":"' Étape 2 – Nombre d’ETP touchés'!W85","v":""},"",{"$error":"#DIV/0!"},{"$error":"#DIV/0!"},{"$f":"' Étape 2 – Nombre d’ETP touchés'!X85","v":""},{"$error":"#DIV/0!"}]
[82,{"$f":"' Étape 2 – Nombre d’ETP touchés'!B86","v":""},{"$f":"' Étape 2 – Nombre d’ETP touchés'!C86","v":0},{"$f":"' Étape 2 – Nombre d’ETP touchés'!D86","v":{"$error":"#DIV/0!"}},{"$f":"' Étape 2 – Nombre d’ETP touchés'!E86","v":""},{"$f":"' Étape 2 – Nombre d’ETP touchés'!F86","v":""},{"$f":"' Étape 2 – Nombre d’ETP touchés'!G86","v":""},{"$f":"' Étape 2 – Nombre d’ETP touchés'!H86","v":""},{"$f":"' Étape 2 – Nombre d’ETP touchés'!I86","v":""},{"$f":"' Étape 2 – Nombre d’ETP touchés'!J86","v":""},{"$f":"' Étape 2 – Nombre d’ETP touchés'!K86","v":""},{"$f":"' Étape 2 – Nombre d’ETP touchés'!L86","v":""},{"$f":"' Étape 2 – Nombre d’ETP touchés'!M86","v":""},{"$f":"' Étape 2 – Nombre d’ETP touchés'!N86","v":""},{"$f":"' Étape 2 – Nombre d’ETP touchés'!O86","v":""},{"$f":"' Étape 2 – Nombre d’ETP touchés'!P86","v":""},{"$f":"' Étape 2 – Nombre d’ETP touchés'!Q86","v":""},{"$f":"' Étape 2 – Nombre d’ETP touchés'!R86","v":""},{"$f":"' Étape 2 – Nombre d’ETP touchés'!S86","v":""},{"$f":"' Étape 2 – Nombre d’ETP touchés'!T86","v":""},{"$f":"' Étape 2 – Nombre d’ETP touchés'!U86","v":""},{"$f":"' Étape 2 – Nombre d’ETP touchés'!V86","v":""},{"$f":"' Étape 2 – Nombre d’ETP touchés'!W86","v":""},"",{"$error":"#DIV/0!"},{"$error":"#DIV/0!"},{"$f":"' Étape 2 – Nombre d’ETP touchés'!X86","v":""},{"$error":"#DIV/0!"}]
[83,{"$f":"' Étape 2 – Nombre d’ETP touchés'!B87","v":""},{"$f":"' Étape 2 – Nombre d’ETP touchés'!C87","v":0},{"$f":"' Étape 2 – Nombre d’ETP touchés'!D87","v":{"$error":"#DIV/0!"}},{"$f":"' Étape 2 – Nombre d’ETP touchés'!E87","v":""},{"$f":"' Étape 2 – Nombre d’ETP touchés'!F87","v":""},{"$f":"' Étape 2 – Nombre d’ETP touchés'!G87","v":""},{"$f":"' Étape 2 – Nombre d’ETP touchés'!H87","v":""},{"$f":"' Étape 2 – Nombre d’ETP touchés'!I87","v":""},{"$f":"' Étape 2 – Nombre d’ETP touchés'!J87","v":""},{"$f":"' Étape 2 – Nombre d’ETP touchés'!K87","v":""},{"$f":"' Étape 2 – Nombre d’ETP touchés'!L87","v":""},{"$f":"' Étape 2 – Nombre d’ETP touchés'!M87","v":""},{"$f":"' Étape 2 – Nombre d’ETP touchés'!N87","v":""},{"$f":"' Étape 2 – Nombre d’ETP touchés'!O87","v":""},{"$f":"' Étape 2 – Nombre d’ETP touchés'!P87","v":""},{"$f":"' Étape 2 – Nombre d’ETP touchés'!Q87","v":""},{"$f":"' Étape 2 – Nombre d’ETP touchés'!R87","v":""},{"$f":"' Étape 2 – Nombre d’ETP touchés'!S87","v":""},{"$f":"' Étape 2 – Nombre d’ETP touchés'!T87","v":""},{"$f":"' Étape 2 – Nombre d’ETP touchés'!U87","v":""},{"$f":"' Étape 2 – Nombre d’ETP touchés'!V87","v":""},{"$f":"' Étape 2 – Nombre d’ETP touchés'!W87","v":""},"",{"$error":"#DIV/0!"},{"$error":"#DIV/0!"},{"$f":"' Étape 2 – Nombre d’ETP touchés'!X87","v":""},{"$error":"#DIV/0!"}]
[84,{"$f":"' Étape 2 – Nombre d’ETP touchés'!B88","v":""},{"$f":"' Étape 2 – Nombre d’ETP touchés'!C88","v":0},{"$f":"' Étape 2 – Nombre d’ETP touchés'!D88","v":{"$error":"#DIV/0!"}},{"$f":"' Étape 2 – Nombre d’ETP touchés'!E88","v":""},{"$f":"' Étape 2 – Nombre d’ETP touchés'!F88","v":""},{"$f":"' Étape 2 – Nombre d’ETP touchés'!G88","v":""},{"$f":"' Étape 2 – Nombre d’ETP touchés'!H88","v":""},{"$f":"' Étape 2 – Nombre d’ETP touchés'!I88","v":""},{"$f":"' Étape 2 – Nombre d’ETP touchés'!J88","v":""},{"$f":"' Étape 2 – Nombre d’ETP touchés'!K88","v":""},{"$f":"' Étape 2 – Nombre d’ETP touchés'!L88","v":""},{"$f":"' Étape 2 – Nombre d’ETP touchés'!M88","v":""},{"$f":"' Étape 2 – Nombre d’ETP touchés'!N88","v":""},{"$f":"' Étape 2 – Nombre d’ETP touchés'!O88","v":""},{"$f":"' Étape 2 – Nombre d’ETP touchés'!P88","v":""},{"$f":"' Étape 2 – Nombre d’ETP touchés'!Q88","v":""},{"$f":"' Étape 2 – Nombre d’ETP touchés'!R88","v":""},{"$f":"' Étape 2 – Nombre d’ETP touchés'!S88","v":""},{"$f":"' Étape 2 – Nombre d’ETP touchés'!T88","v":""},{"$f":"' Étape 2 – Nombre d’ETP touchés'!U88","v":""},{"$f":"' Étape 2 – Nombre d’ETP touchés'!V88","v":""},{"$f":"' Étape 2 – Nombre d’ETP touchés'!W88","v":""},"",{"$error":"#DIV/0!"},{"$error":"#DIV/0!"},{"$f":"' Étape 2 – Nombre d’ETP touchés'!X88","v":""},{"$error":"#DIV/0!"}]
[85,{"$f":"' Étape 2 – Nombre d’ETP touchés'!B89","v":""},{"$f":"' Étape 2 – Nombre d’ETP touchés'!C89","v":0},{"$f":"' Étape 2 – Nombre d’ETP touchés'!D89","v":{"$error":"#DIV/0!"}},{"$f":"' Étape 2 – Nombre d’ETP touchés'!E89","v":""},{"$f":"' Étape 2 – Nombre d’ETP touchés'!F89","v":""},{"$f":"' Étape 2 – Nombre d’ETP touchés'!G89","v":""},{"$f":"' Étape 2 – Nombre d’ETP touchés'!H89","v":""},{"$f":"' Étape 2 – Nombre d’ETP touchés'!I89","v":""},{"$f":"' Étape 2 – Nombre d’ETP touchés'!J89","v":""},{"$f":"' Étape 2 – Nombre d’ETP touchés'!K89","v":""},{"$f":"' Étape 2 – Nombre d’ETP touchés'!L89","v":""},{"$f":"' Étape 2 – Nombre d’ETP touchés'!M89","v":""},{"$f":"' Étape 2 – Nombre d’ETP touchés'!N89","v":""},{"$f":"' Étape 2 – Nombre d’ETP touchés'!O89","v":""},{"$f":"' Étape 2 – Nombre d’ETP touchés'!P89","v":""},{"$f":"' Étape 2 – Nombre d’ETP touchés'!Q89","v":""},{"$f":"' Étape 2 – Nombre d’ETP touchés'!R89","v":""},{"$f":"' Étape 2 – Nombre d’ETP touchés'!S89","v":""},{"$f":"' Étape 2 – Nombre d’ETP touchés'!T89","v":""},{"$f":"' Étape 2 – Nombre d’ETP touchés'!U89","v":""},{"$f":"' Étape 2 – Nombre d’ETP touchés'!V89","v":""},{"$f":"' Étape 2 – Nombre d’ETP touchés'!W89","v":""},"",{"$error":"#DIV/0!"},{"$error":"#DIV/0!"},{"$f":"' Étape 2 – Nombre d’ETP touchés'!X89","v":""},{"$error":"#DIV/0!"}]
[86,{"$f":"' Étape 2 – Nombre d’ETP touchés'!B90","v":""},{"$f":"' Étape 2 – Nombre d’ETP touchés'!C90","v":0},{"$f":"' Étape 2 – Nombre d’ETP touchés'!D90","v":{"$error":"#DIV/0!"}},{"$f":"' Étape 2 – Nombre d’ETP touchés'!E90","v":""},{"$f":"' Étape 2 – Nombre d’ETP touchés'!F90","v":""},{"$f":"' Étape 2 – Nombre d’ETP touchés'!G90","v":""},{"$f":"' Étape 2 – Nombre d’ETP touchés'!H90","v":""},{"$f":"' Étape 2 – Nombre d’ETP touchés'!I90","v":""},{"$f":"' Étape 2 – Nombre d’ETP touchés'!J90","v":""},{"$f":"' Étape 2 – Nombre d’ETP touchés'!K90","v":""},{"$f":"' Étape 2 – Nombre d’ETP touchés'!L90","v":""},{"$f":"' Étape 2 – Nombre d’ETP touchés'!M90","v":""},{"$f":"' Étape 2 – Nombre d’ETP touchés'!N90","v":""},{"$f":"' Étape 2 – Nombre d’ETP touchés'!O90","v":""},{"$f":"' Étape 2 – Nombre d’ETP touchés'!P90","v":""},{"$f":"' Étape 2 – Nombre d’ETP touchés'!Q90","v":""},{"$f":"' Étape 2 – Nombre d’ETP touchés'!R90","v":""},{"$f":"' Étape 2 – Nombre d’ETP touchés'!S90","v":""},{"$f":"' Étape 2 – Nombre d’ETP touchés'!T90","v":""},{"$f":"' Étape 2 – Nombre d’ETP touchés'!U90","v":""},{"$f":"' Étape 2 – Nombre d’ETP touchés'!V90","v":""},{"$f":"' Étape 2 – Nombre d’ETP touchés'!W90","v":""},"",{"$error":"#DIV/0!"},{"$error":"#DIV/0!"},{"$f":"' Étape 2 – Nombre d’ETP touchés'!X90","v":""},{"$error":"#DIV/0!"}]
[87,{"$f":"' Étape 2 – Nombre d’ETP touchés'!B91","v":""},{"$f":"' Étape 2 – Nombre d’ETP touchés'!C91","v":0},{"$f":"' Étape 2 – Nombre d’ETP touchés'!D91","v":{"$error":"#DIV/0!"}},{"$f":"' Étape 2 – Nombre d’ETP touchés'!E91","v":""},{"$f":"' Étape 2 – Nombre d’ETP touchés'!F91","v":""},{"$f":"' Étape 2 – Nombre d’ETP touchés'!G91","v":""},{"$f":"' Étape 2 – Nombre d’ETP touchés'!H91","v":""},{"$f":"' Étape 2 – Nombre d’ETP touchés'!I91","v":""},{"$f":"' Étape 2 – Nombre d’ETP touchés'!J91","v":""},{"$f":"' Étape 2 – Nombre d’ETP touchés'!K91","v":""},{"$f":"' Étape 2 – Nombre d’ETP touchés'!L91","v":""},{"$f":"' Étape 2 – Nombre d’ETP touchés'!M91","v":""},{"$f":"' Étape 2 – Nombre d’ETP touchés'!N91","v":""},{"$f":"' Étape 2 – Nombre d’ETP touchés'!O91","v":""},{"$f":"' Étape 2 – Nombre d’ETP touchés'!P91","v":""},{"$f":"' Étape 2 – Nombre d’ETP touchés'!Q91","v":""},{"$f":"' Étape 2 – Nombre d’ETP touchés'!R91","v":""},{"$f":"' Étape 2 – Nombre d’ETP touchés'!S91","v":""},{"$f":"' Étape 2 – Nombre d’ETP touchés'!T91","v":""},{"$f":"' Étape 2 – Nombre d’ETP touchés'!U91","v":""},{"$f":"' Étape 2 – Nombre d’ETP touchés'!V91","v":""},{"$f":"' Étape 2 – Nombre d’ETP touchés'!W91","v":""},"",{"$error":"#DIV/0!"},{"$error":"#DIV/0!"},{"$f":"' Étape 2 – Nombre d’ETP touchés'!X91","v":""},{"$error":"#DIV/0!"}]
[88,{"$f":"' Étape 2 – Nombre d’ETP touchés'!B92","v":""},{"$f":"' Étape 2 – Nombre d’ETP touchés'!C92","v":0},{"$f":"' Étape 2 – Nombre d’ETP touchés'!D92","v":{"$error":"#DIV/0!"}},{"$f":"' Étape 2 – Nombre d’ETP touchés'!E92","v":""},{"$f":"' Étape 2 – Nombre d’ETP touchés'!F92","v":""},{"$f":"' Étape 2 – Nombre d’ETP touchés'!G92","v":""},{"$f":"' Étape 2 – Nombre d’ETP touchés'!H92","v":""},{"$f":"' Étape 2 – Nombre d’ETP touchés'!I92","v":""},{"$f":"' Étape 2 – Nombre d’ETP touchés'!J92","v":""},{"$f":"' Étape 2 – Nombre d’ETP touchés'!K92","v":""},{"$f":"' Étape 2 – Nombre d’ETP touchés'!L92","v":""},{"$f":"' Étape 2 – Nombre d’ETP touchés'!M92","v":""},{"$f":"' Étape 2 – Nombre d’ETP touchés'!N92","v":""},{"$f":"' Étape 2 – Nombre d’ETP touchés'!O92","v":""},{"$f":"' Étape 2 – Nombre d’ETP touchés'!P92","v":""},{"$f":"' Étape 2 – Nombre d’ETP touchés'!Q92","v":""},{"$f":"' Étape 2 – Nombre d’ETP touchés'!R92","v":""},{"$f":"' Étape 2 – Nombre d’ETP touchés'!S92","v":""},{"$f":"' Étape 2 – Nombre d’ETP touchés'!T92","v":""},{"$f":"' Étape 2 – Nombre d’ETP touchés'!U92","v":""},{"$f":"' Étape 2 – Nombre d’ETP touchés'!V92","v":""},{"$f":"' Étape 2 – Nombre d’ETP touchés'!W92","v":""},"",{"$error":"#DIV/0!"},{"$error":"#DIV/0!"},{"$f":"' Étape 2 – Nombre d’ETP touchés'!X92","v":""},{"$error":"#DIV/0!"}]
[89,{"$f":"' Étape 2 – Nombre d’ETP touchés'!B93","v":""},{"$f":"' Étape 2 – Nombre d’ETP touchés'!C93","v":0},{"$f":"' Étape 2 – Nombre d’ETP touchés'!D93","v":{"$error":"#DIV/0!"}},{"$f":"' Étape 2 – Nombre d’ETP touchés'!E93","v":""},{"$f":"' Étape 2 – Nombre d’ETP touchés'!F93","v":""},{"$f":"' Étape 2 – Nombre d’ETP touchés'!G93","v":""},{"$f":"' Étape 2 – Nombre d’ETP touchés'!H93","v":""},{"$f":"' Étape 2 – Nombre d’ETP touchés'!I93","v":""},{"$f":"' Étape 2 – Nombre d’ETP touchés'!J93","v":""},{"$f":"' Étape 2 – Nombre d’ETP touchés'!K93","v":""},{"$f":"' Étape 2 – Nombre d’ETP touchés'!L93","v":""},{"$f":"' Étape 2 – Nombre d’ETP touchés'!M93","v":""},{"$f":"' Étape 2 – Nombre d’ETP touchés'!N93","v":""},{"$f":"' Étape 2 – Nombre d’ETP touchés'!O93","v":""},{"$f":"' Étape 2 – Nombre d’ETP touchés'!P93","v":""},{"$f":"' Étape 2 – Nombre d’ETP touchés'!Q93","v":""},{"$f":"' Étape 2 – Nombre d’ETP touchés'!R93","v":""},{"$f":"' Étape 2 – Nombre d’ETP touchés'!S93","v":""},{"$f":"' Étape 2 – Nombre d’ETP touchés'!T93","v":""},{"$f":"' Étape 2 – Nombre d’ETP touchés'!U93","v":""},{"$f":"' Étape 2 – Nombre d’ETP touchés'!V93","v":""},{"$f":"' Étape 2 – Nombre d’ETP touchés'!W93","v":""},"",{"$error":"#DIV/0!"},{"$error":"#DIV/0!"},{"$f":"' Étape 2 – Nombre d’ETP touchés'!X93","v":""},{"$error":"#DIV/0!"}]
[90,{"$f":"' Étape 2 – Nombre d’ETP touchés'!B94","v":""},{"$f":"' Étape 2 – Nombre d’ETP touchés'!C94","v":0},{"$f":"' Étape 2 – Nombre d’ETP touchés'!D94","v":{"$error":"#DIV/0!"}},{"$f":"' Étape 2 – Nombre d’ETP touchés'!E94","v":""},{"$f":"' Étape 2 – Nombre d’ETP touchés'!F94","v":""},{"$f":"' Étape 2 – Nombre d’ETP touchés'!G94","v":""},{"$f":"' Étape 2 – Nombre d’ETP touchés'!H94","v":""},{"$f":"' Étape 2 – Nombre d’ETP touchés'!I94","v":""},{"$f":"' Étape 2 – Nombre d’ETP touchés'!J94","v":""},{"$f":"' Étape 2 – Nombre d’ETP touchés'!K94","v":""},{"$f":"' Étape 2 – Nombre d’ETP touchés'!L94","v":""},{"$f":"' Étape 2 – Nombre d’ETP touchés'!M94","v":""},{"$f":"' Étape 2 – Nombre d’ETP touchés'!N94","v":""},{"$f":"' Étape 2 – Nombre d’ETP touchés'!O94","v":""},{"$f":"' Étape 2 – Nombre d’ETP touchés'!P94","v":""},{"$f":"' Étape 2 – Nombre d’ETP touchés'!Q94","v":""},{"$f":"' Étape 2 – Nombre d’ETP touchés'!R94","v":""},{"$f":"' Étape 2 – Nombre d’ETP touchés'!S94","v":""},{"$f":"' Étape 2 – Nombre d’ETP touchés'!T94","v":""},{"$f":"' Étape 2 – Nombre d’ETP touchés'!U94","v":""},{"$f":"' Étape 2 – Nombre d’ETP touchés'!V94","v":""},{"$f":"' Étape 2 – Nombre d’ETP touchés'!W94","v":""},"",{"$error":"#DIV/0!"},{"$error":"#DIV/0!"},{"$f":"' Étape 2 – Nombre d’ETP touchés'!X94","v":""},{"$error":"#DIV/0!"}]
[91,{"$f":"' Étape 2 – Nombre d’ETP touchés'!B95","v":""},{"$f":"' Étape 2 – Nombre d’ETP touchés'!C95","v":0},{"$f":"' Étape 2 – Nombre d’ETP touchés'!D95","v":{"$error":"#DIV/0!"}},{"$f":"' Étape 2 – Nombre d’ETP touchés'!E95","v":""},{"$f":"' Étape 2 – Nombre d’ETP touchés'!F95","v":""},{"$f":"' Étape 2 – Nombre d’ETP touchés'!G95","v":""},{"$f":"' Étape 2 – Nombre d’ETP touchés'!H95","v":""},{"$f":"' Étape 2 – Nombre d’ETP touchés'!I95","v":""},{"$f":"' Étape 2 – Nombre d’ETP touchés'!J95","v":""},{"$f":"' Étape 2 – Nombre d’ETP touchés'!K95","v":""},{"$f":"' Étape 2 – Nombre d’ETP touchés'!L95","v":""},{"$f":"' Étape 2 – Nombre d’ETP touchés'!M95","v":""},{"$f":"' Étape 2 – Nombre d’ETP touchés'!N95","v":""},{"$f":"' Étape 2 – Nombre d’ETP touchés'!O95","v":""},{"$f":"' Étape 2 – Nombre d’ETP touchés'!P95","v":""},{"$f":"' Étape 2 – Nombre d’ETP touchés'!Q95","v":""},{"$f":"' Étape 2 – Nombre d’ETP touchés'!R95","v":""},{"$f":"' Étape 2 – Nombre d’ETP touchés'!S95","v":""},{"$f":"' Étape 2 – Nombre d’ETP touchés'!T95","v":""},{"$f":"' Étape 2 – Nombre d’ETP touchés'!U95","v":""},{"$f":"' Étape 2 – Nombre d’ETP touchés'!V95","v":""},{"$f":"' Étape 2 – Nombre d’ETP touchés'!W95","v":""},"",{"$error":"#DIV/0!"},{"$error":"#DIV/0!"},{"$f":"' Étape 2 – Nombre d’ETP touchés'!X95","v":""},{"$error":"#DIV/0!"}]
[92,{"$f":"' Étape 2 – Nombre d’ETP touchés'!B96","v":""},{"$f":"' Étape 2 – Nombre d’ETP touchés'!C96","v":0},{"$f":"' Étape 2 – Nombre d’ETP touchés'!D96","v":{"$error":"#DIV/0!"}},{"$f":"' Étape 2 – Nombre d’ETP touchés'!E96","v":""},{"$f":"' Étape 2 – Nombre d’ETP touchés'!F96","v":""},{"$f":"' Étape 2 – Nombre d’ETP touchés'!G96","v":""},{"$f":"' Étape 2 – Nombre d’ETP touchés'!H96","v":""},{"$f":"' Étape 2 – Nombre d’ETP touchés'!I96","v":""},{"$f":"' Étape 2 – Nombre d’ETP touchés'!J96","v":""},{"$f":"' Étape 2 – Nombre d’ETP touchés'!K96","v":""},{"$f":"' Étape 2 – Nombre d’ETP touchés'!L96","v":""},{"$f":"' Étape 2 – Nombre d’ETP touchés'!M96","v":""},{"$f":"' Étape 2 – Nombre d’ETP touchés'!N96","v":""},{"$f":"' Étape 2 – Nombre d’ETP touchés'!O96","v":""},{"$f":"' Étape 2 – Nombre d’ETP touchés'!P96","v":""},{"$f":"' Étape 2 – Nombre d’ETP touchés'!Q96","v":""},{"$f":"' Étape 2 – Nombre d’ETP touchés'!R96","v":""},{"$f":"' Étape 2 – Nombre d’ETP touchés'!S96","v":""},{"$f":"' Étape 2 – Nombre d’ETP touchés'!T96","v":""},{"$f":"' Étape 2 – Nombre d’ETP touchés'!U96","v":""},{"$f":"' Étape 2 – Nombre d’ETP touchés'!V96","v":""},{"$f":"' Étape 2 – Nombre d’ETP touchés'!W96","v":""},"",{"$error":"#DIV/0!"},{"$error":"#DIV/0!"},{"$f":"' Étape 2 – Nombre d’ETP touchés'!X96","v":""},{"$error":"#DIV/0!"}]
[93,{"$f":"' Étape 2 – Nombre d’ETP touchés'!B97","v":""},{"$f":"' Étape 2 – Nombre d’ETP touchés'!C97","v":0},{"$f":"' Étape 2 – Nombre d’ETP touchés'!D97","v":{"$error":"#DIV/0!"}},{"$f":"' Étape 2 – Nombre d’ETP touchés'!E97","v":""},{"$f":"' Étape 2 – Nombre d’ETP touchés'!F97","v":""},{"$f":"' Étape 2 – Nombre d’ETP touchés'!G97","v":""},{"$f":"' Étape 2 – Nombre d’ETP touchés'!H97","v":""},{"$f":"' Étape 2 – Nombre d’ETP touchés'!I97","v":""},{"$f":"' Étape 2 – Nombre d’ETP touchés'!J97","v":""},{"$f":"' Étape 2 – Nombre d’ETP touchés'!K97","v":""},{"$f":"' Étape 2 – Nombre d’ETP touchés'!L97","v":""},{"$f":"' Étape 2 – Nombre d’ETP touchés'!M97","v":""},{"$f":"' Étape 2 – Nombre d’ETP touchés'!N97","v":""},{"$f":"' Étape 2 – Nombre d’ETP touchés'!O97","v":""},{"$f":"' Étape 2 – Nombre d’ETP touchés'!P97","v":""},{"$f":"' Étape 2 – Nombre d’ETP touchés'!Q97","v":""},{"$f":"' Étape 2 – Nombre d’ETP touchés'!R97","v":""},{"$f":"' Étape 2 – Nombre d’ETP touchés'!S97","v":""},{"$f":"' Étape 2 – Nombre d’ETP touchés'!T97","v":""},{"$f":"' Étape 2 – Nombre d’ETP touchés'!U97","v":""},{"$f":"' Étape 2 – Nombre d’ETP touchés'!V97","v":""},{"$f":"' Étape 2 – Nombre d’ETP touchés'!W97","v":""},"",{"$error":"#DIV/0!"},{"$error":"#DIV/0!"},{"$f":"' Étape 2 – Nombre d’ETP touchés'!X97","v":""},{"$error":"#DIV/0!"}]
[94,{"$f":"' Étape 2 – Nombre d’ETP touchés'!B98","v":""},{"$f":"' Étape 2 – Nombre d’ETP touchés'!C98","v":0},{"$f":"' Étape 2 – Nombre d’ETP touchés'!D98","v":{"$error":"#DIV/0!"}},{"$f":"' Étape 2 – Nombre d’ETP touchés'!E98","v":""},{"$f":"' Étape 2 – Nombre d’ETP touchés'!F98","v":""},{"$f":"' Étape 2 – Nombre d’ETP touchés'!G98","v":""},{"$f":"' Étape 2 – Nombre d’ETP touchés'!H98","v":""},{"$f":"' Étape 2 – Nombre d’ETP touchés'!I98","v":""},{"$f":"' Étape 2 – Nombre d’ETP touchés'!J98","v":""},{"$f":"' Étape 2 – Nombre d’ETP touchés'!K98","v":""},{"$f":"' Étape 2 – Nombre d’ETP touchés'!L98","v":""},{"$f":"' Étape 2 – Nombre d’ETP touchés'!M98","v":""},{"$f":"' Étape 2 – Nombre d’ETP touchés'!N98","v":""},{"$f":"' Étape 2 – Nombre d’ETP touchés'!O98","v":""},{"$f":"' Étape 2 – Nombre d’ETP touchés'!P98","v":""},{"$f":"' Étape 2 – Nombre d’ETP touchés'!Q98","v":""},{"$f":"' Étape 2 – Nombre d’ETP touchés'!R98","v":""},{"$f":"' Étape 2 – Nombre d’ETP touchés'!S98","v":""},{"$f":"' Étape 2 – Nombre d’ETP touchés'!T98","v":""},{"$f":"' Étape 2 – Nombre d’ETP touchés'!U98","v":""},{"$f":"' Étape 2 – Nombre d’ETP touchés'!V98","v":""},{"$f":"' Étape 2 – Nombre d’ETP touchés'!W98","v":""},"",{"$error":"#DIV/0!"},{"$error":"#DIV/0!"},{"$f":"' Étape 2 – Nombre d’ETP touchés'!X98","v":""},{"$error":"#DIV/0!"}]
[95,{"$f":"' Étape 2 – Nombre d’ETP touchés'!B99","v":""},{"$f":"' Étape 2 – Nombre d’ETP touchés'!C99","v":0},{"$f":"' Étape 2 – Nombre d’ETP touchés'!D99","v":{"$error":"#DIV/0!"}},{"$f":"' Étape 2 – Nombre d’ETP touchés'!E99","v":""},{"$f":"' Étape 2 – Nombre d’ETP touchés'!F99","v":""},{"$f":"' Étape 2 – Nombre d’ETP touchés'!G99","v":""},{"$f":"' Étape 2 – Nombre d’ETP touchés'!H99","v":""},{"$f":"' Étape 2 – Nombre d’ETP touchés'!I99","v":""},{"$f":"' Étape 2 – Nombre d’ETP touchés'!J99","v":""},{"$f":"' Étape 2 – Nombre d’ETP touchés'!K99","v":""},{"$f":"' Étape 2 – Nombre d’ETP touchés'!L99","v":""},{"$f":"' Étape 2 – Nombre d’ETP touchés'!M99","v":""},{"$f":"' Étape 2 – Nombre d’ETP touchés'!N99","v":""},{"$f":"' Étape 2 – Nombre d’ETP touchés'!O99","v":""},{"$f":"' Étape 2 – Nombre d’ETP touchés'!P99","v":""},{"$f":"' Étape 2 – Nombre d’ETP touchés'!Q99","v":""},{"$f":"' Étape 2 – Nombre d’ETP touchés'!R99","v":""},{"$f":"' Étape 2 – Nombre d’ETP touchés'!S99","v":""},{"$f":"' Étape 2 – Nombre d’ETP touchés'!T99","v":""},{"$f":"' Étape 2 – Nombre d’ETP touchés'!U99","v":""},{"$f":"' Étape 2 – Nombre d’ETP touchés'!V99","v":""},{"$f":"' Étape 2 – Nombre d’ETP touchés'!W99","v":""},"",{"$error":"#DIV/0!"},{"$error":"#DIV/0!"},{"$f":"' Étape 2 – Nombre d’ETP touchés'!X99","v":""},{"$error":"#DIV/0!"}]
[96,{"$f":"' Étape 2 – Nombre d’ETP touchés'!B100","v":""},{"$f":"' Étape 2 – Nombre d’ETP touchés'!C100","v":0},{"$f":"' Étape 2 – Nombre d’ETP touchés'!D100","v":{"$error":"#DIV/0!"}},{"$f":"' Étape 2 – Nombre d’ETP touchés'!E100","v":""},{"$f":"' Étape 2 – Nombre d’ETP touchés'!F100","v":""},{"$f":"' Étape 2 – Nombre d’ETP touchés'!G100","v":""},{"$f":"' Étape 2 – Nombre d’ETP touchés'!H100","v":""},{"$f":"' Étape 2 – Nombre d’ETP touchés'!I100","v":""},{"$f":"' Étape 2 – Nombre d’ETP touchés'!J100","v":""},{"$f":"' Étape 2 – Nombre d’ETP touchés'!K100","v":""},{"$f":"' Étape 2 – Nombre d’ETP touchés'!L100","v":""},{"$f":"' Étape 2 – Nombre d’ETP touchés'!M100","v":""},{"$f":"' Étape 2 – Nombre d’ETP touchés'!N100","v":""},{"$f":"' Étape 2 – Nombre d’ETP touchés'!O100","v":""},{"$f":"' Étape 2 – Nombre d’ETP touchés'!P100","v":""},{"$f":"' Étape 2 – Nombre d’ETP touchés'!Q100","v":""},{"$f":"' Étape 2 – Nombre d’ETP touchés'!R100","v":""},{"$f":"' Étape 2 – Nombre d’ETP touchés'!S100","v":""},{"$f":"' Étape 2 – Nombre d’ETP touchés'!T100","v":""},{"$f":"' Étape 2 – Nombre d’ETP touchés'!U100","v":""},{"$f":"' Étape 2 – Nombre d’ETP touchés'!V100","v":""},{"$f":"' Étape 2 – Nombre d’ETP touchés'!W100","v":""},"",{"$error":"#DIV/0!"},{"$error":"#DIV/0!"},{"$f":"' Étape 2 – Nombre d’ETP touchés'!X100","v":""},{"$error":"#DIV/0!"}]
[97,{"$f":"' Étape 2 – Nombre d’ETP touchés'!B101","v":""},{"$f":"' Étape 2 – Nombre d’ETP touchés'!C101","v":0},{"$f":"' Étape 2 – Nombre d’ETP touchés'!D101","v":{"$error":"#DIV/0!"}},{"$f":"' Étape 2 – Nombre d’ETP touchés'!E101","v":""},{"$f":"' Étape 2 – Nombre d’ETP touchés'!F101","v":""},{"$f":"' Étape 2 – Nombre d’ETP touchés'!G101","v":""},{"$f":"' Étape 2 – Nombre d’ETP touchés'!H101","v":""},{"$f":"' Étape 2 – Nombre d’ETP touchés'!I101","v":""},{"$f":"' Étape 2 – Nombre d’ETP touchés'!J101","v":""},{"$f":"' Étape 2 – Nombre d’ETP touchés'!K101","v":""},{"$f":"' Étape 2 – Nombre d’ETP touchés'!L101","v":""},{"$f":"' Étape 2 – Nombre d’ETP touchés'!M101","v":""},{"$f":"' Étape 2 – Nombre d’ETP touchés'!N101","v":""},{"$f":"' Étape 2 – Nombre d’ETP touchés'!O101","v":""},{"$f":"' Étape 2 – Nombre d’ETP touchés'!P101","v":""},{"$f":"' Étape 2 – Nombre d’ETP touchés'!Q101","v":""},{"$f":"' Étape 2 – Nombre d’ETP touchés'!R101","v":""},{"$f":"' Étape 2 – Nombre d’ETP touchés'!S101","v":""},{"$f":"' Étape 2 – Nombre d’ETP touchés'!T101","v":""},{"$f":"' Étape 2 – Nombre d’ETP touchés'!U101","v":""},{"$f":"' Étape 2 – Nombre d’ETP touchés'!V101","v":""},{"$f":"' Étape 2 – Nombre d’ETP touchés'!W101","v":""},"",{"$error":"#DIV/0!"},{"$error":"#DIV/0!"},{"$f":"' Étape 2 – Nombre d’ETP touchés'!X101","v":""},{"$f":"IF(AND(AA101=\"LOW\",D101<50),\"LOW\",\nIF(AND(AA101=\"LOW\",D101>=50),\"MED\",\nIF(AND(AA101=\"MED\",D101<50),\"MED\",\nIF(AND(AA101=\"MED\",D101>=50),\"HIGH\",\nIF(AND(AA101=\"HIGH\",D101<50),\"MED\",\nIF(AND(AA101=\"HIGH\",D101>=50),\"HIGH\",\nIF(AA101=\"Minimal Change for Employee\",\"N/A\",\n\"ERROR\")))))))","v":{"$error":"#DIV/0!"}}]
[98,{"$f":"' Étape 2 – Nombre d’ETP touchés'!B102","v":""},{"$f":"' Étape 2 – Nombre d’ETP touchés'!C102","v":0},{"$f":"' Étape 2 – Nombre d’ETP touchés'!D102","v":{"$error":"#DIV/0!"}},{"$f":"' Étape 2 – Nombre d’ETP touchés'!E102","v":""},{"$f":"' Étape 2 – Nombre d’ETP touchés'!F102","v":""},{"$f":"' Étape 2 – Nombre d’ETP touchés'!G102","v":""},{"$f":"' Étape 2 – Nombre d’ETP touchés'!H102","v":""},{"$f":"' Étape 2 – Nombre d’ETP touchés'!I102","v":""},{"$f":"' Étape 2 – Nombre d’ETP touchés'!J102","v":""},{"$f":"' Étape 2 – Nombre d’ETP touchés'!K102","v":""},{"$f":"' Étape 2 – Nombre d’ETP touchés'!L102","v":""},{"$f":"' Étape 2 – Nombre d’ETP touchés'!M102","v":""},{"$f":"' Étape 2 – Nombre d’ETP touchés'!N102","v":""},{"$f":"' Étape 2 – Nombre d’ETP touchés'!O102","v":""},{"$f":"' Étape 2 – Nombre d’ETP touchés'!P102","v":""},{"$f":"' Étape 2 – Nombre d’ETP touchés'!Q102","v":""},{"$f":"' Étape 2 – Nombre d’ETP touchés'!R102","v":""},{"$f":"' Étape 2 – Nombre d’ETP touchés'!S102","v":""},{"$f":"' Étape 2 – Nombre d’ETP touchés'!T102","v":""},{"$f":"' Étape 2 – Nombre d’ETP touchés'!U102","v":""},{"$f":"' Étape 2 – Nombre d’ETP touchés'!V102","v":""},{"$f":"' Étape 2 – Nombre d’ETP touchés'!W102","v":""},"",{"$error":"#DIV/0!"},{"$error":"#DIV/0!"},{"$f":"' Étape 2 – Nombre d’ETP touchés'!X102","v":""},{"$f":"IF(AND(AA102=\"LOW\",D102<50),\"LOW\",\nIF(AND(AA102=\"LOW\",D102>=50),\"MED\",\nIF(AND(AA102=\"MED\",D102<50),\"MED\",\nIF(AND(AA102=\"MED\",D102>=50),\"HIGH\",\nIF(AND(AA102=\"HIGH\",D102<50),\"MED\",\nIF(AND(AA102=\"HIGH\",D102>=50),\"HIGH\",\nIF(AA102=\"Minimal Change for Employee\",\"N/A\",\n\"ERROR\")))))))","v":{"$error":"#DIV/0!"}}]
[99,{"$f":"' Étape 2 – Nombre d’ETP touchés'!B103","v":""},{"$f":"' Étape 2 – Nombre d’ETP touchés'!C103","v":0},{"$f":"' Étape 2 – Nombre d’ETP touchés'!D103","v":{"$error":"#DIV/0!"}},{"$f":"' Étape 2 – Nombre d’ETP touchés'!E103","v":""},{"$f":"' Étape 2 – Nombre d’ETP touchés'!F103","v":""},{"$f":"' Étape 2 – Nombre d’ETP touchés'!G103","v":""},{"$f":"' Étape 2 – Nombre d’ETP touchés'!H103","v":""},{"$f":"' Étape 2 – Nombre d’ETP touchés'!I103","v":""},{"$f":"' Étape 2 – Nombre d’ETP touchés'!J103","v":""},{"$f":"' Étape 2 – Nombre d’ETP touchés'!K103","v":""},{"$f":"' Étape 2 – Nombre d’ETP touchés'!L103","v":""},{"$f":"' Étape 2 – Nombre d’ETP touchés'!M103","v":""},{"$f":"' Étape 2 – Nombre d’ETP touchés'!N103","v":""},{"$f":"' Étape 2 – Nombre d’ETP touchés'!O103","v":""},{"$f":"' Étape 2 – Nombre d’ETP touchés'!P103","v":""},{"$f":"' Étape 2 – Nombre d’ETP touchés'!Q103","v":""},{"$f":"' Étape 2 – Nombre d’ETP touchés'!R103","v":""},{"$f":"' Étape 2 – Nombre d’ETP touchés'!S103","v":""},{"$f":"' Étape 2 – Nombre d’ETP touchés'!T103","v":""},{"$f":"' Étape 2 – Nombre d’ETP touchés'!U103","v":""},{"$f":"' Étape 2 – Nombre d’ETP touchés'!V103","v":""},{"$f":"' Étape 2 – Nombre d’ETP touchés'!W103","v":""},"",{"$error":"#DIV/0!"},{"$error":"#DIV/0!"},{"$f":"' Étape 2 – Nombre d’ETP touchés'!X103","v":""},{"$f":"IF(AND(AA103=\"LOW\",D103<50),\"LOW\",\nIF(AND(AA103=\"LOW\",D103>=50),\"MED\",\nIF(AND(AA103=\"MED\",D103<50),\"MED\",\nIF(AND(AA103=\"MED\",D103>=50),\"HIGH\",\nIF(AND(AA103=\"HIGH\",D103<50),\"MED\",\nIF(AND(AA103=\"HIGH\",D103>=50),\"HIGH\",\nIF(AA103=\"Minimal Change for Employee\",\"N/A\",\n\"ERROR\")))))))","v":{"$error":"#DIV/0!"}}]
[100,{"$f":"' Étape 2 – Nombre d’ETP touchés'!B104","v":""},{"$f":"' Étape 2 – Nombre d’ETP touchés'!C104","v":0},{"$f":"' Étape 2 – Nombre d’ETP touchés'!D104","v":{"$error":"#DIV/0!"}},{"$f":"' Étape 2 – Nombre d’ETP touchés'!E104","v":""},{"$f":"' Étape 2 – Nombre d’ETP touchés'!F104","v":""},{"$f":"' Étape 2 – Nombre d’ETP touchés'!G104","v":""},{"$f":"' Étape 2 – Nombre d’ETP touchés'!H104","v":""},{"$f":"' Étape 2 – Nombre d’ETP touchés'!I104","v":""},{"$f":"' Étape 2 – Nombre d’ETP touchés'!J104","v":""},{"$f":"' Étape 2 – Nombre d’ETP touchés'!K104","v":""},{"$f":"' Étape 2 – Nombre d’ETP touchés'!L104","v":""},{"$f":"' Étape 2 – Nombre d’ETP touchés'!M104","v":""},{"$f":"' Étape 2 – Nombre d’ETP touchés'!N104","v":""},{"$f":"' Étape 2 – Nombre d’ETP touchés'!O104","v":""},{"$f":"' Étape 2 – Nombre d’ETP touchés'!P104","v":""},{"$f":"' Étape 2 – Nombre d’ETP touchés'!Q104","v":""},{"$f":"' Étape 2 – Nombre d’ETP touchés'!R104","v":""},{"$f":"' Étape 2 – Nombre d’ETP touchés'!S104","v":""},{"$f":"' Étape 2 – Nombre d’ETP touchés'!T104","v":""},{"$f":"' Étape 2 – Nombre d’ETP touchés'!U104","v":""},{"$f":"' Étape 2 – Nombre d’ETP touchés'!V104","v":""},{"$f":"' Étape 2 – Nombre d’ETP touchés'!W104","v":""},"",{"$error":"#DIV/0!"},{"$error":"#DIV/0!"},{"$f":"' Étape 2 – Nombre d’ETP touchés'!X104","v":""},{"$f":"IF(AND(AA104=\"LOW\",D104<50),\"LOW\",\nIF(AND(AA104=\"LOW\",D104>=50),\"MED\",\nIF(AND(AA104=\"MED\",D104<50),\"MED\",\nIF(AND(AA104=\"MED\",D104>=50),\"HIGH\",\nIF(AND(AA104=\"HIGH\",D104<50),\"MED\",\nIF(AND(AA104=\"HIGH\",D104>=50),\"HIGH\",\nIF(AA104=\"Minimal Change for Employee\",\"N/A\",\n\"ERROR\")))))))","v":{"$error":"#DIV/0!"}}]

{"sheet":"LOOKUP Table","index":4,"n_rows":101,"n_cols":6,"rows_kept":101,"cut":false,"hidden":true,"merged":[[2,0,6,0],[2,1,6,1],[7,0,12,0],[7,1,12,1],[13,0,15,0],[13,1,15,1],[16,0,26,0],[16,1,26,1],[27,0,28,0],[27,1,28,1],[29,0,30,0],[29,1,30,1],[32,0,33,0],[32,1,33,1],[34,0,37,0],[34,1,37,1],[38,0,39,0],[38,1,39,1],[42,0,43,0],[42,1,43,1],[44,0,48,0],[44,1,48,1],[49,0,60,0],[49,1,60,1],[61,0,62,0],[61,1,62,1],[64,0,66,0],[64,1,66,1],[67,0,70,0],[67,1,70,1],[71,0,73,0],[71,1,73,1],[74,0,76,0],[74,1,76,1],[77,0,80,0],[77,1,80,1],[90,0,95,0],[90,1,95,1],[96,0,100,0],[96,1,100,1],[81,0,84,0],[81,1,84,1],[85,0,86,0],[85,1,86,1],[87,0,89,0],[87,1,89,1]]}
[null,null,null,null,"Checklist"]
["2017-05-01","Categories",null,"List of changes","Check If applicable change to your organization","Formula only"]
[1.1000000000000001,"Devices","1.1.1","Computing device: going from fix to portable",null,true]
[null,null,"1.1.2","Updated and compatible computing device: New functionnality ",null,true]
[null,null,"1.1.3","Device recycling: no change for employees (back office)",null,true]
[null,null,"1.1.4","Phone devices: going from fix to portable ",null,true]
[null,null,"1.1.5","Updated and compatible phone devices: new functionnalities ",null,true]
[1.2,"Connectivity","1.2.1","Wi-fi: new functionnality "]
[null,null,"1.2.2","Secret/classified network: new common IT tools and processes "]
[null,null,"1.2.3","Public Wi-fi: increased connectivity "]
[null,null,"1.2.4","VPN: increased connectivity and mobility "]
[null,null,"1.2.5","Print-on-demand: new tool"]
[null,null,"1.2.6","Single sign on: new functionnality and process (back office) "]
[1.3,"User Support","1.3.1","IT support: part of other change (back office)"]
[null,null,"1.3.2","Training on IT tools: part of other change (back office)"]
[null,null,"1.3.3","Peer to peer IT support network: part of other change (back office)"]
[1.4,"Tools and Software","1.4.1","Videoconferencing: new IT tools"]
[null,null,"1.4.2","Instant Messaging: new IT tools"]
[null,null,"1.4.3","Collaboration tools: new IT tools"]
[null,null,"1.4.4","Collaboration platforms: new IT tools"]
[null,null,"1.4.5","Reservation system: new IT tools "]
[null,null,"1.4.6","Innovative tools and softwares: part of other change (back office)"]
[null,null,"1.4.7","Cloud-based tools and softwares: part of other change (back office)"]
[null,null,"1.4.8","Accessibility of applications via phones: new functionnality "]
[null,null,"1.4.9","ID management system: new functionnality "]
[null,null,"1.4.10","Digital signatures: new functionnality"]
[null,null,"1.4.11","GC email: new functionnality"]
[1.5,"Collaboration Assets","1.5.1","Collaboration assets: part of other change (back office)"]
[null,null,"1.5.2","Compatible collaboration assets: part of other change (back office)"]
[2.1,"Policies and Agreements","2.1.1"]
[null,null,"2.1.2"]
[2.2000000000000002,"Self-Service/ Communication","2.2.1"]
[2.2999999999999998,"People Management practices / Leadership / Managing staff","2.3.1"]
[null,null,"2.3.2"]
[2.4,"Digital/Modern ways of working in HR","2.4.1"]
[null,null,"2.4.2"]
[null,null,"2.4.3"]
[null,null,"2.4.4"]
[2.5,"Learning & Development","2.5.1"]
[null,null,"2.5.2"]
[2.6,"Occupational Health and Safety","2.6.1"]
[3.1,"Policies/ Processes/ Procedures","3.1.1"]
[3.2,"Governance","3.2.1"]
[null,null,"3.2.2"]
[3.3,"Information Holdings","3.3.1"]
[null,null,"3.3.2"]
[null,null,"3.3.3"]
[null,null,"3.3.4"]
[null,null,"3.3.5"]
[3.4,"Content Management Tools","3.4.1"]
[null,null,"3.4.2"]
[null,null,"3.4.3"]
[null,null,"3.4.4"]
[null,null,"3.4.5"]
[null,null,"3.4.6"]
[null,null,"3.4.7"]
[null,null,"3.4.8"]
[null,null,"3.4.9"]
[null,null,"3.4.10"]
[null,null,"3.4.11"]
[null,null,"3.4.12"]
[3.5,"Support/ Awareness, Engagement and Training","3.5.1"]
[null,null,"3.5.2"]
[4.0999999999999996,"Security Policy","4.1.1"]
[4.2,"Security Awareness","4.2.1"]
[null,null,"4.2.2"]
[null,null,"4.2.3"]
[4.3,"Information Security","4.3.1"]
[null,null,"4.3.2"]
[null,null,"4.3.3"]
[null,null,"4.3.4"]
[4.4000000000000004,"Personnel Security","4.4.1"]
[null,null,"4.4.2"]
[null,null,"4.4.3"]
[4.5,"Emergency management","4.5.1"]
[null,null,"4.5.2"]
[null,null,"4.5.3"]
[4.5999999999999996,"Physical security","4.6.1"]
[null,null,"4.6.2"]
[null,null,"4.6.3"]
[null,null,"4.6.4"]
[4.7,"IT Security","4.7.1"]
[null,null,"4.7.2"]
[null,null,"4.7.3"]
[null,null,"4.7.4"]
[5.0999999999999996,"Accessibility","5.1.1"]
[null,null,"5.1.2"]
[5.2,"Work points","5.2.1"]
[null,null,"5.2.2"]
[null,null,"5.2.3"]
[5.3,"Facilities","5.3.1"]
[null,null,"5.3.2"]
[null,null,"5.3.3"]
[null,null,"5.3.4"]
[null,null,"5.3.5"]
[null,null,"5.3.6"]
[5.4,"Interior Design","5.4.1"]
[null,null,"5.4.2"]
[null,null,"5.4.3"]
[null,null,"5.4.4"]
[null,null,"5.4.5"]

{"sheet":"Summary by sector","index":5,"n_rows":7,"n_cols":3,"rows_kept":7,"cut":false,"hidden":true,"merged":[]}
[]
["Sector","Sector code","Summary of changes by enabling sector"]
["TI",1,{"$f":"FREQUENCY('Résultats – Évaluation des répe'!X5:X104,'Summary by sector'!B3:B7)","v":0}]
["RH/SST/GP",2,0]
["GI",3,0]
["Sécurité",4,0]
["Installations",5,0]

{"sheet":"Top change impacts","index":6,"n_rows":20,"n_cols":8,"rows_kept":20,"cut":false,"hidden":true,"merged":[]}
[null,"Top change impacts"]
[]
[null,null,null,null,null,"Top 10 highest change impacts"]
[]
[null,"Row Labels","Sum of Impact score","Sum of Change rank",null,"Rank","Impact","Title"]
[1,"1.2.1 IT/Connectivity - Wi-fi: new functionnality ",3,1,null,{"$f":"_xlfn.RANK.EQ(G6:G15,G6:G15)","v":1},{"$f":"C6","v":3},{"$f":"B6","v":"1.2.1 IT/Connectivity - Wi-fi: new functionnality "}]
[2,"1.4.5 IT/Tools and Software - Reservation system: new IT tools ",2,2,null,2,2,"1.4.5 IT/Tools and Software - Reservation system: new IT tools "]
[3,"1.1.4 IT/Devices - Phone devices: going from fix to portable ",2,2,null,2,2,"1.1.4 IT/Devices - Phone devices: going from fix to portable "]
[4,"5.2.1 Facilities, Assets & Interior Design/Work points - More choices of work points type",2,2,null,2,2,"5.2.1 Facilities, Assets & Interior Design/Work points - More choices of work points type"]
[5,"5.2.2 Facilities, Assets & Interior Design/Work points - Moving to unassigned seating ",2,2,null,2,2,"5.2.2 Facilities, Assets & Interior Design/Work points - Moving to unassigned seating "]
[6,"5.3.5 Facilities, Assets & Interior Design/Facilities - Lockers",2,2,null,2,2,"5.3.5 Facilities, Assets & Interior Design/Facilities - Lockers"]
[7,"1.4.3 IT/Tools and Software - Collaboration tools: new IT tools",2,2,null,2,2,"1.4.3 IT/Tools and Software - Collaboration tools: new IT tools"]
[8,"1.1.1 IT/Devices - Computing device: going from fix to portable",2,2,null,2,2,"1.1.1 IT/Devices - Computing device: going from fix to portable"]
[9,"5.3.6 Facilities, Assets & Interior Design/Facilities - Green transportation between buildings",1,9,null,9,1,"5.3.6 Facilities, Assets & Interior Design/Facilities - Green transportation between buildings"]
[10,"5.1.1 Facilities, Assets & Interior Design/Accessibility - Inclusivity applied in office design",1,9,null,9,1,"5.1.1 Facilities, Assets & Interior Design/Accessibility - Inclusivity applied in office design"]
[null,"3.4.11 Information Management/Content Management Tools - Imaging services: new tool",1,9]
[null,"5.1.2 Facilities, Assets & Interior Design/Accessibility - Extended hours for access to departmental building",1,9]
[null,"1.1.2 IT/Devices - Updated and compatible computing device: New functionnality ",1,9]
[null,"1.4.6 IT/Tools and Software - Innovative tools and softwares: part of other change (back office)",1,9]
[null,"Grand Total",23,69]

{"sheet":"First draft","index":7,"n_rows":109,"n_cols":43,"rows_kept":109,"cut":false,"hidden":true,"merged":[[4,20,4,22],[6,16,32,16],[1,1,1,5],[3,1,4,4],[3,6,3,15],[5,2,5,4],[6,1,10,1],[6,2,10,2],[4,10,4,12],[11,1,16,1],[11,2,16,2],[17,1,19,1],[17,2,19,2],[20,1,30,1],[20,2,30,2],[4,17,4,19],[74,2,77,2],[78,1,80,1],[48,1,49,1],[48,2,49,2],[31,1,32,1],[31,2,32,2],[33,2,33,4],[34,1,35,1],[34,2,35,2],[37,1,38,1],[37,2,38,2],[39,1,42,1],[39,2,42,2],[43,1,44,1],[43,2,44,2],[46,2,46,4],[88,1,91,1],[88,2,91,2],[104,1,108,1],[104,2,108,2],[93,1,94,1],[93,2,94,2],[95,1,97,1],[95,2,97,2],[98,1,103,1],[98,2,103,2],[4,28,4,30],[81,1,83,1],[81,2,83,2],[84,1,87,1],[84,2,87,2],[78,2,80,2],[50,1,54,1],[50,2,54,2],[55,1,66,1],[55,2,66,2],[67,1,68,1],[67,2,68,2],[69,2,69,4],[71,1,73,1],[71,2,73,2],[74,1,77,1]]}
[]
[null,"Assessment – Maturity"]
[]
[null,null,null,null,null,"Low (1)","List of Changes",null,null,null,null,null,null,null,null,null,null,null,null,null,null,null,null,null,null,null,null,null,null,null,null,null,"Medium (2)","List of changes","High (3)","Overall priority for change","Priority for change (maturity)","Priority for change (personas)","Alex","Kris","Pat","Sam","Additional Notes/Comments"]
[null,null,null,null,null,"Low maturity portrays the current average baseline across government","List of changes","Tools","Behaviors","Process","formulas\nfor H, I & J",null,null,"Base point","Score of changes ","Degree of Change","Pourcentage of applicable changes","Weigh of the changes\nT - B - P",null,null,"How big of a change?",null,null,"Overall","How big of a change?",null," How many people are impacted",null,"Formula\nScore of changes\nT - B - P",null,null,"Score","Medium maturity looks at the 2020 vision for government and sets out an achievable, yet ambitious experience for employees that is aligned to and demonstrates progress to the high maturity vision",null,"High maturity looks at the future government vision of a digital, flexible and collaborative employee experience in the workplace","1          to       10\n  low                 high","1          to       3\n  low                 high","1          to       10\n  low                 high"]
[null,1,"IT",null,null,"Low",null,"T","B","P",null,null,null,null,null,null,null,"T","B","P","T","B","P",null,null,null,null,null,null,null,null,null,"Medium",null,"High","Priority for change","Priority for change","Priority for change"]
[null,1.1000000000000001,"Devices","1.1.1","Do employees have a flexible choice of device (e.g. tablets, laptops & desktops)? ","Devices are supplied to employees at a department level and typically fixed in nature with little choice of flexibility","Computing device: going from fix to portable",null,null,null,true,true,false,2,{"$f":"SUMPRODUCT(--(K7:M7))","v":2},{"$f":"IF(O7=0,\"Minimal Change for Employee\",IF(O7<N7,\"LOW\",IF(O7=N7,\"MED\",\"HIGH\")))","v":"MED"},{"$f":"SUM(O7:O33)/81","v":0.40740740740740738},0.2,0.8,0,{"$f":"SUMPRODUCT(--K7,R7)","v":0.2},0.8,{"$f":"SUMPRODUCT(--M7,T7)","v":0},{"$f":"SUM(U7,V7,W7)/100%","v":1},1,"(x7=0,30,\"LOW\",IF(x7=39,\"MED\",\"HIGH\")))","?",null,1,3,2,{"$f":"(U7*AC7)+(V7*AD7)+(W7*AE7)","v":2.6000000000000005},"Employees have a choice for devices to be fixed or portable and are supplied are at a department level, as well as departmentally supplied personalized peripherals",null,"Employees have multiple choices of devices with devices centrally supplied centrally by GC, as well as GC supplied personalized peripherals",{"$f":"IF(#REF!=\"Input maturity\",\"\",IF((AL7+AK7)/2<=1,1,(AL7+AK7)/2))","v":{"$error":"#REF!"}},{"$f":"IF(#REF!=1,3,IF(#REF!=2,2,IF(#REF!=3,1,IF(#REF!=0,0))))","v":{"$error":"#REF!"}},{"$f":"(((AM7*#REF!)+(AP7*#REF!)+(AN7*#REF!)+(AO7*#REF!)))*10","v":{"$error":"#REF!"}},1,1,1,1]
[null,null,null,"1.1.2","How up to date are the devices that are provided to employees?","Devices provided are outdated and are incompatible with other tools (e.g. printers, projectors) and devices","Updated and compatible computing device: New functionnality ",null,null,null,true,false,false,2,{"$f":"SUMPRODUCT(--(K8:M8))","v":1},{"$f":"IF(O8=0,\"Minimal Change for Employee\",IF(O8<N8,\"LOW\",IF(O8=N8,\"MED\",\"HIGH\")))","v":"LOW"},null,1,0,0,1,0,0,{"$f":"SUM(U8,V8,W8)/100%","v":1},2,null,1,null,null,null,null,null,"Devices provided are modern (updated at least every 48 months) and offer good compatibility with departmental tools and devices",null,"Devices provided are modern, offered centrally by GC on a 36 month evolution, and are compatible with enterprise tools and devices",{"$f":"IF(#REF!=\"Input maturity\",\"\",IF((AL8+AK8)/2<=1,1,(AL8+AK8)/2))","v":{"$error":"#REF!"}},{"$f":"IF(#REF!=1,3,IF(#REF!=2,2,IF(#REF!=3,1,IF(#REF!=0,0))))","v":{"$error":"#REF!"}},{"$f":"(((AM8*#REF!)+(AP8*#REF!)+(AN8*#REF!)+(AO8*#REF!)))*10","v":{"$error":"#REF!"}},1,1,1,1]
[null,null,null,"1.1.3","Are retired devices disposed in a environmentally friendly manner?","No device recycling scheme is in place","Device recycling: no change for employees (back office)",null,null,null,false,false,false,2,{"$f":"SUMPRODUCT(--(K9:M9))","v":0},{"$f":"IF(O9=0,\"Minimal Change for Employee\",IF(O9<N9,\"LOW\",IF(O9=N9,\"MED\",\"HIGH\")))","v":"Minimal Change for Employee"},null,0,0,0,0,{"$f":"SUMPRODUCT(--L9,S9)","v":0},0,0,null,null,null,null,null,null,null,null,"Most devices are disposed of in an environmentally sustainable way by the department",null,"All GC devices and smartphones are recycled centrally in an environmentally sustainable way",{"$f":"IF(#REF!=\"Input maturity\",\"\",IF((AL9+AK9)/2<=1,1,(AL9+AK9)/2))","v":{"$error":"#REF!"}},{"$f":"IF(#REF!=1,3,IF(#REF!=2,2,IF(#REF!=3,1,IF(#REF!=0,0))))","v":{"$error":"#REF!"}},{"$f":"(((AM9*#REF!)+(AP9*#REF!)+(AN9*#REF!)+(AO9*#REF!)))*10","v":{"$error":"#REF!"}},0,0,0,0]
[null,null,null,"1.1.4","What functionality is offered to employees via their phones?","Employees are provided with phones with limited functionality (i.e. calls only, no data)","Phone devices: going from fix to portable ",null,null,null,true,false,false,2,{"$f":"SUMPRODUCT(--(K10:M10))","v":1},{"$f":"IF(O10=0,\"Minimal Change for Employee\",IF(O10<N10,\"LOW\",IF(O10=N10,\"MED\",\"HIGH\")))","v":"LOW"},null,0.25,0.25,0.5,0.25,{"$f":"SUMPRODUCT(--L10,S10)","v":0},0,0.25,2,null,"?",null,null,null,null,null,"Most employees are provided with a smartphone with good compatibility across devices (i.e. including data plan)",null,"All employees are issued with a GC managed smartphone (i.e. including data plan)",{"$f":"IF(#REF!=\"Input maturity\",\"\",IF((AL10+AK10)/2<=1,1,(AL10+AK10)/2))","v":{"$error":"#REF!"}},{"$f":"IF(#REF!=1,3,IF(#REF!=2,2,IF(#REF!=3,1,IF(#REF!=0,0))))","v":{"$error":"#REF!"}},{"$f":"(((AM10*#REF!)+(AP10*#REF!)+(AN10*#REF!)+(AO10*#REF!)))*10","v":{"$error":"#REF!"}},1,1,0,0]
[null,null,null,"1.1.5","How compatible are devices with tools and software and other devices used?","Devices have limited compatibility with most tools/software supplied by the department","Updated and compatible phone devices: new functionnalities ",null,null,null,true,false,false,2,1,"LOW",null,0.5,0.5,0,0.5,{"$f":"SUMPRODUCT(--L11,S11)","v":0},0,0.5,1,null,1,null,null,null,null,null,"Devices are compatible with most tools/software and other devices supplied by the department",null,"Devices are compatible with most tools/software and other devices supplied GC wide",{"$f":"IF(#REF!=\"Input maturity\",\"\",IF((AL11+AK11)/2<=1,1,(AL11+AK11)/2))","v":{"$error":"#REF!"}},{"$f":"IF(#REF!=1,3,IF(#REF!=2,2,IF(#REF!=3,1,IF(#REF!=0,0))))","v":{"$error":"#REF!"}},{"$f":"(((AM11*#REF!)+(AP11*#REF!)+(AN11*#REF!)+(AO11*#REF!)))*10","v":{"$error":"#REF!"}},1,1,1,1]
[null,1.2,"Connectivity","1.2.1","Is the wireless network fast, high performing and with large bandwidth capacity?","Unreliable connectivity and network coverage with slow speeds and poor bandwidth. Limited wireless network available at a department level ","Wi-fi: new functionnality ",null,null,null,true,true,false,2,2,"MED",null,0.5,0.25,0.25,0.5,{"$f":"SUMPRODUCT(--L12,S12)","v":0.25},0,0.75,1,null,1,null,null,null,null,null,"Department offers reliable connectivity and network coverage and adequate bandwidth and degradation no less than 50%. Wireless network is available across departmental buildings",null,"One wireless network experience across government for employees with bandwidth to provide network latency and degradation no less than 50%",{"$f":"IF(#REF!=\"Input maturity\",\"\",IF((AL12+AK12)/2<=1,1,(AL12+AK12)/2))","v":{"$error":"#REF!"}},{"$f":"IF(#REF!=1,3,IF(#REF!=2,2,IF(#REF!=3,1,IF(#REF!=0,0))))","v":{"$error":"#REF!"}},{"$f":"(((AM12*#REF!)+(AP12*#REF!)+(AN12*#REF!)+(AO12*#REF!)))*10","v":{"$error":"#REF!"}},1,1,0,1]
[null,null,null,"1.2.2","How are secret networks and infrastructure set up?","There is no separate secret/classified network within the department","Secret/classified network: new common IT tools and processes ",null,null,null,true,false,true,2,2,"MED",null,0.5,0.25,0.5,0.5,{"$f":"SUMPRODUCT(--L13,S13)","v":0},0.5,1,2,null,1,null,null,null,null,null,"There is a separate secret/classified network within the department",null,"One secret/classified government network and infrastructure across GC",{"$f":"IF(#REF!=\"Input maturity\",\"\",IF((AL13+AK13)/2<=1,1,(AL13+AK13)/2))","v":{"$error":"#REF!"}},{"$f":"IF(#REF!=1,3,IF(#REF!=2,2,IF(#REF!=3,1,IF(#REF!=0,0))))","v":{"$error":"#REF!"}},{"$f":"(((AM13*#REF!)+(AP13*#REF!)+(AN13*#REF!)+(AO13*#REF!)))*10","v":{"$error":"#REF!"}},0,0,1,0]
[null,null,null,"1.2.3","How does the department offer public wireless networks?","The department offers no public wireless network or no unified departmental network for the public","Public Wi-fi: increased connectivity ",null,null,null,true,true,false,2,2,"MED",null,0.5,0.25,0.5,{"$f":"SUMPRODUCT(--K14,R14)","v":0.5},{"$f":"SUMPRODUCT(--L14,S14)","v":0.25},{"$f":"SUMPRODUCT(--M14,T14)","v":0},{"$f":"SUM(U14,V14,W14)/100%","v":0.75},1,null,1,null,null,null,null,null,"Department offers one public/guest wireless network experience",null,"One wireless network experience across government for guests/public",{"$f":"IF(#REF!=\"Input maturity\",\"\",IF((AL14+AK14)/2<=1,1,(AL14+AK14)/2))","v":{"$error":"#REF!"}},{"$f":"IF(#REF!=1,3,IF(#REF!=2,2,IF(#REF!=3,1,IF(#REF!=0,0))))","v":{"$error":"#REF!"}},{"$f":"(((AM14*#REF!)+(AP14*#REF!)+(AN14*#REF!)+(AO14*#REF!)))*10","v":{"$error":"#REF!"}},1,0,0,1]
[null,null,null,"1.2.4","Is there secure VPN capability?","VPN capability available for most employees","VPN: increased connectivity and mobility ",null,null,null,true,true,true,2,3,"HIGH",null,0.5,0.25,0.5,0.5,0.25,0.5,1.25,2,null,"?",null,null,null,null,null,"Reliable VPN capability available to all employees at a department level",null,"Secure central GC VPN with scalable capacity",{"$f":"IF(#REF!=\"Input maturity\",\"\",IF((AL15+AK15)/2<=1,1,(AL15+AK15)/2))","v":{"$error":"#REF!"}},{"$f":"IF(#REF!=1,3,IF(#REF!=2,2,IF(#REF!=3,1,IF(#REF!=0,0))))","v":{"$error":"#REF!"}},{"$f":"(((AM15*#REF!)+(AP15*#REF!)+(AN15*#REF!)+(AO15*#REF!)))*10","v":{"$error":"#REF!"}},1,1,0,0]
[null,null,null,"1.2.5","Do employees have the ability to securely print wirelessly?","Employees can only print at designated locations through a physical network","Print-on-demand: new tool",null,null,null,true,true,false,2,2,"MED",null,0.5,0.25,0.5,0.5,0.25,0,0.75,1,null,1,null,null,null,null,null,"Employees have the ability to securely print wirelessly at all locations at a departmental level by smartphone or computer device",null,"Employees have the ability to securely print wirelessly (pull printing) at all locations centrally by GC from any GC device",{"$f":"IF(#REF!=\"Input maturity\",\"\",IF((AL16+AK16)/2<=1,1,(AL16+AK16)/2))","v":{"$error":"#REF!"}},{"$f":"IF(#REF!=1,3,IF(#REF!=2,2,IF(#REF!=3,1,IF(#REF!=0,0))))","v":{"$error":"#REF!"}},{"$f":"(((AM16*#REF!)+(AP16*#REF!)+(AN16*#REF!)+(AO16*#REF!)))*10","v":{"$error":"#REF!"}},1,0,0,0]
[null,null,null,"1.2.6","Is single sign on capability available?","No single sign on capability exists","Single sign on: new functionnality and process (back office) ",null,null,null,false,false,false,2,0,"Minimal Change for Employee",null,0.5,0.25,0.5,0,0,0,0,0,null,1,null,null,null,null,null,"Single sign on across most applications within the department",null,"Centralized GC single sign on across most applications via multi factor authentication (e.g. biometrics, passcodes)",{"$f":"IF(#REF!=\"Input maturity\",\"\",IF((AL17+AK17)/2<=1,1,(AL17+AK17)/2))","v":{"$error":"#REF!"}},{"$f":"IF(#REF!=1,3,IF(#REF!=2,2,IF(#REF!=3,1,IF(#REF!=0,0))))","v":{"$error":"#REF!"}},{"$f":"(((AM17*#REF!)+(AP17*#REF!)+(AN17*#REF!)+(AO17*#REF!)))*10","v":{"$error":"#REF!"}},0,1,1,0]
[null,1.3,"User Support","1.3.1","Is IT support accessible in-person and/or remotely with good response times?","IT support is only accessible on site in person with long response times (>5 minutes)","IT support: part of other change (back office)",null,null,null,false,false,false,2,0,"Minimal Change for Employee",null,0.5,0.25,0.5,0,0,0,0,null,null,null,null,null,null,null,null,"IT support is provided at a department level remotely or in person with good response times (<5 minutes)",null,"IT support is provided centrally across GC remotely or in person. There is also a self service knowledge portal available for support (Chatbot etc.) (<5 minutes). A call back service also exists ",{"$f":"IF(#REF!=\"Input maturity\",\"\",IF((AL18+AK18)/2<=1,1,(AL18+AK18)/2))","v":{"$error":"#REF!"}},{"$f":"IF(#REF!=1,3,IF(#REF!=2,2,IF(#REF!=3,1,IF(#REF!=0,0))))","v":{"$error":"#REF!"}},{"$f":"(((AM18*#REF!)+(AP18*#REF!)+(AN18*#REF!)+(AO18*#REF!)))*10","v":{"$error":"#REF!"}},1,1,0,1]
[null,null,null,"1.3.2","Is training/awareness of new IT tools and software offered as required?","Limited training/awareness of new IT tools and software is offered to employees","Training on IT tools: part of other change (back office)",null,null,null,false,false,false,2,0,"Minimal Change for Employee",null,0.5,0.25,0.5,0,0,0,0,null,null,null,null,null,null,null,null,"Training/awareness of new IT tools and software is frequently offered to employees by the department",null,"Training/awareness of new IT tools and software is frequently offered to employees GC-wide for all tools via innovative methods (e.g. virtual reality, augmented reality, video)",{"$f":"IF(#REF!=\"Input maturity\",\"\",IF((AL19+AK19)/2<=1,1,(AL19+AK19)/2))","v":{"$error":"#REF!"}},{"$f":"IF(#REF!=1,3,IF(#REF!=2,2,IF(#REF!=3,1,IF(#REF!=0,0))))","v":{"$error":"#REF!"}},{"$f":"(((AM19*#REF!)+(AP19*#REF!)+(AN19*#REF!)+(AO19*#REF!)))*10","v":{"$error":"#REF!"}},0,1,1,0]
[null,null,null,"1.3.3","What methods are employed to provide an efficient support network","Support is centered around traditional call centre type support","Peer to peer IT support network: part of other change (back office)",null,null,null,false,false,false,2,0,"Minimal Change for Employee",null,0.5,0.25,0.5,0,0,0,0,null,null,null,null,null,null,null,null,"The department provides the ability to access a peer to peer support network",null,"Machine learning is used to identify individual support needs based on employees' historical activities with an extensive peer to peer support network as back-up",{"$f":"IF(#REF!=\"Input maturity\",\"\",IF((AL20+AK20)/2<=1,1,(AL20+AK20)/2))","v":{"$error":"#REF!"}},{"$f":"IF(#REF!=1,3,IF(#REF!=2,2,IF(#REF!=3,1,IF(#REF!=0,0))))","v":{"$error":"#REF!"}},{"$f":"(((AM20*#REF!)+(AP20*#REF!)+(AN20*#REF!)+(AO20*#REF!)))*10","v":{"$error":"#REF!"}},0,1,0,0]
[null,1.4,"Tools and Software","1.4.1","Is video conferencing available widely available across all devices?","Videoconferencing is only available in boardrooms or desktops","Videoconferencing: new IT tools",null,null,null,true,true,false,2,2,"MED",null,0.5,0.25,0.5,0.5,0.25,0,0.75,2,null,1,null,null,null,null,null,"Videoconferencing is available in all boardrooms and across all devices in the department",null,"Videoconferencing is available GC-wide in all boardrooms and is interoperable across all devices and locations",{"$f":"IF(#REF!=\"Input maturity\",\"\",IF((AL21+AK21)/2<=1,1,(AL21+AK21)/2))","v":{"$error":"#REF!"}},{"$f":"IF(#REF!=1,3,IF(#REF!=2,2,IF(#REF!=3,1,IF(#REF!=0,0))))","v":{"$error":"#REF!"}},{"$f":"(((AM21*#REF!)+(AP21*#REF!)+(AN21*#REF!)+(AO21*#REF!)))*10","v":{"$error":"#REF!"}},1,1,1,0]
[null,null,null,"1.4.2","Is an instant messaging system accessible on all devices?","An instant messaging system is not used/not accessible on all devices/or messaging only","Instant Messaging: new IT tools",null,null,null,true,true,false,2,2,"MED",null,0.5,0.25,0.5,0.5,0.25,0,0.75,2,null,1,null,null,null,null,null,"A departmental instant messaging system exists and is accessible on all devices and smartphones that offers messaging, audio (with audio capture) and desktop sharing",null,"A central GC instant messaging system is accessible on all devices and smartphones that offers messaging/multiparty video conferencing, audio (with audio capture) and desktop sharing",{"$f":"IF(#REF!=\"Input maturity\",\"\",IF((AL22+AK22)/2<=1,1,(AL22+AK22)/2))","v":{"$error":"#REF!"}},{"$f":"IF(#REF!=1,3,IF(#REF!=2,2,IF(#REF!=3,1,IF(#REF!=0,0))))","v":{"$error":"#REF!"}},{"$f":"(((AM22*#REF!)+(AP22*#REF!)+(AN22*#REF!)+(AO22*#REF!)))*10","v":{"$error":"#REF!"}},1,1,1,0]
[null,null,null,"1.4.3","Are software collaboration tools available (i.e. G Suite or Office 365)?","Collaboration tools are not available","Collaboration tools: new IT tools",null,null,null,true,true,false,2,2,"MED",null,0.5,0.25,0.5,0.5,0.25,0,0.75,2,null,1,null,null,null,null,null,"Collaboration tools are available across the department with the ability to collaborate with any departmental employee and external contractor",null,"Central GC collaboration tools are available with the ability to collaborate with any government employee and external contractor",{"$f":"IF(#REF!=\"Input maturity\",\"\",IF((AL23+AK23)/2<=1,1,(AL23+AK23)/2))","v":{"$error":"#REF!"}},{"$f":"IF(#REF!=1,3,IF(#REF!=2,2,IF(#REF!=3,1,IF(#REF!=0,0))))","v":{"$error":"#REF!"}},{"$f":"(((AM23*#REF!)+(AP23*#REF!)+(AN23*#REF!)+(AO23*#REF!)))*10","v":{"$error":"#REF!"}},1,1,0,0]
[null,null,null,"1.4.4","Is a social collaboration platform available?","A social collaboration platform is not available","Collaboration platforms: new IT tools",null,null,null,true,true,false,2,2,"MED",null,0.5,0.25,0.5,0.5,0.25,0,0.75,2,null,1,null,null,null,null,null,"A departmental social collaboration platform is available",null,"A GC-wide social collaboration platform exists",{"$f":"IF(#REF!=\"Input maturity\",\"\",IF((AL24+AK24)/2<=1,1,(AL24+AK24)/2))","v":{"$error":"#REF!"}},{"$f":"IF(#REF!=1,3,IF(#REF!=2,2,IF(#REF!=3,1,IF(#REF!=0,0))))","v":{"$error":"#REF!"}},{"$f":"(((AM24*#REF!)+(AP24*#REF!)+(AN24*#REF!)+(AO24*#REF!)))*10","v":{"$error":"#REF!"}},1,1,0,0]
[null,null,null,"1.4.5","Is a reservation system provided?","A reservation system is not provided or used","Reservation system: new IT tools ",null,null,null,true,true,false,2,2,"MED",null,null,null,null,null,null,null,null,"2 (not for work points)",null,1,null,null,null,null,null,"A department wide reservation system exists for bookable work points, boardrooms and collaboration spaces",null,"A central GC reservation system and presence monitor exists and books work points based on the type of meetings and number of people within each meeting",{"$f":"IF(#REF!=\"Input maturity\",\"\",IF((AL25+AK25)/2<=1,1,(AL25+AK25)/2))","v":{"$error":"#REF!"}},{"$f":"IF(#REF!=1,3,IF(#REF!=2,2,IF(#REF!=3,1,IF(#REF!=0,0))))","v":{"$error":"#REF!"}},{"$f":"(((AM25*#REF!)+(AP25*#REF!)+(AN25*#REF!)+(AO25*#REF!)))*10","v":{"$error":"#REF!"}},1,1,1,1]
[null,null,null,"1.4.6","Are innovative tools and software available? (3D printers, virtual reality, computer aided design etc.)","Limited choice of innovative tools and software","Innovative tools and softwares: part of other change (back office)",null,null,null,false,false,false,2,0,"Minimal Change for Employee",null,null,null,null,null,null,null,null,null,null,null,null,null,null,null,null,"Some innovative tools and software are available",null,"Innovative tools and software are widely available, are accessible and can be booked in advance",{"$f":"IF(#REF!=\"Input maturity\",\"\",IF((AL26+AK26)/2<=1,1,(AL26+AK26)/2))","v":{"$error":"#REF!"}},{"$f":"IF(#REF!=1,3,IF(#REF!=2,2,IF(#REF!=3,1,IF(#REF!=0,0))))","v":{"$error":"#REF!"}},{"$f":"(((AM26*#REF!)+(AP26*#REF!)+(AN26*#REF!)+(AO26*#REF!)))*10","v":{"$error":"#REF!"}},0,1,0,1]
[null,null,null,"1.4.7","How are your software applications hosted?","Most applications/tools and software are on premise and internally supported","Cloud-based tools and softwares: part of other change (back office)",null,null,null,false,false,false,2,0,"Minimal Change for Employee",null,null,null,null,null,null,null,null,null,null,null,null,null,null,null,null,"Most applications/tools and software are cloud-based where they can be accessed on any device",null,"All applications/tools and software are SAAS and hosted on a Canadian-managed and approved cloud",{"$f":"IF(#REF!=\"Input maturity\",\"\",IF((AL27+AK27)/2<=1,1,(AL27+AK27)/2))","v":{"$error":"#REF!"}},{"$f":"IF(#REF!=1,3,IF(#REF!=2,2,IF(#REF!=3,1,IF(#REF!=0,0))))","v":{"$error":"#REF!"}},{"$f":"(((AM27*#REF!)+(AP27*#REF!)+(AN27*#REF!)+(AO27*#REF!)))*10","v":{"$error":"#REF!"}},1,0,0,0]
[null,null,null,"1.4.8","Are applications/tools accessible via mobile/smartphone/flexible?","Most applications/tools and software are not accessible via mobile/smartphone/flexible","Accessibility of applications via phones: new functionnality ",null,null,null,true,false,false,2,1,"LOW",null,null,null,null,null,null,null,null,1,null,1,null,null,null,null,null,"Most applications/tools and software promote mobile/smartphone/flexible working",null,"All applications/tools and software promote mobile/smartphone/flexible working",{"$f":"IF(#REF!=\"Input maturity\",\"\",IF((AL28+AK28)/2<=1,1,(AL28+AK28)/2))","v":{"$error":"#REF!"}},{"$f":"IF(#REF!=1,3,IF(#REF!=2,2,IF(#REF!=3,1,IF(#REF!=0,0))))","v":{"$error":"#REF!"}},{"$f":"(((AM28*#REF!)+(AP28*#REF!)+(AN28*#REF!)+(AO28*#REF!)))*10","v":{"$error":"#REF!"}},1,1,0,0]
[null,null,null,"1.4.9","Is an identity management system used?","An identity management system is not used consistently","ID management system: new functionnality ",null,null,null,false,true,false,2,1,"LOW",null,null,null,null,null,null,null,null,1,null,1,null,null,null,null,null,"An identity management system is used by the department (physical and digital)",null,"A centralized GC identity management system exists (physical and digital)",{"$f":"IF(#REF!=\"Input maturity\",\"\",IF((AL29+AK29)/2<=1,1,(AL29+AK29)/2))","v":{"$error":"#REF!"}},{"$f":"IF(#REF!=1,3,IF(#REF!=2,2,IF(#REF!=3,1,IF(#REF!=0,0))))","v":{"$error":"#REF!"}},{"$f":"(((AM29*#REF!)+(AP29*#REF!)+(AN29*#REF!)+(AO29*#REF!)))*10","v":{"$error":"#REF!"}},0,1,1,1]
[null,null,null,"1.4.10","Is digital technology used for signing authorities/approvals (e.g. biometrics or digital signatures)?","Digital technology is not used for signing authorities/approvals","Digital signatures: new functionnality",null,null,null,true,true,true,2,3,"HIGH",null,null,null,null,null,null,null,null,2,null,"30% (admin)",null,null,null,null,null,"Departmental application of digital technology used to for signing authorities/approvals (e.g. digital signatures)",null,"Central GC use of digital technology used to for signing authorities/approvals (e.g. biometric digital signatures)",{"$f":"IF(#REF!=\"Input maturity\",\"\",IF((AL30+AK30)/2<=1,1,(AL30+AK30)/2))","v":{"$error":"#REF!"}},{"$f":"IF(#REF!=1,3,IF(#REF!=2,2,IF(#REF!=3,1,IF(#REF!=0,0))))","v":{"$error":"#REF!"}},{"$f":"(((AM30*#REF!)+(AP30*#REF!)+(AN30*#REF!)+(AO30*#REF!)))*10","v":{"$error":"#REF!"}},0,1,1,0]
[null,null,null,"1.4.11","Do employees have a unified GC email and calendar client (e.g. all GC employees can see calendar availability)?","Email and calendar client exists at the department level and can not be shared across GC","GC email: new functionnality",null,null,null,false,true,true,2,2,"MED",null,null,null,null,null,null,null,null,2,null,"30% (admin)",null,null,null,null,null,"Some users use GC unified email and calendar client",null,"All GC employees use a unified GC email and calendar client",{"$f":"IF(#REF!=\"Input maturity\",\"\",IF((AL31+AK31)/2<=1,1,(AL31+AK31)/2))","v":{"$error":"#REF!"}},{"$f":"IF(#REF!=1,3,IF(#REF!=2,2,IF(#REF!=3,1,IF(#REF!=0,0))))","v":{"$error":"#REF!"}},{"$f":"(((AM31*#REF!)+(AP31*#REF!)+(AN31*#REF!)+(AO31*#REF!)))*10","v":{"$error":"#REF!"}},1,1,1,1]
[null,1.5,"Collaboration Assets","1.5.1","Do employees have access to collaboration assets (e.g. smart boards, TVs, whiteboards, writable surfaces etc.)?","Employees have limited access to collaboration assets","Collaboration assets: part of other change (back office)",null,null,null,false,false,false,2,0,"Minimal Change for Employee",null,null,null,null,null,null,null,null,null,null,null,null,null,null,null,null,"Employees have access to collaboration assets in any departmental office/hub",null,"Employees have access to collaboration assets in any GC office/hub with the latest technology offered",{"$f":"IF(#REF!=\"Input maturity\",\"\",IF((AL32+AK32)/2<=1,1,(AL32+AK32)/2))","v":{"$error":"#REF!"}},{"$f":"IF(#REF!=1,3,IF(#REF!=2,2,IF(#REF!=3,1,IF(#REF!=0,0))))","v":{"$error":"#REF!"}},{"$f":"(((AM32*#REF!)+(AP32*#REF!)+(AN32*#REF!)+(AO32*#REF!)))*10","v":{"$error":"#REF!"}},1,1,0,0]
[null,null,null,"1.5.2","How compatible are digital collaboration assets/tools with employee and contractor devices?","Digital collaboration assets/tools are typically incompatible with employee devices","Compatible collaboration assets: part of other change (back office)",null,null,null,false,false,false,2,0,"Minimal Change for Employee",null,null,null,null,null,null,null,null,null,null,null,null,null,null,null,null,"Digital collaboration assets/tools are compatible with all of the department's employee's devices",null,"Digital collaboration assets/tools are compatible with all GC-wide employee and contractor devices",{"$f":"IF(#REF!=\"Input maturity\",\"\",IF((AL33+AK33)/2<=1,1,(AL33+AK33)/2))","v":{"$error":"#REF!"}},{"$f":"IF(#REF!=1,3,IF(#REF!=2,2,IF(#REF!=3,1,IF(#REF!=0,0))))","v":{"$error":"#REF!"}},{"$f":"(((AM33*#REF!)+(AP33*#REF!)+(AN33*#REF!)+(AO33*#REF!)))*10","v":{"$error":"#REF!"}},1,1,0,0]
[null,2,"HR/OHS/PM",null,null,"Low",null,null,null,null,null,null,null,null,null,null,null,null,null,null,null,null,null,null,null,null,null,null,null,null,null,null,"Medium",null,"High","Priority for change","Priority for change","Priority for change"]
[null,2.1,"Policies and Agreements","2.1.1","Are policies, directives and collective agreements, that impact workplace conditions that allow flexible/remote and collaborative working (principles aligned with GCworkplace), applied consistently?","Policies, directives and collective agreements are not adapted to GCworkplace principles and not applied consistently",null,null,null,null,null,null,null,null,0,{"$f":"IF(O35=0,\"Minimal Change for Employee\",IF(O35<N35,\"LOW\",IF(O35=N35,\"MED\",\"HIGH\")))","v":"Minimal Change for Employee"},null,null,null,null,null,null,null,null,null,null,null,null,null,null,null,null,"Where possible, department considers and realigns policies, directives and collective agreements to adapt to changes based on GCworkplace principles. Analysis and consideration is given to development additional guidelines, strategies and tools in support for a mobile, flexible and agile workplace",null,"Policies, directives and collective agreements are adapted to the GCworkplace principles and are implemented consistently across the government. Where required, additional guidelines, strategies and tools are implemented where required to support a mobile, flexible and agile workplace",{"$f":"IF(#REF!=\"Input maturity\",\"\",IF((AL35+AK35)/2<=1,1,(AL35+AK35)/2))","v":{"$error":"#REF!"}},{"$f":"IF(#REF!=1,3,IF(#REF!=2,2,IF(#REF!=3,1,IF(#REF!=0,0))))","v":{"$error":"#REF!"}},{"$f":"(((AM35*#REF!)+(AP35*#REF!)+(AN35*#REF!)+(AO35*#REF!)))*10","v":{"$error":"#REF!"}},0,0,1,0]
[null,null,null,"2.1.2","Are work-related policies accessible GC-wide?","Ability to access policies immediately via self-service is difficult or impossible without contacting functional area",null,null,null,null,null,null,null,null,0,"Minimal Change for Employee",null,null,null,null,null,null,null,null,null,null,null,null,null,null,null,null,"All policies are easily available through self-service portal centrally located within the department",null,"A central GC self-service portal is accessible and user-friendly",{"$f":"IF(#REF!=\"Input maturity\",\"\",IF((AL36+AK36)/2<=1,1,(AL36+AK36)/2))","v":{"$error":"#REF!"}},{"$f":"IF(#REF!=1,3,IF(#REF!=2,2,IF(#REF!=3,1,IF(#REF!=0,0))))","v":{"$error":"#REF!"}},{"$f":"(((AM36*#REF!)+(AP36*#REF!)+(AN36*#REF!)+(AO36*#REF!)))*10","v":{"$error":"#REF!"}},0,0,0,1]
[null,2.2000000000000002,"Self-Service/ Communication","2.2.1","How are we ensuring the GC-wide connectivity on modern workplace issues and services?","Little or no communication regarding workplace issues and services",null,null,null,null,null,null,null,null,0,"Minimal Change for Employee",null,null,null,null,null,null,null,null,null,null,null,null,null,null,null,null,"Departmental communication on workplace issues and services are frequent, in plain language and timely",null,"Centralized GC-wide communication on workplace issues and services are frequent, in plain language and timely",{"$f":"IF(#REF!=\"Input maturity\",\"\",IF((AL37+AK37)/2<=1,1,(AL37+AK37)/2))","v":{"$error":"#REF!"}},{"$f":"IF(#REF!=1,3,IF(#REF!=2,2,IF(#REF!=3,1,IF(#REF!=0,0))))","v":{"$error":"#REF!"}},{"$f":"(((AM37*#REF!)+(AP37*#REF!)+(AN37*#REF!)+(AO37*#REF!)))*10","v":{"$error":"#REF!"}},1,0,0,0]
[null,2.2999999999999998,"People Management practices / Leadership / Managing staff","2.3.1","Is the employee performance program's objective to enable each employee to achieve their best performance?","Employee performance is measured by objectives and deliverables but managers are not well equipped or there is inconsistent application of performance measurement",null,null,null,null,null,null,null,null,0,"Minimal Change for Employee",null,null,null,null,null,null,null,null,null,null,null,null,null,null,null,null,"Employee performance is measured by objectives/key results against a departmental framework that promotes employee empowerment",null,"Employee performance is measured by KPIs and personal goals against a GC-wide framework and programs to support employees. Managers are well equipped and employees have full participation",{"$f":"IF(#REF!=\"Input maturity\",\"\",IF((AL38+AK38)/2<=1,1,(AL38+AK38)/2))","v":{"$error":"#REF!"}},{"$f":"IF(#REF!=1,3,IF(#REF!=2,2,IF(#REF!=3,1,IF(#REF!=0,0))))","v":{"$error":"#REF!"}},{"$f":"(((AM38*#REF!)+(AP38*#REF!)+(AN38*#REF!)+(AO38*#REF!)))*10","v":{"$error":"#REF!"}},1,1,1,1]
[null,null,null,"2.3.2","Does the department provide guidance, training and leadership on the performance management framework?","Guidance for performance management is available with training available for managers but managers and employees are not engaged in training nor see it as a priority",null,null,null,null,null,null,null,null,0,"Minimal Change for Employee",null,null,null,null,null,null,null,null,null,null,null,null,null,null,null,null,"Guidance for performance management is comprehensive at the department level, evidenced by Senior management, leadership, managers and employees seeing it as a priority",null,"Performance management is comprehensive, applied consistently. Training is available across multiple channels and employees and managers are integrating it as a valued exercise",{"$f":"IF(#REF!=\"Input maturity\",\"\",IF((AL39+AK39)/2<=1,1,(AL39+AK39)/2))","v":{"$error":"#REF!"}},{"$f":"IF(#REF!=1,3,IF(#REF!=2,2,IF(#REF!=3,1,IF(#REF!=0,0))))","v":{"$error":"#REF!"}},{"$f":"(((AM39*#REF!)+(AP39*#REF!)+(AN39*#REF!)+(AO39*#REF!)))*10","v":{"$error":"#REF!"}},1,1,1,1]
[null,2.4,"Digital/Modern ways of working in HR","2.4.1","Are we maximizing the use of existing technological solutions to promote collaboration and create a sustainable environment?","Lack of trust and lack of support in digital solutions create an inconsistent use of technological solutions",null,null,null,null,null,null,null,null,0,"Minimal Change for Employee",null,null,null,null,null,null,null,null,null,null,null,null,null,null,null,null,"Digital solutions exists and support exists and are trusted to some degree, though not fully adopted",null,"Digital solutions are utilized and trusted by all employees to maximize collaboration and ensure a sustainable environment",{"$f":"IF(#REF!=\"Input maturity\",\"\",IF((AL40+AK40)/2<=1,1,(AL40+AK40)/2))","v":{"$error":"#REF!"}},{"$f":"IF(#REF!=1,3,IF(#REF!=2,2,IF(#REF!=3,1,IF(#REF!=0,0))))","v":{"$error":"#REF!"}},{"$f":"(((AM40*#REF!)+(AP40*#REF!)+(AN40*#REF!)+(AO40*#REF!)))*10","v":{"$error":"#REF!"}},0,1,0,0]
[null,null,null,"2.4.2","Does the department adopt green sustainable work-related policies and activities?","Work-related policies have little or no consideration of green sustainability",null,null,null,null,null,null,null,null,0,"Minimal Change for Employee",null,null,null,null,null,null,null,null,null,null,null,null,null,null,null,null,"Department creates and encourages some green sustainable work-related policies and activities",null,"Active promotion and integration of green culture vision supported by policies and activities GC-wide",{"$f":"IF(#REF!=\"Input maturity\",\"\",IF((AL41+AK41)/2<=1,1,(AL41+AK41)/2))","v":{"$error":"#REF!"}},{"$f":"IF(#REF!=1,3,IF(#REF!=2,2,IF(#REF!=3,1,IF(#REF!=0,0))))","v":{"$error":"#REF!"}},{"$f":"(((AM41*#REF!)+(AP41*#REF!)+(AN41*#REF!)+(AO41*#REF!)))*10","v":{"$error":"#REF!"}},0,0,0,1]
[null,null,null,"2.4.3","Is virtual reality used for training?","No virtual reality used in training",null,null,null,null,null,null,null,null,0,"Minimal Change for Employee",null,null,null,null,null,null,null,null,null,null,null,null,null,null,null,null,"Sporadic use of virtual reality for training",null,"GC-wide use of virtual reality for training",{"$f":"IF(#REF!=\"Input maturity\",\"\",IF((AL42+AK42)/2<=1,1,(AL42+AK42)/2))","v":{"$error":"#REF!"}},{"$f":"IF(#REF!=1,3,IF(#REF!=2,2,IF(#REF!=3,1,IF(#REF!=0,0))))","v":{"$error":"#REF!"}},{"$f":"(((AM42*#REF!)+(AP42*#REF!)+(AN42*#REF!)+(AO42*#REF!)))*10","v":{"$error":"#REF!"}},1,0,0,0]
[null,null,null,"2.4.4","Is there guidance or corporate knowledge on how to use/find collaboration assets (e.g. training/support system/list of experts for using tools)?","Limited guidance or corporate knowledge on how to use/find collaboration assets",null,null,null,null,null,null,null,null,0,"Minimal Change for Employee",null,null,null,null,null,null,null,null,null,null,null,null,null,null,null,null,"Comprehensive guidance or corporate knowledge on how to use/find collaboration assets within the department",null,"Comprehensive guidance or corporate knowledge on how to use/find collaboration assets, plus access to GC-wide training and guidance",{"$f":"IF(#REF!=\"Input maturity\",\"\",IF((AL43+AK43)/2<=1,1,(AL43+AK43)/2))","v":{"$error":"#REF!"}},{"$f":"IF(#REF!=1,3,IF(#REF!=2,2,IF(#REF!=3,1,IF(#REF!=0,0))))","v":{"$error":"#REF!"}},{"$f":"(((AM43*#REF!)+(AP43*#REF!)+(AN43*#REF!)+(AO43*#REF!)))*10","v":{"$error":"#REF!"}},1,1,1,0]
[null,2.5,"Learning & Development","2.5.1","How are employees supported and encouraged to integrate mobile, modern, agile and flexible work practices?","Current culture resists the integration of mobile, modern, agile and flexible work practices",null,null,null,null,null,null,null,null,0,"Minimal Change for Employee",null,null,null,null,null,null,null,null,null,null,null,null,null,null,null,null,"Activities and programs are developed, resources are identified and available to create a culture change towards mobile, modern, agile and flexible workplace",null,"GC adopts and represents a culture of work environment for all employees in a mobile, modern, agile and flexible work practices",{"$f":"IF(#REF!=\"Input maturity\",\"\",IF((AL44+AK44)/2<=1,1,(AL44+AK44)/2))","v":{"$error":"#REF!"}},{"$f":"IF(#REF!=1,3,IF(#REF!=2,2,IF(#REF!=3,1,IF(#REF!=0,0))))","v":{"$error":"#REF!"}},{"$f":"(((AM44*#REF!)+(AP44*#REF!)+(AN44*#REF!)+(AO44*#REF!)))*10","v":{"$error":"#REF!"}},0,1,0,0]
[null,null,null,"2.5.2","Do we provide managers with modern, up to date people management training and promote the approach?","Lack of a mature and modern people management training and awareness ",null,null,null,null,null,null,null,null,0,"Minimal Change for Employee",null,null,null,null,null,null,null,null,null,null,null,null,null,null,null,null,"Senior leadership promote a modern people management approach and majority of managers attend training and learning activities on people management ",null,"All of the management-level champions demonstrate the modern people management approach, with all managers being trained in people management",{"$f":"IF(#REF!=\"Input maturity\",\"\",IF((AL45+AK45)/2<=1,1,(AL45+AK45)/2))","v":{"$error":"#REF!"}},{"$f":"IF(#REF!=1,3,IF(#REF!=2,2,IF(#REF!=3,1,IF(#REF!=0,0))))","v":{"$error":"#REF!"}},{"$f":"(((AM45*#REF!)+(AP45*#REF!)+(AN45*#REF!)+(AO45*#REF!)))*10","v":{"$error":"#REF!"}},1,1,1,1]
[null,2.6,"Occupational Health and Safety","2.6.1","Do we have consistent application of OHS policy and directives to create an integrated culture of a safe and healthy workplace for all public servants?","Applications are inconsistent, internally focused and not government wide on health and safety requirements",null,null,null,null,null,null,null,null,0,"Minimal Change for Employee",null,null,null,null,null,null,null,null,null,null,null,null,null,null,null,null,"Department has senior management engagement and some collaboration with other departments to develop and implement the requirements of a healthy and safe workplace",null,"Policies and standards are GC-wide and developed in collaboration with all key stakeholders; vision is fully integrated for all public servants to practice and promote a culture of a safe and healthy workplace ",{"$f":"IF(#REF!=\"Input maturity\",\"\",IF((AL46+AK46)/2<=1,1,(AL46+AK46)/2))","v":{"$error":"#REF!"}},{"$f":"IF(#REF!=1,3,IF(#REF!=2,2,IF(#REF!=3,1,IF(#REF!=0,0))))","v":{"$error":"#REF!"}},{"$f":"(((AM46*#REF!)+(AP46*#REF!)+(AN46*#REF!)+(AO46*#REF!)))*10","v":{"$error":"#REF!"}},1,0,1,1]
[null,3,"Information Management",null,null,"Low",null,null,null,null,null,null,null,null,null,null,null,null,null,null,null,null,null,null,null,null,null,null,null,null,null,null,"Medium",null,"High","Priority for change","Priority for change","Priority for change"]
[null,3.1,"Policies/ Processes/ Procedures","3.1.1","Are departmental IM policies reviewed and updated regularly?","GC-wide IM policies exist but have not been implemented across the department",null,null,null,null,null,null,null,null,0,null,null,null,null,null,null,null,null,null,null,null,null,null,null,null,null,null,"Central agency IM policies exist and are implemented across the department",null,"IM policies exist and are implemented across the GC",{"$f":"IF(#REF!=\"Input maturity\",\"\",IF((AL48+AK48)/2<=1,1,(AL48+AK48)/2))","v":{"$error":"#REF!"}},{"$f":"IF(#REF!=1,3,IF(#REF!=2,2,IF(#REF!=3,1,IF(#REF!=0,0))))","v":{"$error":"#REF!"}},{"$f":"(((AM48*#REF!)+(AP48*#REF!)+(AN48*#REF!)+(AO48*#REF!)))*10","v":{"$error":"#REF!"}},0,0,1,1]
[null,3.2,"Governance","3.2.1","Do you have an IM governance model?","An IM governance model is included but is not a high priority/there is no dedicated IM function within the department",null,null,null,null,null,null,null,null,0,null,null,null,null,null,null,null,null,null,null,null,null,null,null,null,null,null,"Dedicated IM governance function within the department is related to or includes Open Government, Data Management & Information Management",null,"GC IM function managed from a central GC IM body and federated to each department and is related to or includes Open Government, Data Management & Information Management",{"$f":"IF(#REF!=\"Input maturity\",\"\",IF((AL49+AK49)/2<=1,1,(AL49+AK49)/2))","v":{"$error":"#REF!"}},{"$f":"IF(#REF!=1,3,IF(#REF!=2,2,IF(#REF!=3,1,IF(#REF!=0,0))))","v":{"$error":"#REF!"}},{"$f":"(((AM49*#REF!)+(AP49*#REF!)+(AN49*#REF!)+(AO49*#REF!)))*10","v":{"$error":"#REF!"}},0,0,0,0]
[null,null,null,"3.2.2","Do you have IM resources to support information management/records keeping planning & governance?","Resources do not exist or have been identified but funding has not been secured",null,null,null,null,null,null,null,null,0,null,null,null,null,null,null,null,null,null,null,null,null,null,null,null,null,null,"IM resources are in place & funding is stable",null,"IM resources are in place & funding is integrated into corporate operations",{"$f":"IF(#REF!=\"Input maturity\",\"\",IF((AL50+AK50)/2<=1,1,(AL50+AK50)/2))","v":{"$error":"#REF!"}},{"$f":"IF(#REF!=1,3,IF(#REF!=2,2,IF(#REF!=3,1,IF(#REF!=0,0))))","v":{"$error":"#REF!"}},{"$f":"(((AM50*#REF!)+(AP50*#REF!)+(AN50*#REF!)+(AO50*#REF!)))*10","v":{"$error":"#REF!"}},0,0,0,0]
[null,3.3,"Information Holdings","3.3.1","Do employees have the ability to share and collaborate (through cloud file-sharing) on documents with colleagues on all security classifications?","Employees have limited ability to share and or collaborate on secure documents using a cloud-based system",null,null,null,null,null,null,null,null,0,null,null,null,null,null,null,null,null,null,null,null,null,null,null,null,null,null,"Employees have the ability to share and collaborate on documents using a cloud-based system with colleagues within the department, on all security classifications, where clearance and privileges allow",null,"Implemented collaboration tools that provide the ability to collaborate on documents using a cloud-based system with colleagues across departments GC-wide on all security classifications, where clearance and privileges allow",{"$f":"IF(#REF!=\"Input maturity\",\"\",IF((AL51+AK51)/2<=1,1,(AL51+AK51)/2))","v":{"$error":"#REF!"}},{"$f":"IF(#REF!=1,3,IF(#REF!=2,2,IF(#REF!=3,1,IF(#REF!=0,0))))","v":{"$error":"#REF!"}},{"$f":"(((AM51*#REF!)+(AP51*#REF!)+(AN51*#REF!)+(AO51*#REF!)))*10","v":{"$error":"#REF!"}},1,1,0,1]
[null,null,null,"3.3.2","What is the environment to manage physical (paper) and electronic data?","Departmental funding or strategy is not in place to digitize paper-based documents; limited/no ability to share paper based documents; mass storage of paper documents persist",null,null,null,null,null,null,null,null,0,null,null,null,null,null,null,null,null,null,null,null,null,null,null,null,null,null,"The department has low dependency on paper and fully manages electronic information",null,"Highly paper efficient i.e. only printing if needed and paper can be disposed of at users' convenience. Electronic information is managed within its automated lifecycle",{"$f":"IF(#REF!=\"Input maturity\",\"\",IF((AL52+AK52)/2<=1,1,(AL52+AK52)/2))","v":{"$error":"#REF!"}},{"$f":"IF(#REF!=1,3,IF(#REF!=2,2,IF(#REF!=3,1,IF(#REF!=0,0))))","v":{"$error":"#REF!"}},{"$f":"(((AM52*#REF!)+(AP52*#REF!)+(AN52*#REF!)+(AO52*#REF!)))*10","v":{"$error":"#REF!"}},0,1,1,0]
[null,null,null,"3.3.3","Does the department manage digital documents throughout the lifecycle?","Departmental branches are only able to manage paper information through its lifecycle and have no ability to manage digital documents",null,null,null,null,null,null,null,null,0,null,null,null,null,null,null,null,null,null,null,null,null,null,null,null,null,null,"Department has committed to managing only digital documents with the need for lifecycle management of paper greatly reduced",null,"IM lifecycle management is automated with digital lifecycle management in full effect",{"$f":"IF(#REF!=\"Input maturity\",\"\",IF((AL53+AK53)/2<=1,1,(AL53+AK53)/2))","v":{"$error":"#REF!"}},{"$f":"IF(#REF!=1,3,IF(#REF!=2,2,IF(#REF!=3,1,IF(#REF!=0,0))))","v":{"$error":"#REF!"}},{"$f":"(((AM53*#REF!)+(AP53*#REF!)+(AN53*#REF!)+(AO53*#REF!)))*10","v":{"$error":"#REF!"}},0,0,1,0]
[null,null,null,"3.3.4","How are documents being stored?","No departmental funding or strategy in place to digitize paper-based documents; limited/no ability to share paper based documents; mass storage of paper documents persist",null,null,null,null,null,null,null,null,0,null,null,null,null,null,null,null,null,null,null,null,null,null,null,null,null,null,"Departmental strategy and funding in place to digitize all paper documents relevant to the GC mandate; storage of paper documents actively being reduced",null,"All records are accessible digitally across GC; full indexing and search capabilities and all official documents being received/logged digitally; paper storage of documents heavily reduced",{"$f":"IF(#REF!=\"Input maturity\",\"\",IF((AL54+AK54)/2<=1,1,(AL54+AK54)/2))","v":{"$error":"#REF!"}},{"$f":"IF(#REF!=1,3,IF(#REF!=2,2,IF(#REF!=3,1,IF(#REF!=0,0))))","v":{"$error":"#REF!"}},{"$f":"(((AM54*#REF!)+(AP54*#REF!)+(AN54*#REF!)+(AO54*#REF!)))*10","v":{"$error":"#REF!"}},1,1,1,0]
[null,null,null,"3.3.5","Does your organization have capacity to perform Document discovery, Access to Information and Privacy (ATIP), Privacy etc. requests?","Limited capacity to perform document discovery, ATIP, Privacy etc.",null,null,null,null,null,null,null,null,0,null,null,null,null,null,null,null,null,null,null,null,null,null,null,null,null,null,"Departmental capacity to perform document discovery, ATIP, Privacy etc.",null,"GC-wide capacity to perform document discovery, ATIP, Privacy etc.",{"$f":"IF(#REF!=\"Input maturity\",\"\",IF((AL55+AK55)/2<=1,1,(AL55+AK55)/2))","v":{"$error":"#REF!"}},{"$f":"IF(#REF!=1,3,IF(#REF!=2,2,IF(#REF!=3,1,IF(#REF!=0,0))))","v":{"$error":"#REF!"}},{"$f":"(((AM55*#REF!)+(AP55*#REF!)+(AN55*#REF!)+(AO55*#REF!)))*10","v":{"$error":"#REF!"}},0,0,0,0]
[null,3.4,"Content Management Tools","3.4.1","How is information held within databases (centrally and unified or fragmented)?","Databases are not unified and are disparately held and controlled within the department",null,null,null,null,null,null,null,null,0,null,null,null,null,null,null,null,null,null,null,null,null,null,null,null,null,null,"Databases (HR, Security, Active Directory) are held, controlled and shared at the department level",null,"Centralized databases are controlled at the GC-level (HR, Security, Active directory) which are shared across departments",{"$f":"IF(#REF!=\"Input maturity\",\"\",IF((AL56+AK56)/2<=1,1,(AL56+AK56)/2))","v":{"$error":"#REF!"}},{"$f":"IF(#REF!=1,3,IF(#REF!=2,2,IF(#REF!=3,1,IF(#REF!=0,0))))","v":{"$error":"#REF!"}},{"$f":"(((AM56*#REF!)+(AP56*#REF!)+(AN56*#REF!)+(AO56*#REF!)))*10","v":{"$error":"#REF!"}},1,1,1,1]
[null,null,null,"3.4.2","Are business intelligence reports/dashboards automated and personalized?","Business intelligence reporting is a manual activity",null,null,null,null,null,null,null,null,0,null,null,null,null,null,null,null,null,null,null,null,null,null,null,null,null,null,"Business intelligence reports/dashboards are automated but are not personalized",null,"Business intelligence reports/dashboard are automated and personalized based on employee's role, preference and security clearance",{"$f":"IF(#REF!=\"Input maturity\",\"\",IF((AL57+AK57)/2<=1,1,(AL57+AK57)/2))","v":{"$error":"#REF!"}},{"$f":"IF(#REF!=1,3,IF(#REF!=2,2,IF(#REF!=3,1,IF(#REF!=0,0))))","v":{"$error":"#REF!"}},{"$f":"(((AM57*#REF!)+(AP57*#REF!)+(AN57*#REF!)+(AO57*#REF!)))*10","v":{"$error":"#REF!"}},0,0,0,0]
[null,null,null,"3.4.3","How is your document management system rolled out/implemented?","No departmental document management system exists or a disparate document management system is used across the department",null,null,null,null,null,null,null,null,0,null,null,null,null,null,null,null,null,null,null,null,null,null,null,null,null,null,"Centralized document management system used within the department and is integrated with several departmental applications",null,"GC-wide document management system, shared and managed centrally and is integrated with several departmental applications",{"$f":"IF(#REF!=\"Input maturity\",\"\",IF((AL58+AK58)/2<=1,1,(AL58+AK58)/2))","v":{"$error":"#REF!"}},{"$f":"IF(#REF!=1,3,IF(#REF!=2,2,IF(#REF!=3,1,IF(#REF!=0,0))))","v":{"$error":"#REF!"}},{"$f":"(((AM58*#REF!)+(AP58*#REF!)+(AN58*#REF!)+(AO58*#REF!)))*10","v":{"$error":"#REF!"}},0,1,1,0]
[null,null,null,"3.4.4","Does a cloud file-sharing solution exist within the organization?","Disparate cloud file-sharing solution exists within the department",null,null,null,null,null,null,null,null,0,null,null,null,null,null,null,null,null,null,null,null,null,null,null,null,null,null,"Cloud file-sharing solution exists at the department-level for sharing and working collaboratively",null,"A corporate cloud file-sharing solution is used GC-wide for working collaboratively",{"$f":"IF(#REF!=\"Input maturity\",\"\",IF((AL59+AK59)/2<=1,1,(AL59+AK59)/2))","v":{"$error":"#REF!"}},{"$f":"IF(#REF!=1,3,IF(#REF!=2,2,IF(#REF!=3,1,IF(#REF!=0,0))))","v":{"$error":"#REF!"}},{"$f":"(((AM59*#REF!)+(AP59*#REF!)+(AN59*#REF!)+(AO59*#REF!)))*10","v":{"$error":"#REF!"}},1,1,1,0]
[null,null,null,"3.4.5","How does the department manage its document lifecycle?","There are a lack of tools to manage lifecycle management/managed disposal of physical and digital data",null,null,null,null,null,null,null,null,0,null,null,null,null,null,null,null,null,null,null,null,null,null,null,null,null,null,"Document management lifecycle tools exists with management of physical disposal taking place at the department level",null,"Common GC-wide document management lifecycle tool exists/management of physical disposal and automated digital disposal takes place",{"$f":"IF(#REF!=\"Input maturity\",\"\",IF((AL60+AK60)/2<=1,1,(AL60+AK60)/2))","v":{"$error":"#REF!"}},{"$f":"IF(#REF!=1,3,IF(#REF!=2,2,IF(#REF!=3,1,IF(#REF!=0,0))))","v":{"$error":"#REF!"}},{"$f":"(((AM60*#REF!)+(AP60*#REF!)+(AN60*#REF!)+(AO60*#REF!)))*10","v":{"$error":"#REF!"}},1,0,1,0]
[null,null,null,"3.4.6","Does your organization have capacity to work on secret documents from more than one work point?","Limited ability to work on secret documents from more than one work point",null,null,null,null,null,null,null,null,0,null,null,null,null,null,null,null,null,null,null,null,null,null,null,null,null,null,"Departmental ability to work on secret materials from more than one work point",null,"GC-wide ability to work on secret materials from more than one work point",{"$f":"IF(#REF!=\"Input maturity\",\"\",IF((AL61+AK61)/2<=1,1,(AL61+AK61)/2))","v":{"$error":"#REF!"}},{"$f":"IF(#REF!=1,3,IF(#REF!=2,2,IF(#REF!=3,1,IF(#REF!=0,0))))","v":{"$error":"#REF!"}},{"$f":"(((AM61*#REF!)+(AP61*#REF!)+(AN61*#REF!)+(AO61*#REF!)))*10","v":{"$error":"#REF!"}},1,1,1,1]
[null,null,null,"3.4.7","How does the department manage duplication and version control of documents?","Tools are being used in an ad-hoc manner to identify duplicate documents",null,null,null,null,null,null,null,null,0,null,null,null,null,null,null,null,null,null,null,null,null,null,null,null,null,null,"Department has a tool to reduce electronic duplication",null,"A standardized and automated process exists to ensure a single source of truth for corporate information",{"$f":"IF(#REF!=\"Input maturity\",\"\",IF((AL62+AK62)/2<=1,1,(AL62+AK62)/2))","v":{"$error":"#REF!"}},{"$f":"IF(#REF!=1,3,IF(#REF!=2,2,IF(#REF!=3,1,IF(#REF!=0,0))))","v":{"$error":"#REF!"}},{"$f":"(((AM62*#REF!)+(AP62*#REF!)+(AN62*#REF!)+(AO62*#REF!)))*10","v":{"$error":"#REF!"}},1,1,1,0]
[null,null,null,"3.4.8","How does the department manage the capture of information resource of business value (IRBV) and information resource of enduring value (IREV) digital documentation when off boarding employees?","Limited capacity to capture IRBV and IREV digital documentation/assets when off-boarding employees",null,null,null,null,null,null,null,null,0,null,null,null,null,null,null,null,null,null,null,null,null,null,null,null,null,null,"Capacity to capture IRBV and IREV digital documentation/assets when off-boarding employees (GCDOCS)",null,"Automated capacity to capture e- documents of IRBV and IREV when off-boarding for GC",{"$f":"IF(#REF!=\"Input maturity\",\"\",IF((AL63+AK63)/2<=1,1,(AL63+AK63)/2))","v":{"$error":"#REF!"}},{"$f":"IF(#REF!=1,3,IF(#REF!=2,2,IF(#REF!=3,1,IF(#REF!=0,0))))","v":{"$error":"#REF!"}},{"$f":"(((AM63*#REF!)+(AP63*#REF!)+(AN63*#REF!)+(AO63*#REF!)))*10","v":{"$error":"#REF!"}},0,0,1,0]
[null,null,null,"3.4.9","Are document management tools able to automate security classification levels?","Limited departmental document management tool exists or being applied that allow multiple security classification levels to be accessed by employees with the correct security clearance and privileges",null,null,null,null,null,null,null,null,0,null,null,null,null,null,null,null,null,null,null,null,null,null,null,null,null,null,"Allows multiple security classification levels to be accessed by employees with the correct security clearance and privileges",null,"Document management tool that allows documents with multiple security classification levels to be accessed by employees with the correct security clearance & privileges and can be used/integrated with collaboration tools for GC",{"$f":"IF(#REF!=\"Input maturity\",\"\",IF((AL64+AK64)/2<=1,1,(AL64+AK64)/2))","v":{"$error":"#REF!"}},{"$f":"IF(#REF!=1,3,IF(#REF!=2,2,IF(#REF!=3,1,IF(#REF!=0,0))))","v":{"$error":"#REF!"}},{"$f":"(((AM64*#REF!)+(AP64*#REF!)+(AN64*#REF!)+(AO64*#REF!)))*10","v":{"$error":"#REF!"}},1,0,1,1]
[null,null,null,"3.4.10","Do you use auto classification tools for document and records management?","No auto document and records management tool exists, or a manual process exists though employees are relied on to append metadata",null,null,null,null,null,null,null,null,0,null,null,null,null,null,null,null,null,null,null,null,null,null,null,null,null,null,"Auto classification exists in the department and is used for the IM Document management tool (GCDOCS) ",null,"Auto classification exist for all IM databases, with artificial intelligence and machine learning capacity",{"$f":"IF(#REF!=\"Input maturity\",\"\",IF((AL65+AK65)/2<=1,1,(AL65+AK65)/2))","v":{"$error":"#REF!"}},{"$f":"IF(#REF!=1,3,IF(#REF!=2,2,IF(#REF!=3,1,IF(#REF!=0,0))))","v":{"$error":"#REF!"}},{"$f":"(((AM65*#REF!)+(AP65*#REF!)+(AN65*#REF!)+(AO65*#REF!)))*10","v":{"$error":"#REF!"}},0,0,1,0]
[null,null,null,"3.4.11","Is imaging software available and compliant to set standards?","Limited and inconsistent imaging software and standards used by Branch/Directorate/Division. Non-existent imaging software and not using standards Branch/Directorate/Division standards",null,null,null,null,null,null,null,null,0,null,null,null,null,null,null,null,null,null,null,null,null,null,null,null,null,null,"Imaging services are available and have applicable standards being applied across the department wide though supporting documentation is not comprehensive",null,"Imaging services are available and consistently use applicable standards GC-wide with supporting documentation widely available",{"$f":"IF(#REF!=\"Input maturity\",\"\",IF((AL66+AK66)/2<=1,1,(AL66+AK66)/2))","v":{"$error":"#REF!"}},{"$f":"IF(#REF!=1,3,IF(#REF!=2,2,IF(#REF!=3,1,IF(#REF!=0,0))))","v":{"$error":"#REF!"}},{"$f":"(((AM66*#REF!)+(AP66*#REF!)+(AN66*#REF!)+(AO66*#REF!)))*10","v":{"$error":"#REF!"}},0,0,0,0]
[null,null,null,"3.4.12","Do monitoring and reporting tools exist for quality control?","Limited and inconsistent monitoring and reporting tools exist",null,null,null,null,null,null,null,null,0,null,null,null,null,null,null,null,null,null,null,null,null,null,null,null,null,null,"Consistent departmental monitoring and reporting tools",null,"Centralized GC monitoring and reporting tools",{"$f":"IF(#REF!=\"Input maturity\",\"\",IF((AL67+AK67)/2<=1,1,(AL67+AK67)/2))","v":{"$error":"#REF!"}},{"$f":"IF(#REF!=1,3,IF(#REF!=2,2,IF(#REF!=3,1,IF(#REF!=0,0))))","v":{"$error":"#REF!"}},{"$f":"(((AM67*#REF!)+(AP67*#REF!)+(AN67*#REF!)+(AO67*#REF!)))*10","v":{"$error":"#REF!"}},0,0,0,0]
[null,3.5,"Support/ Awareness, Engagement and Training","3.5.1","How is your ability to communicate IM awareness, education and training ","Inconsistent ability to communicate on IM awareness, education, deliver training throughout the department",null,null,null,null,null,null,null,null,0,null,null,null,null,null,null,null,null,null,null,null,null,null,null,null,null,null,"Ability to communicate on IM awareness (departmental policy repository), education and deliver training on IM throughout the department is consistent",null,"Ability to communicate on IM awareness (GC policy repository), education and deliver training on IM throughout the GC is consistent during on boarding, and as required thereafter",{"$f":"IF(#REF!=\"Input maturity\",\"\",IF((AL68+AK68)/2<=1,1,(AL68+AK68)/2))","v":{"$error":"#REF!"}},{"$f":"IF(#REF!=1,3,IF(#REF!=2,2,IF(#REF!=3,1,IF(#REF!=0,0))))","v":{"$error":"#REF!"}},{"$f":"(((AM68*#REF!)+(AP68*#REF!)+(AN68*#REF!)+(AO68*#REF!)))*10","v":{"$error":"#REF!"}},0,1,0,0]
[null,null,null,"3.5.2","Does the department have the capability to help employees with an IM support network?","Unreliable access to departmental ongoing guidance and support",null,null,null,null,null,null,null,null,0,null,null,null,null,null,null,null,null,null,null,null,null,null,null,null,null,null,"Reliable capacity departmentally with varying expertise to provide IM help through the support desk with a strong network of contacts and power users",null,"Reliable employee capacity with varying expertise to provide IM help through the support desk with a strong network of contacts and power users for GC",{"$f":"IF(#REF!=\"Input maturity\",\"\",IF((AL69+AK69)/2<=1,1,(AL69+AK69)/2))","v":{"$error":"#REF!"}},{"$f":"IF(#REF!=1,3,IF(#REF!=2,2,IF(#REF!=3,1,IF(#REF!=0,0))))","v":{"$error":"#REF!"}},{"$f":"(((AM69*#REF!)+(AP69*#REF!)+(AN69*#REF!)+(AO69*#REF!)))*10","v":{"$error":"#REF!"}},0,0,0,0]
[null,4,"Security",null,null,"Low",null,null,null,null,null,null,null,null,null,null,null,null,null,null,null,null,null,null,null,null,null,null,null,null,null,null,"Medium",null,"High","Priority for change","Priority for change","Priority for change"]
[null,4.0999999999999996,"Security Policy","4.1.1","How well are security policies established and updated?","Departmental security policies are leveraged from the Treasury Board",null,null,null,null,null,null,null,null,0,null,null,null,null,null,null,null,null,null,null,null,null,null,null,null,null,null,"Departmental security policies are established and tailored to departmental requirements, they are updated regularly (every one to three years), or as required, and compliance with security is enforced",null,"GC-wide security policies are established in collaboration with the Treasury Board, implemented at a department-level They are updated on an annual basis and compliance is enforced",{"$f":"IF(#REF!=\"Input maturity\",\"\",IF((AL71+AK71)/2<=1,1,(AL71+AK71)/2))","v":{"$error":"#REF!"}},{"$f":"IF(#REF!=1,3,IF(#REF!=2,2,IF(#REF!=3,1,IF(#REF!=0,0))))","v":{"$error":"#REF!"}},{"$f":"(((AM71*#REF!)+(AP71*#REF!)+(AN71*#REF!)+(AO71*#REF!)))*10","v":{"$error":"#REF!"}},0,0,0,0]
[null,4.2,"Security Awareness","4.2.1","Does a security awareness program exist?","A security awareness program exists for employees but with limited media and resources",null,null,null,null,null,null,null,null,0,null,null,null,null,null,null,null,null,null,null,null,null,null,null,null,null,null,"Security awareness program covers the basic requirements of IT security, personnel security, information security and physical security using limited media and is at the department or agency level",null,"GC-wide security awareness program which provides frequent coverage of IT security, personnel security, information security and physical security using a wide-variety of approved media by TBS",{"$f":"IF(#REF!=\"Input maturity\",\"\",IF((AL72+AK72)/2<=1,1,(AL72+AK72)/2))","v":{"$error":"#REF!"}},{"$f":"IF(#REF!=1,3,IF(#REF!=2,2,IF(#REF!=3,1,IF(#REF!=0,0))))","v":{"$error":"#REF!"}},{"$f":"(((AM72*#REF!)+(AP72*#REF!)+(AN72*#REF!)+(AO72*#REF!)))*10","v":{"$error":"#REF!"}},0,0,1,1]
[null,null,null,"4.2.2","Is the security awareness program tailored to duties of employees?","Security awareness program and resources are rarely tailored to duties of employees",null,null,null,null,null,null,null,null,0,null,null,null,null,null,null,null,null,null,null,null,null,null,null,null,null,null,"Security awareness program and resources are sometimes tailored to duties of employees and exists at the department level",null,"GC-wide security awareness resources are tailored to the duties of employees (including high-risk users) GC-wide",{"$f":"IF(#REF!=\"Input maturity\",\"\",IF((AL73+AK73)/2<=1,1,(AL73+AK73)/2))","v":{"$error":"#REF!"}},{"$f":"IF(#REF!=1,3,IF(#REF!=2,2,IF(#REF!=3,1,IF(#REF!=0,0))))","v":{"$error":"#REF!"}},{"$f":"(((AM73*#REF!)+(AP73*#REF!)+(AN73*#REF!)+(AO73*#REF!)))*10","v":{"$error":"#REF!"}},0,0,1,0]
[null,null,null,"4.2.3","What resources do you have allocated to your security and awareness program?","Limited resources (< than 1 FTE [full time employee] for 2500 employees) are responsible for the security awareness program",null,null,null,null,null,null,null,null,{"$f":"SUMPRODUCT(--(K74:M74))","v":0},null,null,null,null,null,null,null,null,null,null,null,null,null,null,null,null,null,"Moderate resources (>1 FTE for 2500 employees) of resources are responsible for the security awareness program;",null,"Optimal resources (>2 FTEs for 2500 employees) in the security awareness program",{"$f":"IF(#REF!=\"Input maturity\",\"\",IF((AL74+AK74)/2<=1,1,(AL74+AK74)/2))","v":{"$error":"#REF!"}},{"$f":"IF(#REF!=1,3,IF(#REF!=2,2,IF(#REF!=3,1,IF(#REF!=0,0))))","v":{"$error":"#REF!"}},{"$f":"(((AM74*#REF!)+(AP74*#REF!)+(AN74*#REF!)+(AO74*#REF!)))*10","v":{"$error":"#REF!"}},0,0,0,0]
[null,4.3,"Information Security","4.3.1","How is the security classification marked within the department or agency?","Manual or no application of security classification/categorization of government information",null,null,null,null,null,null,null,null,0,null,null,null,null,null,null,null,null,null,null,null,null,null,null,null,null,null,"Manual application of security classification/categorization of government information, with some automation",null,"GC-wide automated tool with application of security classification/categorization of government information",{"$f":"IF(#REF!=\"Input maturity\",\"\",IF((AL75+AK75)/2<=1,1,(AL75+AK75)/2))","v":{"$error":"#REF!"}},{"$f":"IF(#REF!=1,3,IF(#REF!=2,2,IF(#REF!=3,1,IF(#REF!=0,0))))","v":{"$error":"#REF!"}},{"$f":"(((AM75*#REF!)+(AP75*#REF!)+(AN75*#REF!)+(AO75*#REF!)))*10","v":{"$error":"#REF!"}},0,0,1,1]
[null,null,null,"4.3.2","Is data classified/categorized correctly within the department or agency?","Security classifications/categorization are inconsistently or inaccurately applied to departmental or agency information",null,null,null,null,null,null,null,null,0,null,null,null,null,null,null,null,null,null,null,null,null,null,null,null,null,null,"Security classification/categorizations are often accurately applied to government information",null,"GC-wide security classifications/categorizations are consistently and accurately applied to government information",{"$f":"IF(#REF!=\"Input maturity\",\"\",IF((AL76+AK76)/2<=1,1,(AL76+AK76)/2))","v":{"$error":"#REF!"}},{"$f":"IF(#REF!=1,3,IF(#REF!=2,2,IF(#REF!=3,1,IF(#REF!=0,0))))","v":{"$error":"#REF!"}},{"$f":"(((AM76*#REF!)+(AP76*#REF!)+(AN76*#REF!)+(AO76*#REF!)))*10","v":{"$error":"#REF!"}},0,0,1,1]
[null,null,null,"4.3.3","How often are audits conducted of office space or electronic data repositories?","Department or agency performs audits and administrative investigations in response to incidents, as required",null,null,null,null,null,null,null,null,0,null,null,null,null,null,null,null,null,null,null,null,null,null,null,null,null,null,"Department or agency performs annual audits or security inspections (sweeps) of office space and electronic data repositories. Administrative investigations take place as required",null,"GC-wide audits or security inspections (sweeps) of office space and electronic data repositories are conducted based on an established auditing cycle, or as required, in addition to administrative investigations",{"$f":"IF(#REF!=\"Input maturity\",\"\",IF((AL77+AK77)/2<=1,1,(AL77+AK77)/2))","v":{"$error":"#REF!"}},{"$f":"IF(#REF!=1,3,IF(#REF!=2,2,IF(#REF!=3,1,IF(#REF!=0,0))))","v":{"$error":"#REF!"}},{"$f":"(((AM77*#REF!)+(AP77*#REF!)+(AN77*#REF!)+(AO77*#REF!)))*10","v":{"$error":"#REF!"}},0,0,0,0]
[null,null,null,"4.3.4","How secure is the storage and destruction of protected/sensitive information?","Approved containers and equipment for the storage and destruction of protected/sensitive information are provided, though only in limited locations, and may not meet the maximum classification/categorization level required within the department or agency",null,null,null,null,null,null,null,null,0,null,null,null,null,null,null,null,null,null,null,null,null,null,null,null,null,null,"Approved containers and equipment for the storage and destruction of protected/sensitive information are provided, in most locations, and meet the maximum classification/categorization level required within the department or agency",null,"GC-wide approved containers and equipment for the storage and destruction of protected/sensitive information are widely provided and meet the maximum classification/categorization level required",{"$f":"IF(#REF!=\"Input maturity\",\"\",IF((AL78+AK78)/2<=1,1,(AL78+AK78)/2))","v":{"$error":"#REF!"}},{"$f":"IF(#REF!=1,3,IF(#REF!=2,2,IF(#REF!=3,1,IF(#REF!=0,0))))","v":{"$error":"#REF!"}},{"$f":"(((AM78*#REF!)+(AP78*#REF!)+(AN78*#REF!)+(AO78*#REF!)))*10","v":{"$error":"#REF!"}},0,0,0,0]
[null,4.4000000000000004,"Personnel Security","4.4.1","How secure is access to government information, assets and/or facilities?","Access to government information, assets and/or facilities is not uniformly controlled at the department or agency level",null,null,null,null,null,null,null,null,0,null,null,null,null,null,null,null,null,null,null,null,null,null,null,null,null,null,"Access to government information, assets, facilities is controlled at the department or agency level using single or integrated access management system(s) and is limited to individuals with the appropriate security screening",null,"Access to government information, assets, facilities and zones, is controlled using GC-wide access management system and is limited to individuals with the appropriate security screening level",{"$f":"IF(#REF!=\"Input maturity\",\"\",IF((AL79+AK79)/2<=1,1,(AL79+AK79)/2))","v":{"$error":"#REF!"}},{"$f":"IF(#REF!=1,3,IF(#REF!=2,2,IF(#REF!=3,1,IF(#REF!=0,0))))","v":{"$error":"#REF!"}},{"$f":"(((AM79*#REF!)+(AP79*#REF!)+(AN79*#REF!)+(AO79*#REF!)))*10","v":{"$error":"#REF!"}},0,1,1,1]
[null,null,null,"4.4.2","How are security screening levels determined?","Security screening levels are departmentally determined, based on position and are inconsistent and non-transferable between GC departments/agencies",null,null,null,null,null,null,null,null,0,null,null,null,null,null,null,null,null,null,null,null,null,null,null,null,null,null,"Security screening levels are departmentally determined, based on position and are consistent with similar positions across the GC. Security screening levels are transferable between most GC departments and agencies",null,"Security screening levels are consistent across the GC, based on position and are transferable between GC departments and agencies",{"$f":"IF(#REF!=\"Input maturity\",\"\",IF((AL80+AK80)/2<=1,1,(AL80+AK80)/2))","v":{"$error":"#REF!"}},{"$f":"IF(#REF!=1,3,IF(#REF!=2,2,IF(#REF!=3,1,IF(#REF!=0,0))))","v":{"$error":"#REF!"}},{"$f":"(((AM80*#REF!)+(AP80*#REF!)+(AN80*#REF!)+(AO80*#REF!)))*10","v":{"$error":"#REF!"}},0,0,1,0]
[null,null,null,"4.4.3","How is access control controlled?","A formal process for granting and revoking access does not exist and the department or agency performs audits only when mandated by a central agency",null,null,null,null,null,null,null,null,0,null,null,null,null,null,null,null,null,null,null,null,null,null,null,null,null,null,"Department or agency determines the security screening level based on position consistent with similar positions in the GC. Department or agency performs access control audits annually",null,"A GC-wide process exists for granting/revoking access and GC-wide audits for access control (led by central agency) are performed on at least an annual basis",{"$f":"IF(#REF!=\"Input maturity\",\"\",IF((AL81+AK81)/2<=1,1,(AL81+AK81)/2))","v":{"$error":"#REF!"}},{"$f":"IF(#REF!=1,3,IF(#REF!=2,2,IF(#REF!=3,1,IF(#REF!=0,0))))","v":{"$error":"#REF!"}},{"$f":"(((AM81*#REF!)+(AP81*#REF!)+(AN81*#REF!)+(AO81*#REF!)))*10","v":{"$error":"#REF!"}},0,0,0,0]
[null,4.5,"Emergency management","4.5.1","How well are employees trained on what to do in the event of an emergency?","Employees have minimal training on what to do in the event of an emergency, though it is not tested, rehearsed or practiced",null,null,null,null,null,null,null,null,0,null,null,null,null,null,null,null,null,null,null,null,null,null,null,null,null,null,"Employees are trained in what they should do in the event of an emergency and have infrequent practices",null,"Employees understand their roles and responsibilities in the event of an emergency, regular drills, practices or simulations are conducted using a variety of scenarios",{"$f":"IF(#REF!=\"Input maturity\",\"\",IF((AL82+AK82)/2<=1,1,(AL82+AK82)/2))","v":{"$error":"#REF!"}},{"$f":"IF(#REF!=1,3,IF(#REF!=2,2,IF(#REF!=3,1,IF(#REF!=0,0))))","v":{"$error":"#REF!"}},{"$f":"(((AM82*#REF!)+(AP82*#REF!)+(AN82*#REF!)+(AO82*#REF!)))*10","v":{"$error":"#REF!"}},1,0,1,0]
[null,null,null,"4.5.2","How does the department manage its emergency management policies and strategies?","Emergency management policies, strategies and incident response plans are managed by the major tenant",null,null,null,null,null,null,null,null,0,null,null,null,null,null,null,null,null,null,null,null,null,null,null,null,null,null,"Department-level emergency management policy and strategy. Incident response plans are managed by the major tenant, but with a high degree of collaboration with minor tenants",null,"GC-wide emergency management policy and strategy with individualized emergency response plans for each building and hub held and controlled centrally",{"$f":"IF(#REF!=\"Input maturity\",\"\",IF((AL83+AK83)/2<=1,1,(AL83+AK83)/2))","v":{"$error":"#REF!"}},{"$f":"IF(#REF!=1,3,IF(#REF!=2,2,IF(#REF!=3,1,IF(#REF!=0,0))))","v":{"$error":"#REF!"}},{"$f":"(((AM83*#REF!)+(AP83*#REF!)+(AN83*#REF!)+(AO83*#REF!)))*10","v":{"$error":"#REF!"}},0,0,1,0]
[null,null,null,"4.5.3","How consistent are the department's emergency notifications?","Inconsistent emergency notifications within the department or agency",null,null,null,null,null,null,null,null,0,null,null,null,null,null,null,null,null,null,null,null,null,null,null,null,null,null,"Consistent emergency notifications to all employees at the same time within the department or agency",null,"Consistent GC emergency notifications to all employees at the same time, including locations of those who have accessibility needs",{"$f":"IF(#REF!=\"Input maturity\",\"\",IF((AL84+AK84)/2<=1,1,(AL84+AK84)/2))","v":{"$error":"#REF!"}},{"$f":"IF(#REF!=1,3,IF(#REF!=2,2,IF(#REF!=3,1,IF(#REF!=0,0))))","v":{"$error":"#REF!"}},{"$f":"(((AM84*#REF!)+(AP84*#REF!)+(AN84*#REF!)+(AO84*#REF!)))*10","v":{"$error":"#REF!"}},1,1,1,1]
[null,4.5999999999999996,"Physical security","4.6.1","How well are security considerations integrated into the planning, site selection, design, procurement, contracting, construction, modification, operation and maintenance of facilities?","Security considerations are partially integrated into the planning, site selection, design, procurement, contracting, construction, modification, operation and maintenance of facilities",null,null,null,null,null,null,null,null,0,null,null,null,null,null,null,null,null,null,null,null,null,null,null,null,null,null,"Security considerations are fully integrated into elements of the planning, site selection, design, procurement, contracting, construction, modification, operation and maintenance of facilities",null,"Lead agency is appointed to ensure security considerations are fully integrated into the planning, site selection, design, procurement, contracting, construction, modification, operation and maintenance of facilities GC-wide",{"$f":"IF(#REF!=\"Input maturity\",\"\",IF((AL85+AK85)/2<=1,1,(AL85+AK85)/2))","v":{"$error":"#REF!"}},{"$f":"IF(#REF!=1,3,IF(#REF!=2,2,IF(#REF!=3,1,IF(#REF!=0,0))))","v":{"$error":"#REF!"}},{"$f":"(((AM85*#REF!)+(AP85*#REF!)+(AN85*#REF!)+(AO85*#REF!)))*10","v":{"$error":"#REF!"}},0,0,0,0]
[null,null,null,"4.6.2","How are physical security and identity management systems implemented?","Department or agency uses multiple security and identity management systems to administer building access or have manual and/or lengthy processes in place",null,null,null,null,null,null,null,null,0,null,null,null,null,null,null,null,null,null,null,null,null,null,null,null,null,null,"Department or agency uses a single or integrated security, identity and access management system to administer building access efficiently",null,"A GC-wide security, identity and access management system is used to promptly administer building access for authorized individuals",{"$f":"IF(#REF!=\"Input maturity\",\"\",IF((AL86+AK86)/2<=1,1,(AL86+AK86)/2))","v":{"$error":"#REF!"}},{"$f":"IF(#REF!=1,3,IF(#REF!=2,2,IF(#REF!=3,1,IF(#REF!=0,0))))","v":{"$error":"#REF!"}},{"$f":"(((AM86*#REF!)+(AP86*#REF!)+(AN86*#REF!)+(AO86*#REF!)))*10","v":{"$error":"#REF!"}},0,0,1,1]
[null,null,null,"4.6.3","How is physical access granted?","Physical access is departmentally issued and employee access is restricted to primary work location as identified by the manager",null,null,null,null,null,null,null,null,0,null,null,null,null,null,null,null,null,null,null,null,null,null,null,null,null,null,"Physical access is departmentally issued for multiple work locations based on position",null,"Physical access is GC-issued, and GC personnel have access to appropriate fixed security zones in GC-hubs and to dynamic security zones (Protected B and Secret)",{"$f":"IF(#REF!=\"Input maturity\",\"\",IF((AL87+AK87)/2<=1,1,(AL87+AK87)/2))","v":{"$error":"#REF!"}},{"$f":"IF(#REF!=1,3,IF(#REF!=2,2,IF(#REF!=3,1,IF(#REF!=0,0))))","v":{"$error":"#REF!"}},{"$f":"(((AM87*#REF!)+(AP87*#REF!)+(AN87*#REF!)+(AO87*#REF!)))*10","v":{"$error":"#REF!"}},0,0,1,1]
[null,null,null,"4.6.4","What physical security methods are used for building access?","Use RFID to access buildings, floors and rooms within departments/agencies",null,null,null,null,null,null,null,null,0,null,null,null,null,null,null,null,null,null,null,null,null,null,null,null,null,null,"Use RFID to enter and exit buildings, floors and rooms in departments/agencies",null,"Use advanced technologies (e.g. biometrics) to enter and exit authorized GC locations, GC-wide",{"$f":"IF(#REF!=\"Input maturity\",\"\",IF((AL88+AK88)/2<=1,1,(AL88+AK88)/2))","v":{"$error":"#REF!"}},{"$f":"IF(#REF!=1,3,IF(#REF!=2,2,IF(#REF!=3,1,IF(#REF!=0,0))))","v":{"$error":"#REF!"}},{"$f":"(((AM88*#REF!)+(AP88*#REF!)+(AN88*#REF!)+(AO88*#REF!)))*10","v":{"$error":"#REF!"}},0,1,0,0]
[null,4.7,"IT Security","4.7.1","What measures are in place to prevent loss of GC data?","Department or agency has limited technical controls in place to safeguard and protect privacy of data at rest and in motion",null,null,null,null,null,null,null,null,0,null,null,null,null,null,null,null,null,null,null,null,null,null,null,null,null,null,"Department or agency has data classification and data loss prevention solution in place to safeguard and protect privacy of data at rest and in motion, including within the cloud",null,"There is a data classification and data loss prevention solution in place GC-wide to safeguard and protect privacy of data at rest and in motion including within the cloud",{"$f":"IF(#REF!=\"Input maturity\",\"\",IF((AL89+AK89)/2<=1,1,(AL89+AK89)/2))","v":{"$error":"#REF!"}},{"$f":"IF(#REF!=1,3,IF(#REF!=2,2,IF(#REF!=3,1,IF(#REF!=0,0))))","v":{"$error":"#REF!"}},{"$f":"(((AM89*#REF!)+(AP89*#REF!)+(AN89*#REF!)+(AO89*#REF!)))*10","v":{"$error":"#REF!"}},0,1,1,0]
[null,null,null,"4.7.2","Are systems and networks certified to the correct level?","Systems and networks are not certified to the required security level",null,null,null,null,null,null,null,null,0,null,null,null,null,null,null,null,null,null,null,null,null,null,null,null,null,null,"Some systems and networks are certified to the required security level",null,"GC-wide networks are certified to the required security level",{"$f":"IF(#REF!=\"Input maturity\",\"\",IF((AL90+AK90)/2<=1,1,(AL90+AK90)/2))","v":{"$error":"#REF!"}},{"$f":"IF(#REF!=1,3,IF(#REF!=2,2,IF(#REF!=3,1,IF(#REF!=0,0))))","v":{"$error":"#REF!"}},{"$f":"(((AM90*#REF!)+(AP90*#REF!)+(AN90*#REF!)+(AO90*#REF!)))*10","v":{"$error":"#REF!"}},0,0,1,0]
[null,null,null,"4.7.3","How much authorized access is there to your secret network or infrastructure?","Limited access to secret network or infrastructure for authorized users based on security clearance and the need-to-know principle",null,null,null,null,null,null,null,null,0,null,null,null,null,null,null,null,null,null,null,null,null,null,null,null,null,null,"Access to secret network or infrastructure available to most authorized users based on security clearance and the need-to-know principle",null,"GC-wide access to secret network or infrastructure available to all authorized users based on security clearance level and on the need-to-know principle",{"$f":"IF(#REF!=\"Input maturity\",\"\",IF((AL91+AK91)/2<=1,1,(AL91+AK91)/2))","v":{"$error":"#REF!"}},{"$f":"IF(#REF!=1,3,IF(#REF!=2,2,IF(#REF!=3,1,IF(#REF!=0,0))))","v":{"$error":"#REF!"}},{"$f":"(((AM91*#REF!)+(AP91*#REF!)+(AN91*#REF!)+(AO91*#REF!)))*10","v":{"$error":"#REF!"}},0,0,0,0]
[null,null,null,"4.7.4","How up to date are your systems and applications in terms of Security Assessment and Authorization (SA&A)?","Fewer than 60% of systems and applications have updated SA&A at the department or agency level",null,null,null,null,null,null,null,null,0,null,null,null,null,null,null,null,null,null,null,null,null,null,null,null,null,null,"Most systems (60%) and applications have updated SA&A at the department or agency level",null,"All systems and applications have updated SA&A throughout the System Development Life Cycle (SDLC) until disposal",{"$f":"IF(#REF!=\"Input maturity\",\"\",IF((AL92+AK92)/2<=1,1,(AL92+AK92)/2))","v":{"$error":"#REF!"}},{"$f":"IF(#REF!=1,3,IF(#REF!=2,2,IF(#REF!=3,1,IF(#REF!=0,0))))","v":{"$error":"#REF!"}},{"$f":"(((AM92*#REF!)+(AP92*#REF!)+(AN92*#REF!)+(AO92*#REF!)))*10","v":{"$error":"#REF!"}},1,0,1,0]
[null,5,"Facilities, Assets & Interior Design",null,null,"Low",null,null,null,null,null,null,null,null,null,null,null,null,null,null,null,null,null,null,null,null,null,null,null,null,null,null,"Medium",null,"High","Priority for change","Priority for change","Priority for change"]
[null,5.0999999999999996,"Accessibility","5.1.1","How well is inclusivity considered in the office layout and design?","Inclusivity is not consistently applied in office layout and design",null,null,null,null,null,null,null,null,0,null,null,null,null,null,null,null,null,null,null,null,null,null,null,null,null,null,"Inclusivity considerations are consistently applied in office layout and design across the department",null,"Inclusivity considerations are universally applied across all GC office layouts and design",{"$f":"IF(#REF!=\"Input maturity\",\"\",IF((AL94+AK94)/2<=1,1,(AL94+AK94)/2))","v":{"$error":"#REF!"}},{"$f":"IF(#REF!=1,3,IF(#REF!=2,2,IF(#REF!=3,1,IF(#REF!=0,0))))","v":{"$error":"#REF!"}},{"$f":"(((AM94*#REF!)+(AP94*#REF!)+(AN94*#REF!)+(AO94*#REF!)))*10","v":{"$error":"#REF!"}},1,0,0,1]
[null,null,null,"5.1.2","What work spaces do employees have access to after hours?","Employees have restricted access to departmental buildings after hours",null,null,null,null,null,null,null,null,0,null,null,null,null,null,null,null,null,null,null,null,null,null,null,null,null,null,"The department offers access to departmental hub buildings 24/7 to authorized departmental employees",null,"The GC offers access to hub buildings 24/7 to authorized GC employees",{"$f":"IF(#REF!=\"Input maturity\",\"\",IF((AL95+AK95)/2<=1,1,(AL95+AK95)/2))","v":{"$error":"#REF!"}},{"$f":"IF(#REF!=1,3,IF(#REF!=2,2,IF(#REF!=3,1,IF(#REF!=0,0))))","v":{"$error":"#REF!"}},{"$f":"(((AM95*#REF!)+(AP95*#REF!)+(AN95*#REF!)+(AO95*#REF!)))*10","v":{"$error":"#REF!"}},0,1,0,0]
[null,5.2,"Work points","5.2.1","Are employees provided multiple work points (including collaboration zones) to choose from?","Limited choice in type of work points available for employees",null,null,null,null,null,null,null,null,0,null,null,null,null,null,null,null,null,null,null,null,null,null,null,null,null,null,"Employees have several choices available for work point types",null,"Employees have a wide variety of work point types available",{"$f":"IF(#REF!=\"Input maturity\",\"\",IF((AL96+AK96)/2<=1,1,(AL96+AK96)/2))","v":{"$error":"#REF!"}},{"$f":"IF(#REF!=1,3,IF(#REF!=2,2,IF(#REF!=3,1,IF(#REF!=0,0))))","v":{"$error":"#REF!"}},{"$f":"(((AM96*#REF!)+(AP96*#REF!)+(AN96*#REF!)+(AO96*#REF!)))*10","v":{"$error":"#REF!"}},1,1,1,1]
[null,null,null,"5.2.2","Are employees free to work in any location with a variety of work point locations?","Employees have an assigned work point, (typically) in a fixed location and are not able to book via an online reservation system",null,null,null,null,null,null,null,null,0,null,null,null,null,null,null,null,null,null,null,null,null,null,null,null,null,null,"Employees have flexibility in choice of work point location across the department offices and departmental hubs and the department has an online reservation system",null,"Employees have flexibility in choice of work point location across all departments and GC hubs and a GC-wide online reservation system exists, with reservations automatically made, based on schedules",{"$f":"IF(#REF!=\"Input maturity\",\"\",IF((AL97+AK97)/2<=1,1,(AL97+AK97)/2))","v":{"$error":"#REF!"}},{"$f":"IF(#REF!=1,3,IF(#REF!=2,2,IF(#REF!=3,1,IF(#REF!=0,0))))","v":{"$error":"#REF!"}},{"$f":"(((AM97*#REF!)+(AP97*#REF!)+(AN97*#REF!)+(AO97*#REF!)))*10","v":{"$error":"#REF!"}},1,1,1,0]
[null,null,null,"5.2.3","Do work points have ergonomic considerations factored in (e.g. adjustable furniture)?","Ergonomic considerations are inconsistent",null,null,null,null,null,null,null,null,0,null,null,null,null,null,null,null,null,null,null,null,null,null,null,null,null,null,"Ergonomic considerations are factored into work points consistently across the department, including sit/stand capabilities",null,"Ergonomic considerations are factored into work points consistently GC-wide, including sit/stand capabilities",{"$f":"IF(#REF!=\"Input maturity\",\"\",IF((AL98+AK98)/2<=1,1,(AL98+AK98)/2))","v":{"$error":"#REF!"}},{"$f":"IF(#REF!=1,3,IF(#REF!=2,2,IF(#REF!=3,1,IF(#REF!=0,0))))","v":{"$error":"#REF!"}},{"$f":"(((AM98*#REF!)+(AP98*#REF!)+(AN98*#REF!)+(AO98*#REF!)))*10","v":{"$error":"#REF!"}},1,1,0,1]
[null,5.3,"Facilities","5.3.1","Do employees have access to a healthy environment (e.g. gyms, cafes, access to healthy foods, bike racks etc.)?","Departmental facilities are not offering a healthy environment",null,null,null,null,null,null,null,null,0,null,null,null,null,null,null,null,null,null,null,null,null,null,null,null,null,null,"Departmental facilities are comprehensive in offering a healthy environment",null,"Employees are able to use GC-wide facilities that are comprehensive in offering a healthy environment",{"$f":"IF(#REF!=\"Input maturity\",\"\",IF((AL99+AK99)/2<=1,1,(AL99+AK99)/2))","v":{"$error":"#REF!"}},{"$f":"IF(#REF!=1,3,IF(#REF!=2,2,IF(#REF!=3,1,IF(#REF!=0,0))))","v":{"$error":"#REF!"}},{"$f":"(((AM99*#REF!)+(AP99*#REF!)+(AN99*#REF!)+(AO99*#REF!)))*10","v":{"$error":"#REF!"}},1,0,0,1]
[null,null,null,"5.3.2","How environmentally friendly are the facilities?","Departmental facilities have a high carbon footprint/offer no renewable method of energy generation and/or little to no recycling",null,null,null,null,null,null,null,null,0,null,null,null,null,null,null,null,null,null,null,null,null,null,null,null,null,null,"Departmental facilities have a low carbon footprint/offer some renewable method of energy generation and comprehensive recycling",null,"Facilities are consistent GC-wide in having a carbon neutral footprint/offer renewable methods of energy generation, have a water conservation scheme and comprehensive recycling",{"$f":"IF(#REF!=\"Input maturity\",\"\",IF((AL100+AK100)/2<=1,1,(AL100+AK100)/2))","v":{"$error":"#REF!"}},{"$f":"IF(#REF!=1,3,IF(#REF!=2,2,IF(#REF!=3,1,IF(#REF!=0,0))))","v":{"$error":"#REF!"}},{"$f":"(((AM100*#REF!)+(AP100*#REF!)+(AN100*#REF!)+(AO100*#REF!)))*10","v":{"$error":"#REF!"}},1,0,1,1]
[null,null,null,"5.3.3","How 'smart' are the office spaces?","Most office space is not smart and has manual functions (e.g. blinds, lights etc.)",null,null,null,null,null,null,null,null,0,null,null,null,null,null,null,null,null,null,null,null,null,null,null,null,null,null,"All departmental office spaces are smart, offering automated functions (e.g. auto blinds, smart elevators, auto lights, automatic temperature regulation etc.)",null,"Office spaces are smart and consistent with GC-wide office space offering automated functions (e.g. auto blinds, smart elevators, auto lights, automatic temperature regulation etc.)",{"$f":"IF(#REF!=\"Input maturity\",\"\",IF((AL101+AK101)/2<=1,1,(AL101+AK101)/2))","v":{"$error":"#REF!"}},{"$f":"IF(#REF!=1,3,IF(#REF!=2,2,IF(#REF!=3,1,IF(#REF!=0,0))))","v":{"$error":"#REF!"}},{"$f":"(((AM101*#REF!)+(AP101*#REF!)+(AN101*#REF!)+(AO101*#REF!)))*10","v":{"$error":"#REF!"}},1,0,0,1]
[null,null,null,"5.3.4","Do your facilities have  an internationally recognized accreditation","Leased and Crown facilities have no accreditation",null,null,null,null,null,null,null,null,0,null,null,null,null,null,null,null,null,null,null,null,null,null,null,null,null,null,"Leased and Crown facilities have an accreditation",null,"Leased and Crown facilities have an accreditation demonstrating leading performance",{"$f":"IF(#REF!=\"Input maturity\",\"\",IF((AL102+AK102)/2<=1,1,(AL102+AK102)/2))","v":{"$error":"#REF!"}},{"$f":"IF(#REF!=1,3,IF(#REF!=2,2,IF(#REF!=3,1,IF(#REF!=0,0))))","v":{"$error":"#REF!"}},{"$f":"(((AM102*#REF!)+(AP102*#REF!)+(AN102*#REF!)+(AO102*#REF!)))*10","v":{"$error":"#REF!"}},0,0,1,0]
[null,null,null,"5.3.5","Does your workplace offer storage for your personal effects?","Employees have no choice in type of storage/locker or nothing is offered",null,null,null,null,null,null,null,null,0,null,null,null,null,null,null,null,null,null,null,null,null,null,null,null,null,null,"Employees have a choice of permanent/flexible storage/locker across departmental locations",null,"Employees have a choice of permanent/flexible storage/lockers across all GC locations",{"$f":"IF(#REF!=\"Input maturity\",\"\",IF((AL103+AK103)/2<=1,1,(AL103+AK103)/2))","v":{"$error":"#REF!"}},{"$f":"IF(#REF!=1,3,IF(#REF!=2,2,IF(#REF!=3,1,IF(#REF!=0,0))))","v":{"$error":"#REF!"}},{"$f":"(((AM103*#REF!)+(AP103*#REF!)+(AN103*#REF!)+(AO103*#REF!)))*10","v":{"$error":"#REF!"}},1,0,1,1]
[null,null,null,"5.3.6","Does your workplace offer the means to travel between buildings? (e.g. green transportation system, shuttle system etc.)","The workplace does not offer the means to travel between buildings",null,null,null,null,null,null,null,null,0,null,null,null,null,null,null,null,null,null,null,null,null,null,null,null,null,null,"The workplace offers the means to travel between departmental buildings with some environmental considerations",null,"The workplace offers the means to travel between GC buildings with high environmental considerations",{"$f":"IF(#REF!=\"Input maturity\",\"\",IF((AL104+AK104)/2<=1,1,(AL104+AK104)/2))","v":{"$error":"#REF!"}},{"$f":"IF(#REF!=1,3,IF(#REF!=2,2,IF(#REF!=3,1,IF(#REF!=0,0))))","v":{"$error":"#REF!"}},{"$f":"(((AM104*#REF!)+(AP104*#REF!)+(AN104*#REF!)+(AO104*#REF!)))*10","v":{"$error":"#REF!"}},1,1,1,0]
[null,5.4,"Interior Design","5.4.1","Does your workplace offer an inspiring environment? (e.g. natural light, motivating colors etc.)","Department does not offer an interior design that provides an inspiring work environment",null,null,null,null,null,null,null,null,0,null,null,null,null,null,null,null,null,null,null,null,null,null,null,null,null,null,"Department offers a consistent interior design across all offices in the department that provides an inspiring work environment",null,"The GC offers a consistent interior design GC-wide, with offices that provide an inspiring work environment",{"$f":"IF(#REF!=\"Input maturity\",\"\",IF((AL105+AK105)/2<=1,1,(AL105+AK105)/2))","v":{"$error":"#REF!"}},{"$f":"IF(#REF!=1,3,IF(#REF!=2,2,IF(#REF!=3,1,IF(#REF!=0,0))))","v":{"$error":"#REF!"}},{"$f":"(((AM105*#REF!)+(AP105*#REF!)+(AN105*#REF!)+(AO105*#REF!)))*10","v":{"$error":"#REF!"}},0,0,1,1]
[null,null,null,"5.4.2","How well do your offices use assets (e.g. privacy glass, security zoning, privacy screens etc.) that promote security?","The interior design of department offices do not use assets that promote security or they are not used properly",null,null,null,null,null,null,null,null,0,null,null,null,null,null,null,null,null,null,null,null,null,null,null,null,null,null,"The interior design of department offices uses some assets in the correct way to promote security",null,"The interior design of GC offices comprehensively uses assets that promote security in a consistent manner that follows best practices",{"$f":"IF(#REF!=\"Input maturity\",\"\",IF((AL106+AK106)/2<=1,1,(AL106+AK106)/2))","v":{"$error":"#REF!"}},{"$f":"IF(#REF!=1,3,IF(#REF!=2,2,IF(#REF!=3,1,IF(#REF!=0,0))))","v":{"$error":"#REF!"}},{"$f":"(((AM106*#REF!)+(AP106*#REF!)+(AN106*#REF!)+(AO106*#REF!)))*10","v":{"$error":"#REF!"}},1,0,0,1]
[null,null,null,"5.4.3","How well does office interior design promote collaboration (e.g. writable walls, collaboration spaces etc.)?","The interior design of department offices limits collaboration",null,null,null,null,null,null,null,null,0,null,null,null,null,null,null,null,null,null,null,null,null,null,null,null,null,null,"The interior design of department offices promote collaboration for people within the department",null,"The interior design of GC offices promote collaboration for all employees",{"$f":"IF(#REF!=\"Input maturity\",\"\",IF((AL107+AK107)/2<=1,1,(AL107+AK107)/2))","v":{"$error":"#REF!"}},{"$f":"IF(#REF!=1,3,IF(#REF!=2,2,IF(#REF!=3,1,IF(#REF!=0,0))))","v":{"$error":"#REF!"}},{"$f":"(((AM107*#REF!)+(AP107*#REF!)+(AN107*#REF!)+(AO107*#REF!)))*10","v":{"$error":"#REF!"}},1,1,0,1]
[null,null,null,"5.4.4","How well do your offices offer non-work related activities (e.g. ping-pong tables etc.)?","The department offers few spaces dedicated to non-work related activities",null,null,null,null,null,null,null,null,0,null,null,null,null,null,null,null,null,null,null,null,null,null,null,null,null,null,"The department offers some spaces dedicated to non-work related activities",null,"The department offers comprehensive amount of spaces dedicated to non-work related activities",{"$f":"IF(#REF!=\"Input maturity\",\"\",IF((AL108+AK108)/2<=1,1,(AL108+AK108)/2))","v":{"$error":"#REF!"}},{"$f":"IF(#REF!=1,3,IF(#REF!=2,2,IF(#REF!=3,1,IF(#REF!=0,0))))","v":{"$error":"#REF!"}},{"$f":"(((AM108*#REF!)+(AP108*#REF!)+(AN108*#REF!)+(AO108*#REF!)))*10","v":{"$error":"#REF!"}},0,0,1,1]
[null,null,null,"5.4.5","Does your current workplace offer a variety of work zones that suits your needs and preferences? (e.g. 'Do not disturb me' zone, Collaboration Space, Activities Area)","The department does not offer a workplace with different work zones",null,null,null,null,null,null,null,null,0,null,null,null,null,null,null,null,null,null,null,null,null,null,null,null,null,null,"The department offers a workplace that promotes a variety of work zones",null,"The GC offers an efficient and effective workplace that promotes a wide variety of work zones",{"$f":"IF(#REF!=\"Input maturity\",\"\",IF((AL109+AK109)/2<=1,1,(AL109+AK109)/2))","v":{"$error":"#REF!"}},{"$f":"IF(#REF!=1,3,IF(#REF!=2,2,IF(#REF!=3,1,IF(#REF!=0,0))))","v":{"$error":"#REF!"}},{"$f":"(((AM109*#REF!)+(AP109*#REF!)+(AN109*#REF!)+(AO109*#REF!)))*10","v":{"$error":"#REF!"}},1,1,0,1]

{"sheet":"List Dropdown Menu","index":8,"n_rows":10,"n_cols":3,"rows_kept":10,"cut":false,"hidden":true,"merged":[[0,0,0,8]]}
["List of dropdown"]
[]
[]
["Scale",null,"Scale1to5"]
[0,"no impact",1]
[1,"extramely low impact",2]
[2,"low",3]
[3,"moderate",4]
[4,"high impact",5]
[5,"extramely high impact"]