{"text_format":"1","workbook":"xlsx","n_sheets":9,"sheets":["Guide","Links_Liens","BB Eligibility_Eligibilite PB","Adm Measures_Mesures Adm","Language terms","General Information Générale","AOLS Codes NNCLO","LSI Codes SLT","Sheet1"],"not_rendered":{"charts":0,"images":0,"macros":1,"external_links":0,"defined_names":0,"comments":0,"pivot_tables":0},"unopened":[],"bounds":{"document_bytes":16777216,"sheet_cells":100000,"rows_first":2000,"rows_last":500,"rows_between":2000,"halvings":0,"cell_chars":16384,"cell_head_chars":4096},"cells_cut":0,"cells_raw":0,"read":"whole","date_system":"1900"}

{"sheet":"Guide","index":0,"n_rows":7,"n_cols":8,"rows_kept":7,"cut":false,"hidden":false,"merged":[]}
["To be used by depts using the new codes",null,"À être utilisé par les départements qui font usage de ces codes"]
["Step 1 - Review AOLS codes definition\n\nSelect AOLS Codes NNCLO tab\nLines 2 to 12 = Active codes",null,"Étape 1 - Révision de la définition des codes NNCLO\n\nSélectionnez l'onglet LSI Codes SLT\nLignes 2 à 12 = Codes actifs"]
[null,"Step 2 - Review LSI Codes definition\n\nSelect LSI Codes tab\nLines 2 to 11 = Active codes",null,"Étape 2 - Révision de la définition des codes SLT\n\nSélectionner l'onglet LSI Codes SLT\nLignes 2 à 11 = Codes actifs"]
[null,null,"Step 3 - OL Tool \n\nSelect OL Tool_Outil LO tab ",null,"Étape 3 - Outil LO\n\nSélectionner l'onglet \nOL Tool_Outil LO\n"]
[null,null,null,"Step 4 - Action\n\nSelect an Action from the drop down list\nEx: Appointment (non-imperative)",null,"Étape 4 - Action\n\nSélectionner une action a partir de la liste déroulante\nEx: Nomination (non-impérative)"]
[null,null,null,null,"Step 5 - Revision\n\nValidate the selected AOLS and LSI definitions.\nEx: Action: Appointment\nAOLS 13 displays\nLSI 10-14-15 displays\n",null,"Étape 5 - Révision\n\nValidez la valeur du champ NNCLO avec le code SLT  correspondant. \nEx: Action: Nomination\nNNCLO 13 s'affiche\nLSI 10-14-15 s'affichent\n"]
[null,null,null,null,null,"Step 6- Revision\n\nValidate the selected AOLS and LSI definitions.\nEx: Action: Appointment\nAOLS 13 displays\nSelect the SLT code that correspond to the position linguistic requirements\n",null,"Étape 6 - Révision\n\nValidez  les valeurs NNCLO et SLT selectionnées en vous referant aux définitions qui s'affichent.\nEx: Action: Nomination\nNNCLO 13 s'affiche\nAssurez-vous de sélectionner le code SLT qui correspond aux exigences linguistiques du poste\n"]

{"sheet":"Links_Liens","index":1,"n_rows":7,"n_cols":2,"rows_kept":7,"cut":false,"hidden":false,"merged":[]}
["English","Français"]
["Bilingualism Bonus Directive (njc-cnm.gc.ca)","Directive sur la prime au bilinguisme (njc-cnm.gc.ca)."]
["Public Service Official Languages Exclusion Approval Order – Canada.ca","Décret d’exemption concernant les langues officielles dans la fonction publique – Canada.ca"]
["Public Service Employment Regulations (justice.gc.ca)","Règlement sur l’emploi dans la fonction publique (justice.gc.ca)"]
["National Joint Council Bilingual Bonus Directive 1.4.1","Directive sur la prime au bilinguisme du Conseil national mixte, section 1.4.1"]
["National Joint Council Bilingual Bonus Directive 1.4.2","Directive sur la prime au bilinguisme du Conseil national mixte, section 1.4.2"]
["National Joint Council Bilingual Bonus Directive 1.2.1, 1.3","Directive sur la prime au bilinguisme du Conseil national mixte, sections 1.2.1 et 1.3"]

{"sheet":"BB Eligibility_Eligibilite PB","index":2,"n_rows":22,"n_cols":3,"rows_kept":22,"cut":false,"hidden":false,"merged":[[0,0,0,2],[3,2,10,2],[4,0,10,0],[14,2,21,2],[15,0,21,0],[11,0,11,2]]}
["ENGLISH"]
["Bilingual Bonus Eligibility"]
["1.1 Eligibility","1.1.2 The bilingualism bonus shall not be payable to the following","1.2 Failures - Responsibilities"]
["1.1.1 An employee is eligible for the bilingualism bonus from the date on which the Deputy Head certifies that the following conditions are being met:\n(a) the employee occupies a position which has been identified bilingual; and\n","(a) employees in the Translation Group, unless their positions are identified bilingual for reasons other than translation;\n","1.2.1 If the results of an SLE show that an employee does not meet the linguistic requirements of his/her position, the department will provide written notice that he/she will cease to receive the bonus two months after the date of written notice. The written notice shall be given within 10 working days from the date of the decision. Negative test results create responsibilities on the part of managers and employees."]
["(b) the employee has Second Language Evaluation (SLE) results confirming that he/she meets the language requirements of his/her position (or in the case of professional requirements - code \"P\", the employee meets that code at the time of staffing of the position).","(b) employees who continue to receive the frozen ST bilingual differential, under conditions specified in section 1.7 of this directive;"]
[null,"(c) employees who are classified in the Executive Group of the Management Category. However, all EX equivalents are eligible for the bonus, provided that they meet the eligibility conditions (for equivalences, see Personnel Management Manual (PMM), Volume 2, Chapter 2-2, Appendix A, Amendment 86-3);"]
[null,"(d) persons appointed by Governor in Council;"]
[null,"(e) persons locally engaged outside Canada;"]
[null,"(f) persons ordinarily working one-third or less of the normal working hours for the same group and category;"]
[null,"(g) persons employed on a temporary basis for three months or less; and"]
{"$rows_left_out":13}
{"sheet":"Adm Measures_Mesures Adm","index":3,"n_rows":11,"n_cols":5,"rows_kept":11,"cut":false,"hidden":false,"merged":[[0,0,0,4],[6,0,6,4]]}
["ENGLISH"]
["Why record OL Administrative Measures Information",null,"When to record OL Administrative Measures Information",null,"How to record OL Administrative Measures Information in MyGCHR"]
["Prerequisite: The manager must have provided the required information to the HR Advisor in advance of starting this procedure",null,null,null,"Prerequisite: The employee must be active in MyGCHR.\nMyGCHR updates the Administrative Measure section with the employee's name and Position number."]
["Managers are responsible to put in place measures to fulfill the tasks and functions of a position while the person occupying the position does not meet the language requirements.\n\nIf the Language Status of the position has changed or the Linguistic Status of the incumbent has changed, and the result is that the employee no longer meets the language requirements, the manager can designate another employee to provide services in both official languages.",null,"In MyGCHR Administrative measures are recorded when an employee does not meet the linguistic requirements of the position, and for whom the manager has identified another employee to provide services in both official languages for that position.",null,"This information is recorded in the Administrative Measure section."]
["If the services cannot be performed by another employee, enter the details of how the services will be provided in both official languages or add details that are relevant to the \nAdministrative Measure in the Details on Admin Measures field.",null,null,null,"The fields in this section become available when: the value in the Aptmt Official Language Status field is one of the following: \n14 - Appointment-Bilingual non-imperative position\n30 - Data Change\nAND\nthe value in the Linguistic Status of Incumbent field is one of the following: \n16-DOES NOT MEET - Entitled to the Bilingual Bonus.\n30-DOES NOT MEET- Agreement to become bilingual.\n31-DOES NOT MEET-Excluded for medical reasons. \n32-DOES NOT MEET-Eligible for immediate annuity.\n40-DOES NOT MEET-Exclusion under the PSER.\n41-DOES NOT MEET-Exclusion while Incumbent on language training."]
[]
["FRANÇAIS"]
["Pourquoi consigner l’information sur les mesures administratives en matière de langues officielles",null,"Quand consigner l’information sur les mesures administratives en matière de langues officielles",null,"Comment consigner l’information sur les mesures administratives en matière de langues officielles dans MesRHGC"]
["Préalable : Le gestionnaire doit avoir fourni les renseignements requis au conseiller en RH avant d’entamer cette procédure.",null,null,null,"Préalable : L’employé doit être actif dans MesRHGC.\nMes RHGC met à jour la section Mesure administrative avec le nom et le numéro de poste de l’employé."]
["Les gestionnaires ont la responsabilité de mettre en place des mesures pour remplir les tâches et les fonctions d’un poste tant que la personne occupant le poste ne satisfait pas aux exigences linguistiques.\n\nSi le statut linguistique du poste a changé ou que le statut linguistique du titulaire a changé et que l’employé ne satisfait plus aux exigences linguistiques, le gestionnaire peut désigner un autre employé pour fournir des services dans les deux langues officielles.",null,"Dans MesRHGC, les mesures administratives sont consignées lorsqu’un employé ne satisfait pas aux exigences linguistiques du poste et que le gestionnaire a désigné un autre employé pour fournir des services dans les deux langues officielles pour ce poste.",null,"Ces renseignements sont consignés dans la section Mesures administratives."]
{"$rows_left_out":2}
{"sheet":"Language terms","index":4,"n_rows":89,"n_cols":2,"rows_kept":89,"cut":false,"hidden":true,"merged":[]}
["English","Français"]
["AOLS Code","Code NNCLO"]
["Definition","Définition"]
["English Description ","Description Française"]
["Status","État"]
["LSI Code ","Code SLT"]
["Business description of the Appointment Official Languages Status codes","Code sur la nature de la nomination concernant les langues officielles"]
["Action  ","Action"]
["Appointment","Nomination"]
["Transfer ","Mutation"]
{"$rows_left_out":80}
{"sheet":"General Information Générale","index":5,"n_rows":30,"n_cols":30,"rows_kept":30,"cut":false,"hidden":false,"merged":[[29,2,35,19],[12,2,12,6],[14,2,14,9],[14,10,14,19],[6,14,6,19],[6,2,6,10],[10,2,10,19],[27,10,27,19]]}
[null,null,null,null,null,null,null,null,null,null,null,null,null,null,null,null,null,null,null,null,null,null,null,null,null,"e","e",null,"f","f"]
[null,null,null,null,null,null,null,null,null,null,null,null,null,null,null,null,null,null,null,null,null,null,null,null,"Series","AOLS -10","AOLS - 20","AOLS - 30","LSI - 10","LSI - 20"]
[]
[null,null,{"$f":"IF(Z1=\"e\",'Language terms'!A2,'Language terms'!B2)","v":"AOLS Code"},null,{"$f":"IF(Z1=\"e\",'Language terms'!A5,'Language terms'!B5)","v":"Status"},null,null,null,null,null,{"$f":"IF(Z1=\"e\",'Language terms'!A4,'Language terms'!B4)","v":"English Description "},null,null,null,{"$f":"IF(Z1=\"e\",'Language terms'!A6,'Language terms'!B6)","v":"LSI Code "},null,{"$f":"IF(Z1=\"e\",'Language terms'!A5,'Language terms'!B5)","v":"Status"},null,null,{"$f":"IF(Z1=\"e\",'Language terms'!A4,'Language terms'!B4)","v":"English Description "}]
[null,null,13,null,{"$f":"VLOOKUP(C5,'AOLS Codes NNCLO'!A2:G22,IF(Z1=\"e\",4,5))","v":"Active"},null,null,null,null,null,{"$f":"VLOOKUP(C5,'AOLS Codes NNCLO'!A2:G22,IF(Z1=\"e\",2,3))","v":"Appt-Bilingual imperative position"},null,null,null,16,null,{"$f":"VLOOKUP(O5,'LSI Codes SLT'!2:22,IF(Z1=\"e\",4,5))","v":"Active"},null,null,{"$f":"VLOOKUP(O5,'LSI Codes SLT'!A2:G20,IF(Z1=\"e\",2,3))","v":"16-Does not meet - gets BB"}]
[null,null,{"$f":"IF(Z1=\"e\",'Language terms'!A3,'Language terms'!B3)","v":"Definition"},null,null,null,null,null,null,null,null,null,null,null,{"$f":"IF(Z1=\"e\",'Language terms'!A3,'Language terms'!B3)","v":"Definition"}]
[null,null,{"$f":"VLOOKUP(C5,'AOLS Codes NNCLO'!A2:G22,IF(Z1=\"e\",6,7))","v":"Use this value to identify the status of the appointment (for example – term, indeterminate, acting) to the position as being Bilingual Imperative."},null,null,null,null,null,null,null,null,null,null,null,{"$f":"VLOOKUP(O5,'LSI Codes SLT'!A2:G22,IF(Z1=\"e\",6,7))","v":"Use this value when the employee DOES NOT MEET the language requirements of the position but IS STILL ENTITLED to the Bilingual Bonus. "}]
[]
[]
[]
{"$rows_left_out":21}
{"sheet":"AOLS Codes NNCLO","index":6,"n_rows":35,"n_cols":7,"rows_kept":35,"cut":false,"hidden":false,"merged":[]}
["Code ","Eng Description","FR description","Status","État","Definition","Définition"]
[13,"Appt-Bilingual imperative position","Nom-Impérative poste bilingue","Active","Actif","Use this value to identify the status of the appointment (for example – term, indeterminate, acting) to the position as being Bilingual Imperative.","Utilisez cette valeur pour indiquer que le statut de la nomination (p. ex. durée déterminée, durée indéterminée, intérimaire) au poste est impérative, poste bilingue."]
[14,"Appt-Bilingual non-imperative position","Nom-Non-impérative poste bil","Active","Actif","Use this value to identify the status of the appointment (indeterminate appointment only) to the position as being Bilingual Non-Imperative.","Utilisez cette valeur pour indiquer que le statut de la nomination (à durée indéterminée uniquement) au poste est non impérative, poste bilingue."]
[15,"Appt-English essential position","Nomination-poste anglais essentiel.","Active","Actif","Use this value to identify the status of the appointment (for example – term, indeterminate, acting) to the position as being English Essential.","Utilisez cette valeur pour indiquer que le statut de la nomination (p. ex. durée déterminée, durée indéterminée, intérimaire) au poste est anglais essentiel."]
[16,"Appt-French essential position","Nomination-poste français essentiel. ","Active","Actif","Use this value to identify the status of the appointment (for example – term, indeterminate, acting) to the position as being French Essential.","Utilisez cette valeur pour indiquer que le statut de la nomination (p. ex. durée déterminée, durée indéterminée, intérimaire) au poste est français essentiel."]
[17,"Appt-Either Eng or Fr essential position","Nomination-poste français ou anglais essentiel.","Active","Actif","Use this value to identify the status of the appointment (for example – term, indeterminate, acting) to the position as being either English or French Essential.","Utilisez cette valeur pour indiquer que le statut de la nomination (p. ex. durée déterminée, durée indéterminée, intérimaire) au poste est français ou anglais essentiel."]
[23,"Deployment-Bil imperative position","Mutation-impérative, poste bilingue.","Active","Actif","Use this value to identify the status of the deployment (for example – term, indeterminate) to the position as being Bilingual Imperative.","Utilisez cette valeur pour indiquer que le statut de la mutation (p. ex. durée déterminée, durée indéterminée) au poste est impérative, poste bilingue."]
[24,"Deployment-Bil non-imperative position","Mutation-non impérative, poste bilingue.","Active","Actif","Use this value to identify the status of the deployment (indeterminate deployment only) to the position as being Bilingual Non-Imperative.","Utilisez cette valeur pour indiquer que le statut de la mutation (à durée indéterminée uniquement) au poste est non impérative, poste bilingue."]
[25,"Deployment-English essential position","Mutation-poste anglais essentiel.","Active","Actif","Use this value to identify the status of the deployment (for example – term, indeterminate) to the position as being English Essential.","Utilisez cette valeur pour indiquer que le statut de la mutation (p. ex. durée déterminée, durée indéterminée) au poste est anglais essentiel."]
[26,"Deployment-French essential position","Mutation-poste français essentiel ","Active","Actif","Use this value to identify the status of the deployment (for example – term, indeterminate) to the position as being French Essential.","Utilisez cette valeur pour indiquer que le statut de la mutation (p. ex. durée déterminée, durée indéterminée) au poste est français essentiel."]
{"$rows_left_out":26}
{"sheet":"LSI Codes SLT","index":7,"n_rows":20,"n_cols":7,"rows_kept":20,"cut":false,"hidden":false,"merged":[]}
["Code ","Eng Description","FR description","Status","État","Definition","Définition"]
[10,"10-Meets OL req - Entlitled to BB","10-Satisfait - reçoit PB","Active","Actif","Use this value when the employee MEETS the OL requirement of the Position, and IS ENTITLED to the Bilingual Bonus","Utilisez cette valeur lorsque l'employé SATISFAIT à l'exigence de LO du poste et A DROIT à la prime au bilinguisme."]
[14,"14-Meets OL req-Not Entd to BB","14-Satisf LO-ne reçoit pas","Active","Actif","Use this value when the employee MEETS the language requirements of the position, but IS NOT ENTITLED to the Bilingual Bonus (i.e. – Executives, Translators, persons employed on a temporary basis for three months or less)","Utilisez cette valeur lorsque l’employé SATISFAIT aux exigences linguistiques du poste, mais N’A PAS DROIT à la prime au bilinguisme (cadres, traducteurs, personnes employées sur une base temporaire pour trois mois ou moins)."]
[15,"15-Not required to meet OL req","15-Pas obligé-Satisf exig. LO","Active","Actif","Use this value when the employee is NOT REQUIRED TO MEET any language requirements (i.e. – Casuals, Acting less than 4 months, incumbents rights.)","Utilisez cette valeur lorsque l’employé n’est PAS TENU DE SATISFAIRE à des exigences linguistiques (employés occasionnels ou intérimaires pour moins de quatre mois, droits du titulaire)."]
[16,"16-Does not meet - gets BB","16-Ne rencontre pas-reçoit PB","Active","Actif","Use this value when the employee DOES NOT MEET the language requirements of the position but IS STILL ENTITLED to the Bilingual Bonus. ","Utilisez cette valeur lorsque l’employé NE SATISFAIT PAS aux exigences linguistiques du poste, MAIS A DROIT à la prime au bilinguisme. "]
[30,"30-PSOLEO Must meet OL reqm'","30-DELOFP doit satisfaire LO","Active","Actif","Use this value per the Public Service Official Languages Exclusion Approval Order (PSOLEO) – When the Appointment Official Language Status (AOLS)= Bilingual Non-Imperative (14 or 24) and the employee DOES NOT MEET the language requirement, and they submit an agreement to become bilingual.","Utilisez cette valeur conformément au DELOFP : quand le champ « Statut de la nomination – langues officielles » indique « non impérative, poste bilingue » (14 ou 24), l’employé NE SATISFAIT PAS aux exigences linguistiques et l’employé soumet une entente pour devenir bilingue."]
[31,"31-PSOLEO Medical grounds","31-DELOFP raison médicale","Active","Actif","Use this value per the Public Service Official Languages Exclusion Approval Order (PSOLEO)- When the  Appointment Official Language Status (AOLS) = Bilingual Non-Imperative (14 or 24) and the employee DOES NOT MEET, and is excluded for medical reasons","Utilisez cette valeur conformément au DELOFP : quand le champ « Statut de la nomination – langues officielles » indique « non impérative, poste bilingue » (14 ou 24), l’employé NE SATISFAIT PAS aux exigences linguistiques et l’employé est exclu pour raisons médicales."]
[32,"32-PSOLEO Elig. immed. annuity","32-DELOFP adm pension imméd","Active","Actif","Use this value per the Public Service Official Languages Exclusion Approval Order (PSOLEO)- When the Appointment Official Language Status (AOLS)= Bilingual Non-Imperative (14 or 24) and the employee DOES NOT MEET and is eligible for an immediate annuity - irrevocable resignation to leave / retire within 2 years.","Utilisez cette valeur conformément au DELOFP : quand le champ « Statut de la nomination – langues officielles » indique « non impérative, poste bilingue » (14 ou 24), l’employé NE SATISFAIT PAS aux exigences linguistiques et l’employé est admissible à une pension immédiate. Sa démission/son départ à la retraite dans les deux ans est alors irrévocable."]
[40,"40-Act Apt encum. bil position","40-Nom inter poste bil non vac","Active","Actif","Use this value when the employee DOES NOT MEET and falls under the following exclusion under the Public Service Employment Regulations (PSER) - An acting appointment of 4 months or more, but not more than 12 months, to an encumbered bilingual position that the Commission cannot fill with an acting appointment of a person who meets the language proficiency qualification under paragraph 30(2)(a) of the Act is excluded from the application of that paragraph respecting official language proficiency.","Utilisez cette valeur lorsque l’employé NE SATISFAIT PAS aux exigences et tombe sous le coup de l’exclusion suivante en vertu du REFP : une nomination intérimaire pour une durée supérieure ou égale à 4 mois, mais inférieure ou égale à 12 mois, à un poste bilingue occupé que la CFP ne peut pas pourvoir au moyen de la nomination intérimaire d’une personne satisfaisant aux qualifications linguistiques prévues à l’alinéa 30(2)a) de la Loi est exclue du champ d’application de cet alinéa pour ce qui a trait aux compétences en matière de langues officielles."]
[41,"41-Act Apt bil pos/lng trainin","41-Nom inter pst bil/form lang","Active","Actif","Use this value when the employee DOES NOT MEET and falls under the following exclusion under the Public Service Employment Regulations (PSER) - An acting appointment of 4 months or more, but not more than 18 months, to a bilingual position, while the incumbent is on language training, that the Commission cannot fill with an acting appointment of a person who meets the language proficiency qualification under paragraph 30(2)(a) of the Act is excluded from the application of that paragraph respecting official language proficiency.","Utilisez cette valeur lorsque l’employé NE SATISFAIT PAS aux exigences et tombe sous le coup de l’exclusion suivante en vertu du REFP : une nomination intérimaire pour une durée supérieure ou égale à 4 mois, mais inférieure ou égale à 18 mois, à un poste bilingue dont le titulaire est en formation linguistique et que la CFP ne peut pas pourvoir au moyen de la nomination intérimaire d’une personne satisfaisant aux qualifications linguistiques prévues à l’alinéa 30(2)a) de la Loi est exclue du champ d’application de cet alinéa pour ce qui a trait aux compétences en matière de langues officielles."]
{"$rows_left_out":11}
{"sheet":"Sheet1","index":8,"n_rows":38,"n_cols":9,"rows_kept":38,"cut":false,"hidden":true,"merged":[[32,2,32,4],[34,0,36,0],[34,1,36,1],[34,4,36,4],[19,0,32,0],[19,1,20,1],[19,4,20,4],[21,1,21,4],[22,1,26,1],[22,4,26,4],[24,2,26,2],[27,1,27,4],[2,0,17,0],[2,1,6,1],[2,4,6,4],[30,2,30,4],[31,1,31,4],[28,2,28,4],[29,1,29,4],[13,2,13,4],[15,2,15,4],[16,1,16,4],[17,2,17,4],[0,5,0,6],[2,8,6,8],[3,2,6,2],[8,1,11,1],[8,4,11,4],[8,8,11,8],[10,2,11,2]]}
[null,"Business description of the Appointment Official Languages Status codes","Linguistic Status of Incumbent options",null,null,"Existing Editing in HR systems\n&\nMessage Description",null,"Applies to which specific scenario and which HR system"]
["Series","If the action is… ","Select… \nIf Employee Meets language requirements: ","Select… \nIf Employee does NOT meet language requirements: ","Select… \nIf SLE result is unrecognized by PSC",8.9,9.1,null,"Questions and Answers"]
["Series 10 - The employee meets the language requirements of the position","13 – Appointment / Promotion (Bilingual position imperative) \nPCIS website = \nAppointment - Imperative, bilingual position","10 – Meets OL Req - Entitled to BB ","15  – NOT Required to meet OL Req ","17  – Meets OL-Not PSC-No Entd BB \n(Example: Department or Agency is not subject to PSEA)",null,"If you chose codes 15 or 16 for a bilingual imperative position :\nThe Aptmt Official Language Status and Linguistic Status of Incumbent are required for Bilingual Pos (21000,50).\n\nThe position's language requirement is bilingual and either the Appointment Official Language Status and/or the Linguistic Status of Incumbent are not valued.Please ensure both values are entered and correct.","* we can note type of appointment:  for e.g. exrenal or internal appointment.  Imperative appointment in a bilingual position\n* Action Reason that can be used for this code combination :  for e.g. HIR, REH, Transfer, Data Change/  Official Langauges\n* Correction:  in the event the wrong code is used - you can use Correct History functionality.\nCorrecting historical data rows will require sending a Data Correction data row.\n* employee gets Bilingual bonus","Series 10 - The employee meets the language requirements of the position\n\nQuestion: Does 15 - NOT required to meet OL Req fit in there? "]
[null,null,"14  – Meet OL Req - NOT entitled to BB \n(e.g. EX, Translators )","16  – Does not meet - gets BB  \n(Example: Retested - notice period to meet) "]
[null,null,null,"40 – Acting appointment encumbered bilingual position - exclusion under PSER "]
[null,null,null,"41 – Acting appointment in bilingual position while incumbent on Language Training - exclusion under PSER"]
[null,null,null,"50 – Acting appointment to position in rotational system – exclusion under PSER"]
[null,"  "]
[null,"14 – Appointment / Promotion (Bilingual position non-imperative) \nPCIS website = \nAppointment - Non-imperative, bilingual position","10 – Meets OL Req - Entitled to BB  ","15  – NOT Required to meet OL Req    ","17  – Meets OL-Not PSC-No Entd BB \n(Example: Department or Agency is not subject to PSEA)",null,null,null,"Question: Does 10 - Meets OL req - Entitled to BB fit there?\nThis is NOT a NON-IMPERATIVE position\nSame question for 14  – Meet OL Req - NOT entitled to BB"]
[null,null,"14  – Meet OL Req - NOT entitled to BB\n(e.g. EX, Translators )","30 – PSOLEO Employee must meet OL requirements \n(insert a Target Date for employee to Meet) "]
{"$rows_left_out":28}