{"text_format":"1","workbook":"xlsx","n_sheets":11,"sheets":["Initiative Details","Stakeholder Profile","Costs","Reporting","Business Counts","Labour Costs","Version History","Controls","Translations","CPI","VersionCheck"],"not_rendered":{"charts":0,"images":4,"macros":1,"external_links":0,"defined_names":138,"comments":1,"pivot_tables":0},"unopened":[],"bounds":{"document_bytes":16777216,"sheet_cells":100000,"rows_first":2000,"rows_last":500,"rows_between":2000,"halvings":0,"cell_chars":16384,"cell_head_chars":4096},"cells_cut":0,"cells_raw":0,"read":"whole","date_system":"1900"}

{"sheet":"Initiative Details","index":0,"n_rows":38,"n_cols":4,"rows_kept":38,"cut":false,"hidden":false,"merged":[[33,2,33,3],[36,1,36,3],[19,3,20,3],[21,2,21,3],[24,2,24,3],[30,2,30,3],[31,1,31,3],[32,2,32,3],[7,0,7,2],[1,1,1,2],[1,3,1,4],[2,0,2,2],[3,1,3,2],[4,1,4,2]]}
[{"$f":"CONCATENATE(\"Regulatory Costing Calculator V\", VersionNumber)","v":"Regulatory Costing Calculator V3.6"}]
["For Support Contact:","Need Help? Email the developer! \nBesoin d'aide? Envoyez un courrier électronique!!"]
["Initial model based on the \"Regulatory Cost Model\", developed by the Government of Alberta, Regulatory Review Secretariat. Model adapted for the Government of Canada by the Regulatory Affairs Sector of the Treasury Board of Canada Secretariat.  "]
["Objective: ","Quantify and monetize (1) the direct administrative costs associated with INs and OUTs under the one-for-one rule, and (2) the direct compliance and administrative costs associated with flexible options for the small business lens."]
["Version Date:","2019-01-22"]
["Methodology:","Standard Cost Model:","http://www.oecd.org/gov/regulatory-policy/34227698.pdf"]
[]
["Refer to the TBS Guides for the one-for-one rule and the small business lens for definitions and instructions on the one-for-one rule and the small business lens. "]
{"$rows_left_out":31}
{"sheet":"Stakeholder Profile","index":1,"n_rows":129,"n_cols":26,"rows_kept":129,"cut":false,"hidden":false,"merged":[[22,13,22,15],[22,16,22,18]]}
["The Regulatory Costing Calculator - Treasury Board of Canada Secretariat"]
[]
[]
[]
[]
[]
[]
[]
{"$rows_left_out":122}
{"sheet":"Costs","index":2,"n_rows":186,"n_cols":75,"rows_kept":186,"cut":false,"hidden":false,"merged":[[5,27,6,27],[5,29,6,29],[5,30,6,30],[5,31,5,32],[5,55,5,57],[5,33,5,35],[5,37,5,39],[5,41,5,43],[5,46,5,48],[5,49,5,51],[5,52,5,54]]}
["The Regulatory Costing Calculator - Treasury Board of Canada Secretariat"]
["Regulatory Costs"]
[null,{"$f":"CONCATENATE(\"Note: all costs are in \", PriceYear, \" Canadian dollars\")","v":"Note: all costs are in 2012 Canadian dollars"}]
[null,"Discount Rate ",null,{"$f":"Discount","v":7.0000000000000007E-2},null,"Time period (years)",null,{"$f":"'Initiative Details'!C23","v":10}]
[]
[null,"Activities",null,"Timing",null,null,null,"Stakeholders impacted",null,null,null,null,null,null,null,"Capital Costs",null,null,null,null,"Labour costs",null,null,null,null,null,null,"Assumptions / Notes",null,"Material CPI Adjust",null,"Periodic factor",null,"Total costs (all business sizes)",null,null,null,"Total costs (small businesses)",null,null,null,"Total costs (medium and large businesses)",null,null,null,null,"Adjusted Business Counts - Labour",null,null,"Adjusted Business Counts - Capital",null,null,"Adjusted Business Counts - Labour",null,null,"Adjusted Count of Businesses - Capital"]
["Number","Description","Type","Timing","Start Year (starting from)","End Year (up until but not including)",null,"Stakeholder Group","Stakeholder Size","% of Stakeholders Impacted","UPFRONT TIMING - Include Existing Businesses &  New Entrants? / ONGOING TIMING - Include ONLY New Entrants?","# of Small Stakeholders Impacted","# of Medium & Large Stakeholders Impacted","Total # of Stakeholders Impacted",null,"Number of Units (Leave Blank if N/A)","Cost per Unit (Leave Blank if N/A)","Frequency (Times per Year)","Price Year (for cost per unit)",{"$f":"CONCATENATE(\"Cost Per Event (Price, as measured in \", PriceYear, \" CAD)\")","v":"Cost Per Event (Price, as measured in 2012 CAD)"},"Internal or External Staff?","Staff Level (leave blank if N/A)","Time spent (hours)","Frequency (times per year)","Cost Per Hour (including Overhead)",{"$f":"CONCATENATE(\"Cost Per Event (Price, as measured in \", PriceYear, \" CAD)\")","v":"Cost Per Event (Price, as measured in 2012 CAD)"},null,null,null,null,null,"Capital costs","Labour costs","Upfront costs (first year)","Total present value (all costs)","Annualized (all costs)",null,"Upfront costs (first year)","Total present value (all costs)","Annualized (all costs)",null,"Upfront costs (first year)","Total present value (all costs)","Annualized (all costs)",null,"Annual Growth Rate","Small","Medium+","Total","Small","Medium+","Totals","New Entrants Period 0 - Small","New Entrants Period 0 - Medium+","New Entrants Period 0 - Total","New Entrants Period 0 - Small","New Entrants Period 0 - Medium+","New Entrants Period 0 - Total",null,null,null,"Admin (1) Compliance (2)"]
[1,null,null,null,null,null,null,null,null,null,null,{"$f":"IF(ISBLANK($H8),\"\",(IF(OR(MID($I8,1,1)=\"1\",MID($I8,1,1)=\"3\"),INDEX('Stakeholder Profile'!$C$25:$E$57,MATCH($H8,'Stakeholder Profile'!$B$25:$B$57,0),1),0)*$J8))","v":""},{"$f":"IF(ISBLANK($H8),\"\",(IF(OR(MID($I8,1,1)=\"2\",MID($I8,1,1)=\"3\"),INDEX('Stakeholder Profile'!$C$23:$E$57,MATCH($H8,'Stakeholder Profile'!$B$23:$B$57,0),2),0))*$J8)","v":""},{"$f":"IF(H8=\"\",\"\",L8+M8)","v":""},null,null,null,null,null,{"$f":"IF(P8=\"\",\"\",P8*Q8*AD8)","v":""},null,null,null,null,{"$f":"IF(OR(ISBLANK(U8),ISBLANK(V8)),\"\",(IF(MID(U8,1,1)=\"E\",Premium,overhead)+1)*INDEX('Labour Costs'!$C$4:$C$75,MATCH(MID(V8,1,3),'Labour Costs'!$H$4:$H$75,0)))","v":""},{"$f":"IF(Y8=\"\",\"\",Y8*W8)","v":""},null,null,null,{"$f":"IF(S8=\"\",1,VLOOKUP(PriceYear,CPIYearTable,2)/VLOOKUP(S8,CPIYearTable,2))","v":1},null,{"$f":"IF(R8=0,0,IF(NOT(AND(ISNUMBER($T8),ISNUMBER($R8))),0,IF(MID(D8,1,1)<>\"1\",1/PMT((((1+Discount)/(1+$AT8)))^(1/$R8)-1,$R8*($F8-FiscalYear),-1)-IF($E8=FiscalYear,0,1/PMT((((1+Discount)/(1+$AT8)))^(1/$R8)-1,$R8*($E8-FiscalYear),-1)),IF(OR(UPPER($K8)=\"TRUE\",UPPER($K8)=\"VRAI\"),1/PMT((((1+Discount)/(1+$AT8)))^(1/$R8)-1,R8*Timeperiod,-1),0))))","v":0},{"$f":"IF(X8=0,0,IF(NOT(AND(ISNUMBER(Z8),ISNUMBER(X8))),0,IF(MID(D8,1,1)<>\"1\",1/PMT((((1+Discount)/(1+AT8)))^(1/X8)-1,X8*(F8-FiscalYear),-1)-IF(E8=FiscalYear,0,1/PMT((((1+Discount)/(1+AT8)))^(1/X8)-1,X8*(E8-FiscalYear),-1)),IF(OR(UPPER($K8)=\"TRUE\",UPPER($K8)=\"VRAI\"),1/PMT((((1+Discount)/(1+AT8)))^(1/X8)-1,X8*Timeperiod,-1),0))))","v":0},{"$f":"IF(MID($D8,1,1)=\"1\",IF(OR($X8<>\"\",$X8<>0),$Z8*$N8*$X8,0)+IF(OR($P8<>\"\",$P8<>0),$T8*$N8*$R8,0),0)","v":0},{"$f":"$AH8+IF($AG8=0,0,IF($K8=Controls!$Q$5,$BC8,$N8)*$AG8*$Z8)+IF($AF8=0,0,IF($K8=Controls!$Q$5,$BF8,$N8)*$AF8*$T8)","v":0},{"$f":"IF(NOT(ISNUMBER(AI8)),\"\",(AI8/AF))","v":0},null,{"$f":"IF(MID($D8,1,1)=\"1\",IF(OR($X8<>\"\",$X8<>0),$Z8*$L8*$X8,0)+IF(OR($P8<>\"\",$P8<>0),$T8*$L8*$R8,0),0)","v":0},{"$f":"$AL8+IF($AG8=0,0,IF(OR(UPPER($K8)=\"TRUE\",UPPER($K8)=\"VRAI\"),$BA8,$L8)*$AG8*$Z8)+IF($AF8=0,0,IF($K8=Controls!$Q$5,$BD8,$L8)*$AF8*$T8)","v":0},{"$f":"IF(NOT(ISNUMBER(AM8)),\"\",(AM8/AF))","v":0},null,{"$f":"IF(MID($D8,1,1)=\"1\",IF(OR($X8<>\"\",$X8<>0),$Z8*$M8*$X8,0)+IF(OR($P8<>\"\",$P8<>0),$T8*$M8*$R8,0),0)","v":0},{"$f":"$AP8+IF($AG8=0,0,IF(OR(UPPER($K8)=\"TRUE\",UPPER($K8)=\"VRAI\"),$BB8,$M8)*$AG8*$Z8)+IF($AF8=0,0,IF(OR(UPPER($K8)=\"TRUE\",UPPER($K8)=\"VRAI\"),$BE8,$M8)*$AF8*$T8)","v":0},{"$f":"IF(NOT(ISNUMBER(AQ8)),\"\",(AQ8/AF))","v":0},null,{"$f":"IF(H8<>\"\",OFFSET('Stakeholder Profile'!$F$24,MATCH(H8,SHGroups,0),0),0)","v":0},{"$f":"L8","v":""},{"$f":"M8","v":""},{"$f":"IF(AU8=\"\",\"\",SUM(AU8:AV8))","v":""},{"$f":"L8","v":""},{"$f":"M8","v":""},{"$f":"IF(AX8=\"\",\"\",SUM(AX8:AY8))","v":""},{"$f":"IF(AND($AT8<>0,$X8>0),(L8*(1+$AT8^(1/$X8))-L8)/(1+$AT8^(1/$X8)),0)","v":0},{"$f":"IF(AND($AT8<>0,$X8>0),(M8*(1+$AT8^(1/$X8))-M8)/(1+$AT8^(1/$X8)),0)","v":0},{"$f":"IF(AND($AT8<>0,$X8>0),(N8*(1+$AT8^(1/$X8))-N8)/(1+$AT8^(1/$X8)),0)","v":0},{"$f":"IF(AND($AT8<>0,$R8>0),(L8*(1+$AT8^(1/$X8))-L8)/(1+$AT8^(1/$X8)),0)","v":0},{"$f":"IF(AND($AT8<>0,$R8>0),(M8*(1+$AT8^(1/$X8))-M8)/(1+$AT8^(1/$X8)),0)","v":0},{"$f":"IF(AND($AT8<>0,$R8>0),(N8*(1+$AT8^(1/$X8))-N8)/(1+$AT8^(1/$X8)),0)","v":0},null,null,null,{"$f":"IF(C8=\"\",\"\",MID(C8,1,1))","v":""},null,null,null,1,{"$f":"Controls!G93","v":2024},null,null,null,null,null,"Activity","CInput1"]
{"$rows_left_out":179}
{"sheet":"Reporting","index":3,"n_rows":48,"n_cols":16,"rows_kept":48,"cut":false,"hidden":false,"merged":[[42,2,42,3],[5,0,7,0],[9,0,12,0],[13,0,16,0],[5,8,8,8],[9,8,12,8],[13,8,16,8],[40,2,40,3],[41,2,41,3]]}
["The Regulatory Costing Calculator - Treasury Board of Canada Secretariat"]
["Cost Summary"]
[null,"A. Total Present Values",null,null,null,null,null,null,null,"B. Annualized Averages"]
[null,null,"Small Stakeholders",null,"Medium and Large Stakeholders",null,"All Stakeholders",null,null,null,"Small Stakeholders",null,"Medium and Large Stakeholders",null,"All Stakeholders"]
[null,null,"Average","Total","Average","Total","Average","Total",null,null,"Average","Total","Average","Total","Average","Total"]
["ADMIN","Business",{"$f":"IF(D6=\"\",\"\",IF(D6=0,0,D6/'Stakeholder Profile'!C55))","v":0},{"$f":"Costs!AM184","v":0},{"$f":"IF(F6=\"\",\"\",IF(F6=0,0,F6/'Stakeholder Profile'!D55))","v":0},{"$f":"Costs!AQ184","v":0},{"$f":"IF(H6=\"\",\"\",IF(H6=0,0,H6/'Stakeholder Profile'!E55))","v":0},{"$f":"F6+D6","v":0},{"$f":"A6","v":"ADMIN"},{"$f":"B6","v":"Business"},{"$f":"IF(L6=\"\",\"\",IF(L6=0,0,L6/'Stakeholder Profile'!$C55))","v":0},{"$f":"Costs!AN184","v":0},{"$f":"IF(N6=\"\",\"\",IF(N6=0,0,N6/'Stakeholder Profile'!$D55))","v":0},{"$f":"Costs!AR184","v":0},{"$f":"IF(P6=\"\",\"\",IF(P6=0,0,P6/'Stakeholder Profile'!$E55))","v":0},{"$f":"N6+L6","v":0}]
[null,"Non-Business",{"$f":"IF(D7=\"\",\"\",IF(D7=0,0,D7/'Stakeholder Profile'!C56))","v":0},{"$f":"Costs!AM185","v":0},{"$f":"IF(F7=\"\",\"\",IF(F7=0,0,F7/'Stakeholder Profile'!D56))","v":0},{"$f":"Costs!AQ185","v":0},{"$f":"IF(H7=\"\",\"\",IF(H7=0,0,H7/'Stakeholder Profile'!E56))","v":0},{"$f":"F7+D7","v":0},null,"Non-Business",{"$f":"IF(L7=\"\",\"\",IF(L7=0,0,L7/'Stakeholder Profile'!$C56))","v":0},{"$f":"Costs!AN185","v":0},{"$f":"IF(N7=\"\",\"\",IF(N7=0,0,N7/'Stakeholder Profile'!$D56))","v":0},{"$f":"Costs!AR185","v":0},{"$f":"IF(P7=\"\",\"\",IF(P7=0,0,P7/'Stakeholder Profile'!$E56))","v":0},{"$f":"N7+L7","v":0}]
[null,"ALL",{"$f":"IF(D8=\"\",\"\",IF(D8=0,0,D8/'Stakeholder Profile'!C57))","v":0},{"$f":"Costs!AM186","v":0},{"$f":"IF(F8=\"\",\"\",IF(F8=0,0,F8/'Stakeholder Profile'!D57))","v":0},{"$f":"Costs!AQ186","v":0},{"$f":"IF(H8=\"\",\"\",IF(H8=0,0,H8/'Stakeholder Profile'!E57))","v":0},{"$f":"F8+D8","v":0},null,"ALL",{"$f":"IF(L8=\"\",\"\",IF(L8=0,0,L8/'Stakeholder Profile'!$C57))","v":0},{"$f":"Costs!AN186","v":0},{"$f":"IF(N8=\"\",\"\",IF(N8=0,0,N8/'Stakeholder Profile'!$D57))","v":0},{"$f":"Costs!AR186","v":0},{"$f":"IF(P8=\"\",\"\",IF(P8=0,0,P8/'Stakeholder Profile'!$E57))","v":0},{"$f":"N8+L8","v":0}]
{"$rows_left_out":41}
{"sheet":"Business Counts","index":4,"n_rows":1375,"n_cols":5,"rows_kept":1375,"cut":false,"hidden":false,"merged":[[10,0,10,1]]}
[]
[]
[]
[]
[]
[]
[]
[]
{"$rows_left_out":1368}
{"sheet":"Labour Costs","index":5,"n_rows":64,"n_cols":8,"rows_kept":64,"cut":false,"hidden":false,"merged":[]}
["Statistics Canada.Table  14-10-0307-01   Employee wages by occupation, annual (formerly CANSIM  282-0152)",null,"Average Hourly Wage Rate  ($Can)","Wages based on: \nGeography = Canada\nWages = Average hourly wage rate\nType of work = Both full- and part-time employee\nSex = Both sexes\nAge group = 15 years and over"]
["National Occupational Classification (NOC)",2021,{"$f":"PriceYear","v":2012},"Internal","External"]
[{"$f":"A2","v":"National Occupational Classification (NOC)"},"Nominal",{"$f":"C2","v":2012},{"$f":"D2","v":"Internal"},{"$f":"E2","v":"External"},"Year",null,"Count"]
["01 Canada average",30.03,{"$f":"B4*PriceAdj","v":25.80968220338983},{"$f":"C4*(1+overhead)","v":32.26210275423729},{"$f":"C4*(1+Premium)","v":38.714523305084747},{"$f":"WageYear","v":2021},null,{"$f":"MID(A4,1,3)","v":"01 "}]
["02 Management occupations",49,42.113700564971751,52.642125706214685,63.170550847457626,{"$f":"F4","v":2021},null,{"$f":"MID(A5,1,3)","v":"02 "}]
["03 Senior management occupations",57.52,49.436327683615822,61.795409604519776,74.154491525423737,{"$f":"F5","v":2021},null,"03 "]
["04 Specialized middle management occupations",52.98,45.534364406779659,56.917955508474577,68.301546610169481,2021,null,"04 "]
["05 Middle management occupations in retail and wholesale trade and customer services",39.28,33.759717514124297,42.199646892655373,50.639576271186442,2021,null,"05 "]
{"$rows_left_out":57}
{"sheet":"Version History","index":6,"n_rows":68,"n_cols":3,"rows_kept":68,"cut":false,"hidden":false,"merged":[]}
[{"$f":"MAX(A3:A82)","v":3.6},"Version History",{"$f":"NOT(CurrentVersion<=VersionNumber)","v":false}]
["Version","Date","Changes"]
[1,"2012-05-08","> The \"Number of stakeholders impacted column\" should now show the correct result when a % of stakeholders lower than 100% is entered"]
[null,null,"> Removed the \"Professional occupations in business and finance\" choice from the occupations drop-down lists as it was not referring to the correct wage rate"]
[null,null,"> Corrected some occupation category titles (capitalization)"]
[1.1000000000000001,"2012-05-24","> Added a \"custom wage\" option in the occupations drop-down menus"]
[null,null,"> Changed \"Capital Costs\" to \"Capital costs, or other costs\" on the Compliance Costs tab, unmerged title cells and put column titles in text boxes"]
[null,null,"> Put the \"number of units\" and \"cost per unit\" titles in text boxes for the sumproduct formulas to work on the Results tab"]
{"$rows_left_out":61}
{"sheet":"Controls","index":7,"n_rows":162,"n_cols":17,"rows_kept":162,"cut":false,"hidden":true,"merged":[]}
["MAXFREQUENCY",52,null,null,null,"Set the year here for discounting as required by the RTRA.",null,null,null,null,"Overhead  Adjustment"]
["Language",null,null,null,null,{"$f":"ZeroYear","v":2012},null,null,null,null,"Labour",null,0.25]
[null,null,null,null,null,"Set the price year to be used for the analysis.",null,null,null,null,"Outsourced Labour Premium",null,0.5]
["Yes",null,null,null,null,{"$f":"PriceYear","v":2012},{"$f":"'Stakeholder Profile'!C23","v":"1. Small Stakeholders"},null,null,"Include",null,"Set (Cell D7)",null,null,"New Entrants"]
["No",null,null,null,null,"Adjustment Value",{"$f":"'Stakeholder Profile'!D23","v":"2. Medium and Large Stakeholders"},null,null,"Exclude",null,"Perpetual",null,1,"Include",true,true]
["Training Wheels Version?",true,null,null,null,{"$f":"VLOOKUP(PriceYear,CPIYearTable,2)/VLOOKUP(WageYear,CPIYearTable,2)","v":0.8594632768361582},{"$f":"'Stakeholder Profile'!E23","v":"3. All Stakeholders"},null,null,null,null,null,null,2,"Exclude",false,false]
[null,null,null,null,null,null,null,null,null,null,null,null,null,3,"Only"]
["Regulation Type:"]
{"$rows_left_out":155}
{"sheet":"Translations","index":8,"n_rows":311,"n_cols":20,"rows_kept":311,"cut":false,"hidden":false,"merged":[]}
["Type","Sheet/Form","Range/Control","English","French",null,"MsgBoxID","English Messge","French Message",null,null,null,null,null,"Control Types","FORM TRANSLATIONS","Form","Control","English","French"]
["Cell",1,"$A$2","For Support Contact:","Pour obtenir de l'aide, veuillez communiquer avec :",null,1,"Please enter an activity title!","Veuillez entrer le titre de l'activité!",null,null,null,null,null,"Cell",null,"DetailFrm","LblLeadDepartment","Regulation Lead Department:","Ministère responsable du règlement :"]
["Cell",1,"$A$3","Initial model based on the \"Regulatory Cost Model\", developed by the Government of Alberta, Regulatory Review Secretariat. Model adapted for the Government of Canada by the Regulatory Affairs Sector of the Treasury Board of Canada Secretariat.  ","Le modèle initial est fondé sur le « Regulatory Cost Model » (modèle de coûts de la réglementation), élaboré par le Secrétariat d'examen réglementaire du gouvernement de l'Alberta. Le modèle est adapté au gouvernement du Canada par le Secteur des affaires réglementaires du Secrétariat du Conseil du Trésor du Canada. ",null,2,"Please enter a valid number of hours!","Veuillez entrer un nombre d'heures valide!",null,null,null,null,null,"Button",null,"DetailFrm","LblRegName","Regulation Name:","Nom du règlement :"]
["Cell",1,"$A$4","Objective: ","Objectif :",null,3,"Please enter a valid Frequency!","Veuillez entrer une fréquence valide!",null,null,null,null,null,"Sheet",null,"DetailFrm","LblScenario","Scenario Type:","Type de scénario :"]
["Cell",1,"$A$5","Version Date:","Date de la version actuelle :",null,4,"Something wrong has happened, please check the validity of your inputs and try again.","Un problème est survenu, veuillez vérifier la validité des données que vous avez entrées et essayer à nouveau.",null,null,null,null,null,"Form Control",null,"DetailFrm","LblDescription","Regulation Description:","Description du règlement :"]
["Cell",1,"$A$6","Methodology:","Méthode :",null,5,"Please Enter a number between 0 and 1!","Veuillez entrer un chiffre entre 0 et 1!",null,null,null,null,null,null,null,"DetailFrm","LblStartYear","Year regulation will be registered (B):","Année de début du règlement (B) :"]
["Cell",1,"$A$8","Refer to the TBS Guides for the one-for-one rule and the small business lens for definitions and instructions on the one-for-one rule and the small business lens. ","Reportez-vous aux guides du SCT en ce qui concerne la règle d'un pour un et la Lentille de petites entreprises pour obtenir les définitions et les instructions au sujet de ces dernières.",null,6,"Please Enter a number!","Veuillez entrer un nombre!",null,null,null,null,null,null,null,"DetailFrm","LblTimePeriod","Time (in years) to analysis:","Temps (en années) consacré à l'analyse :"]
["Cell",1,"$B$4","Quantify and monetize (1) the direct administrative costs associated with INs and OUTs under the one-for-one rule, and (2) the direct compliance and administrative costs associated with flexible options for the small business lens.","Quantifier et monétiser (1) les coûts administratifs directs associés aux AJOUTS et aux SUPPRESSIONS dans le cadre de la règle d'un pour un, et (2) les coûts administratifs et de conformité directs associés aux options flexibles de la Lentille des petites entreprises.",null,7,"Are you sure? Loading a new scenario will clear current RCC data?","Êtes-vous sûr? Le fait de charger un nouveau scénario effacera les données actuelles du Calculateur des coûts de la réglementation.",null,null,null,null,null,null,null,"DetailFrm","LblDiscountRate","Discount Rate:","Taux d'actualisation :"]
{"$rows_left_out":304}
{"sheet":"CPI","index":9,"n_rows":161,"n_cols":2,"rows_kept":161,"cut":false,"hidden":true,"merged":[]}
["RCC CPI Table"]
[]
["From wiki"]
["Jump to navigation Jump to search"]
[]
["Table: 18-10-0005-01 (formerly CANSIM 326-0021) Geography: CANADA, Products: All Items"]
[]
["<> Year <>","<> Index <>"]
{"$rows_left_out":154}
{"sheet":"VersionCheck","index":10,"n_rows":92,"n_cols":3,"rows_kept":92,"cut":false,"hidden":true,"merged":[]}
["Regulatory Costing Calculator - Calculateur des coûts de la réglementation"]
[]
["From wiki"]
["Jump to navigation Jump to search"]
["Version Number","Date of Update","Description of Changes"]
[3.5,"2023-02-02","Added ability to associate values for capital costs with a price year and automatically adjust these values using the CPI when reporting at different price levels. Changed web queries to point to new location in GCwiki rather than old GCpedia hosting location."]
["BETA","23-06-2021","Beta version for development purposes."]
[]
{"$rows_left_out":84}