{"text_format":"1","workbook":"xlsx","n_sheets":7,"sheets":["General Information Générale","Codes SLT","Language terms","AOLS Codes","LSI Codes","REH _ Bilingual Posn ","Sheet1"],"not_rendered":{"charts":0,"images":4,"macros":1,"external_links":0,"defined_names":0,"comments":0,"pivot_tables":0},"unopened":[],"bounds":{"document_bytes":16777216,"sheet_cells":100000,"rows_first":2000,"rows_last":500,"rows_between":2000,"halvings":0,"cell_chars":16384,"cell_head_chars":4096},"cells_cut":0,"cells_raw":0,"read":"whole","date_system":"1900"}

{"sheet":"General Information Générale","index":0,"n_rows":31,"n_cols":30,"rows_kept":31,"cut":false,"hidden":false,"merged":[[4,8,4,10],[4,18,4,19],[30,2,36,19],[28,10,28,19],[14,2,14,9],[14,10,14,19],[6,2,6,10],[10,2,10,19],[12,2,12,8],[6,14,6,19]]}
[null,null,null,null,null,null,null,null,null,null,null,null,null,null,null,null,null,null,null,null,null,null,null,null,"f","e","e",null,"f","f"]
[null,null,null,null,null,null,null,null,null,null,null,null,null,null,null,null,null,null,null,null,null,null,null,null,"Series","AOLS -10","AOLS - 20","AOLS - 30","LSI - 10","LSI - 20"]
[]
[null,null,{"$f":"IF(Z1=\"e\",'Language terms'!A3,'Language terms'!B3)","v":"AOLS Code"},null,{"$f":"IF(Z1=\"e\",'Language terms'!A6,'Language terms'!B6)","v":"Status"},null,null,null,{"$f":"IF(Z1=\"e\",'Language terms'!A5,'Language terms'!B5)","v":"English Description "},null,null,null,null,null,{"$f":"IF(Z1=\"e\",'Language terms'!A7,'Language terms'!B7)","v":"LSI Code "},null,{"$f":"IF(Z1=\"e\",'Language terms'!A6,'Language terms'!B6)","v":"Status"},null,{"$f":"IF(Y1=\"e\",'Language terms'!#REF!,'Language terms'!A5)","v":"English Description "}]
[null,null,13,null,{"$f":"IF(ISNA(VLOOKUP(C5,'AOLS Codes'!A1:J36,7,FALSE)),\"N/A\",(VLOOKUP(C5,'AOLS Codes'!A1:J36,7,FALSE)))","v":"Active"},null,null,null,{"$f":"IF(ISNA(VLOOKUP(C5,'AOLS Codes'!A1:J36,4,FALSE)),\"N/A\",(VLOOKUP(C5,'AOLS Codes'!A1:J36,4,FALSE)))","v":"Appt-Bil imperative pos"},null,null,null,null,null,17,null,{"$f":"IF(ISNA(VLOOKUP(O5,'Codes SLT'!A2:I21,7,FALSE)),\"N/A\",(VLOOKUP(O5,'Codes SLT'!A2:I21,7,FALSE)))","v":"Inactive"},null,{"$f":"IF(ISNA(VLOOKUP(O5,'Codes SLT'!A2:I21,4,FALSE)),\"N/A\",(VLOOKUP(O5,'Codes SLT'!A2:I21,4,FALSE)))","v":"17 - Meets OL-Not PSC-No Entd BB"}]
[null,null,{"$f":"IF(Z1=\"e\",'Language terms'!A4,'Language terms'!B4)","v":"Definition"},null,null,null,null,null,null,null,null,null,null,null,{"$f":"IF(Z1=\"e\",'Language terms'!A4,'Language terms'!B4)","v":"Definition"}]
[null,null,{"$f":"IF(ISNA(VLOOKUP(C5,'AOLS Codes'!A1:J36,10,FALSE)),\"N/A\",(VLOOKUP(C5,'AOLS Codes'!A1:J36,10,FALSE)))","v":"Imperative Appointment to a Bilingual position"},null,null,null,null,null,null,null,null,null,null,null,{"$f":"IF(ISNA(VLOOKUP(O5,'Codes SLT'!A2:J21,10,FALSE)),\"N/A\",(VLOOKUP(O5,'Codes SLT'!A2:J21,10,FALSE)))","v":"Inactive"}]
[]
[]
[]
{"$rows_left_out":22}
{"sheet":"Codes SLT","index":1,"n_rows":21,"n_cols":10,"rows_kept":21,"cut":false,"hidden":false,"merged":[]}
["Codes SLT","Eng Description","FR description","Language Toggle","Status","État","Language Toggle","Definition","Définition","Language Toggle"]
[10,"10-Meets OL req - Entlitled to BB","10-Satisfait - reçoit PB",{"$f":"IF('General Information Générale'!$Z$1=\"e\",'Codes SLT'!B2,'Codes SLT'!C2)","v":"10-Meets OL req - Entlitled to BB"},"Active","Actif",{"$f":"IF('General Information Générale'!$Z$1=\"e\",'Codes SLT'!E2,'Codes SLT'!F2)","v":"Active"},"Use this value when the employee MEETS the OL requirement of the Position, and IS ENTITLED to the Bilingual Bonus","Utilisez cette valeur lorsque l'employé satisfait à l'exigence de LO du poste et EST Admissible à la prime au bilinguisme",{"$f":"IF('General Information Générale'!$Z$1=\"e\",'Codes SLT'!H2,'Codes SLT'!I2)","v":"Use this value when the employee MEETS the OL requirement of the Position, and IS ENTITLED to the Bilingual Bonus"}]
[11,"Awaiting SLE results","En attente résults ELS",{"$f":"IF('General Information Générale'!$Z$1=\"e\",'Codes SLT'!B3,'Codes SLT'!C3)","v":"Awaiting SLE results"},"Inactive","Inactif",{"$f":"IF('General Information Générale'!$Z$1=\"e\",'Codes SLT'!E3,'Codes SLT'!F3)","v":"Inactive"},"Inactive","Inactif",{"$f":"IF('General Information Générale'!$Z$1=\"e\",'Codes SLT'!H3,'Codes SLT'!I3)","v":"Inactive"}]
[12,"Pos ling data missing-Bil",null,{"$f":"IF('General Information Générale'!$Z$1=\"e\",'Codes SLT'!B4,'Codes SLT'!C4)","v":"Pos ling data missing-Bil"},"Inactive","Inactif",{"$f":"IF('General Information Générale'!$Z$1=\"e\",'Codes SLT'!E4,'Codes SLT'!F4)","v":"Inactive"},"Inactive","Inactif",{"$f":"IF('General Information Générale'!$Z$1=\"e\",'Codes SLT'!H4,'Codes SLT'!I4)","v":"Inactive"}]
[13,"Bil-Appt status missing/uni",null,{"$f":"IF('General Information Générale'!$Z$1=\"e\",'Codes SLT'!B5,'Codes SLT'!C5)","v":"Bil-Appt status missing/uni"},"Inactive","Inactif",{"$f":"IF('General Information Générale'!$Z$1=\"e\",'Codes SLT'!E5,'Codes SLT'!F5)","v":"Inactive"},"Inactive","Inactif",{"$f":"IF('General Information Générale'!$Z$1=\"e\",'Codes SLT'!H5,'Codes SLT'!I5)","v":"Inactive"}]
[14,"14-Meets OL req-Not Entd to BB","14-Satisf LO-ne reçoit pas PB",{"$f":"IF('General Information Générale'!$Z$1=\"e\",'Codes SLT'!B6,'Codes SLT'!C6)","v":"14-Meets OL req-Not Entd to BB"},"Active","Actif",{"$f":"IF('General Information Générale'!$Z$1=\"e\",'Codes SLT'!E6,'Codes SLT'!F6)","v":"Active"},"Use this value when the employee MEETS the OL requirement of the Position, but IS NOT ENTITLED to the Bilingual Bonus (ie – Executives, Translators, NFB)","Utilisez cette valeur lorsque l'employé satisfait à l'exigence de LO du poste, mais N'EST PAS admissible à la prime bilingue (c.-à-d. Cadres, traducteurs, ONF) ",{"$f":"IF('General Information Générale'!$Z$1=\"e\",'Codes SLT'!H6,'Codes SLT'!I6)","v":"Use this value when the employee MEETS the OL requirement of the Position, but IS NOT ENTITLED to the Bilingual Bonus (ie – Executives, Translators, NFB)"}]
[15,"15-Not required to meet OL req","15-Pas obligé-Satisf exig. LO",{"$f":"IF('General Information Générale'!$Z$1=\"e\",'Codes SLT'!B7,'Codes SLT'!C7)","v":"15-Not required to meet OL req"},"Active","Actif",{"$f":"IF('General Information Générale'!$Z$1=\"e\",'Codes SLT'!E7,'Codes SLT'!F7)","v":"Active"},"Use this value when the employee is NOT REQUIRED TO MEET any OL requirement (ie – Casuals, Acting less than 4 months, etc..)","Utilisez cette valeur lorsque l'employé N'EST PAS REQUIS DE RÉPONDRE à une exigence de LO (c.-à-d. occasionnels, agissant moins de 4 mois, etc.) ",{"$f":"IF('General Information Générale'!$Z$1=\"e\",'Codes SLT'!H7,'Codes SLT'!I7)","v":"Use this value when the employee is NOT REQUIRED TO MEET any OL requirement (ie – Casuals, Acting less than 4 months, etc..)"}]
[16,"16-Does not meet - gets BB","16-Ne rencontre pas-reçoit PB",{"$f":"IF('General Information Générale'!$Z$1=\"e\",'Codes SLT'!B8,'Codes SLT'!C8)","v":"16-Does not meet - gets BB"},"Active","Actif",{"$f":"IF('General Information Générale'!$Z$1=\"e\",'Codes SLT'!E8,'Codes SLT'!F8)","v":"Active"},"Use this value when the employee DOES NOT MEET the OL requirement, but IS STILL ENTITLED to the Bilingual Bonus","Utilisez cette valeur lorsque l'employé NE RÉPOND PAS à l'exigence de LO, mais EST TOUJOURS Admissible à la prime au bilinguisme ",{"$f":"IF('General Information Générale'!$Z$1=\"e\",'Codes SLT'!H8,'Codes SLT'!I8)","v":"Use this value when the employee DOES NOT MEET the OL requirement, but IS STILL ENTITLED to the Bilingual Bonus"}]
[17,"17 - Meets OL-Not PSC-No Entd BB","Sat LO-Pas CFP-reçoit pas PB",{"$f":"IF('General Information Générale'!$Z$1=\"e\",'Codes SLT'!B9,'Codes SLT'!C9)","v":"17 - Meets OL-Not PSC-No Entd BB"},"Inactive","Actif",{"$f":"IF('General Information Générale'!$Z$1=\"e\",'Codes SLT'!E9,'Codes SLT'!F9)","v":"Inactive"},"Inactive","Inatif",{"$f":"IF('General Information Générale'!$Z$1=\"e\",'Codes SLT'!H9,'Codes SLT'!I9)","v":"Inactive"}]
[20,"20 - Employee does not meet","20 - L'employé rencontre pas",{"$f":"IF('General Information Générale'!$Z$1=\"e\",'Codes SLT'!B10,'Codes SLT'!C10)","v":"20 - Employee does not meet"},"Inactive","Inactif",{"$f":"IF('General Information Générale'!$Z$1=\"e\",'Codes SLT'!E10,'Codes SLT'!F10)","v":"Inactive"},"Inactive","Inactif",{"$f":"IF('General Information Générale'!$Z$1=\"e\",'Codes SLT'!H10,'Codes SLT'!I10)","v":"Inactive"}]
{"$rows_left_out":12}
{"sheet":"Language terms","index":2,"n_rows":146,"n_cols":3,"rows_kept":146,"cut":false,"hidden":false,"merged":[[0,0,0,2],[14,0,14,2],[25,0,25,2],[106,0,106,2],[137,0,137,2]]}
["Interface"]
["English","Français"]
["AOLS Code","Code NNCLO",{"$f":"IF('General Information Générale'!Z1=\"e\",'Language terms'!A3,'Language terms'!B3)","v":"AOLS Code"}]
["Definition","Définition",{"$f":"IF('General Information Générale'!Z1=\"e\",'Language terms'!A4,'Language terms'!B4)","v":"Definition"}]
["English Description ","Description Française",{"$f":"IF('General Information Générale'!Z1=\"e\",'Language terms'!A5,'Language terms'!B5)","v":"English Description "}]
["Status","État",{"$f":"IF('General Information Générale'!$Z$1=\"e\",'Language terms'!A6,'Language terms'!B6)","v":"Status"}]
["LSI Code ","Code SLT",{"$f":"IF('General Information Générale'!$Z$1=\"e\",'Language terms'!A7,'Language terms'!B7)","v":"LSI Code "}]
["Scenario","Scénario",{"$f":"IF('General Information Générale'!$Z$1=\"e\",'Language terms'!A8,'Language terms'!B8)","v":"Scenario"}]
["Action  ","Action",{"$f":"IF('General Information Générale'!$Z$1=\"e\",'Language terms'!A9,'Language terms'!B9)","v":"Action  "}]
["Business description of the Appointment Official Languages Status codes (AOLS)","Code sur la nature de la nomination concernant les langues officielles (NNCLO)",{"$f":"IF('General Information Générale'!$Z$1=\"e\",'Language terms'!A10,'Language terms'!B10)","v":"Business description of the Appointment Official Languages Status codes (AOLS)"}]
{"$rows_left_out":137}
{"sheet":"AOLS Codes","index":3,"n_rows":36,"n_cols":10,"rows_kept":36,"cut":false,"hidden":false,"merged":[]}
["Code ","Eng Description","FR description",null,"Status","État",null,"Definition","Définition"]
[1,"Willing to take lang. train",null,{"$f":"IF('General Information Générale'!$Z$1=\"e\",'AOLS Codes'!B2,'AOLS Codes'!C2)","v":"Willing to take lang. train"},"Inactive","Inactif",{"$f":"IF('General Information Générale'!$Z$1=\"e\",'AOLS Codes'!E2,'AOLS Codes'!F2)","v":"Inactive"},"Inactive","Inactif",{"$f":"IF('General Information Générale'!$Z$1=\"e\",'AOLS Codes'!H2,'AOLS Codes'!I2)","v":"Inactive"}]
[2,"Long service exemption",null,{"$f":"IF('General Information Générale'!$Z$1=\"e\",'AOLS Codes'!B3,'AOLS Codes'!C3)","v":"Long service exemption"},"Inactive","Inactif",{"$f":"IF('General Information Générale'!$Z$1=\"e\",'AOLS Codes'!E3,'AOLS Codes'!F3)","v":"Inactive"},"Inactive","Inactif",{"$f":"IF('General Information Générale'!$Z$1=\"e\",'AOLS Codes'!H3,'AOLS Codes'!I3)","v":"Inactive"}]
[3,"Age exemption",null,{"$f":"IF('General Information Générale'!$Z$1=\"e\",'AOLS Codes'!B4,'AOLS Codes'!C4)","v":"Age exemption"},"Inactive","Inactif",{"$f":"IF('General Information Générale'!$Z$1=\"e\",'AOLS Codes'!E4,'AOLS Codes'!F4)","v":"Inactive"},"Inactive","Inactif",{"$f":"IF('General Information Générale'!$Z$1=\"e\",'AOLS Codes'!H4,'AOLS Codes'!I4)","v":"Inactive"}]
[4,"Reorg. - Incumbent's Rights",null,{"$f":"IF('General Information Générale'!$Z$1=\"e\",'AOLS Codes'!B5,'AOLS Codes'!C5)","v":"Reorg. - Incumbent's Rights"},"Inactive","Inactif",{"$f":"IF('General Information Générale'!$Z$1=\"e\",'AOLS Codes'!E5,'AOLS Codes'!F5)","v":"Inactive"},"Inactive","Inactif",{"$f":"IF('General Information Générale'!$Z$1=\"e\",'AOLS Codes'!H5,'AOLS Codes'!I5)","v":"Inactive"}]
[5,"Transfer Cntrl-Incmb Rights",null,{"$f":"IF('General Information Générale'!$Z$1=\"e\",'AOLS Codes'!B6,'AOLS Codes'!C6)","v":"Transfer Cntrl-Incmb Rights"},"Inactive","Inactif",{"$f":"IF('General Information Générale'!$Z$1=\"e\",'AOLS Codes'!E6,'AOLS Codes'!F6)","v":"Inactive"},"Inactive","Inactif",{"$f":"IF('General Information Générale'!$Z$1=\"e\",'AOLS Codes'!H6,'AOLS Codes'!I6)","v":"Inactive"}]
[6,"Change of classification",null,{"$f":"IF('General Information Générale'!$Z$1=\"e\",'AOLS Codes'!B7,'AOLS Codes'!C7)","v":"Change of classification"},"Inactive","Inactif",{"$f":"IF('General Information Générale'!$Z$1=\"e\",'AOLS Codes'!E7,'AOLS Codes'!F7)","v":"Inactive"},"Inactive","Inactif",{"$f":"IF('General Information Générale'!$Z$1=\"e\",'AOLS Codes'!H7,'AOLS Codes'!I7)","v":"Inactive"}]
[7,"Lay-off priority",null,{"$f":"IF('General Information Générale'!$Z$1=\"e\",'AOLS Codes'!B8,'AOLS Codes'!C8)","v":"Lay-off priority"},"Inactive","Inactif",{"$f":"IF('General Information Générale'!$Z$1=\"e\",'AOLS Codes'!E8,'AOLS Codes'!F8)","v":"Inactive"},"Inactive","Inactif",{"$f":"IF('General Information Générale'!$Z$1=\"e\",'AOLS Codes'!H8,'AOLS Codes'!I8)","v":"Inactive"}]
[8,"Return lve absence priority",null,{"$f":"IF('General Information Générale'!$Z$1=\"e\",'AOLS Codes'!B9,'AOLS Codes'!C9)","v":"Return lve absence priority"},"Inactive","Inactif",{"$f":"IF('General Information Générale'!$Z$1=\"e\",'AOLS Codes'!E9,'AOLS Codes'!F9)","v":"Inactive"},"Inactive","Inactif",{"$f":"IF('General Information Générale'!$Z$1=\"e\",'AOLS Codes'!H9,'AOLS Codes'!I9)","v":"Inactive"}]
[9,"Act appt - leave of absence",null,{"$f":"IF('General Information Générale'!$Z$1=\"e\",'AOLS Codes'!B10,'AOLS Codes'!C10)","v":"Act appt - leave of absence"},"Inactive","Inactif",{"$f":"IF('General Information Générale'!$Z$1=\"e\",'AOLS Codes'!E10,'AOLS Codes'!F10)","v":"Inactive"},"Inactive","Inactif",{"$f":"IF('General Information Générale'!$Z$1=\"e\",'AOLS Codes'!H10,'AOLS Codes'!I10)","v":"Inactive"}]
{"$rows_left_out":27}
{"sheet":"LSI Codes","index":4,"n_rows":20,"n_cols":8,"rows_kept":20,"cut":false,"hidden":true,"merged":[]}
["Code ","Eng Description","FR description","Status","État","Definition","Définition"]
[10,"10-Meets OL req - Entlitled to BB","10-Satisfait - reçoit PB","Active","Actif","Use this value when the employee MEETS the OL requirement of the Position, and IS ENTITLED to the Bilingual Bonus","Utilisez cette valeur lorsque l'employé satisfait à l'exigence de LO du poste et EST Admissible à la prime au bilinguisme",{"$f":"IF('General Information Générale'!$Z$1=\"e\",'LSI Codes'!B2,'LSI Codes'!C2)","v":"10-Meets OL req - Entlitled to BB"}]
["11","Awaiting SLE results","En attente résults ELS","Inactive","Inactif","Inactive","Inactif",{"$f":"IF('General Information Générale'!$Z$1=\"e\",'LSI Codes'!B3,'LSI Codes'!C3)","v":"Awaiting SLE results"}]
["12","Pos ling data missing-Bil",null,"Inactive","Inactif","Inactive","Inactif",{"$f":"IF('General Information Générale'!$Z$1=\"e\",'LSI Codes'!B4,'LSI Codes'!C4)","v":"Pos ling data missing-Bil"}]
["13","Bil-Appt status missing/uni",null,"Inactive","Inactif","Inactive","Inactif",{"$f":"IF('General Information Générale'!$Z$1=\"e\",'LSI Codes'!B5,'LSI Codes'!C5)","v":"Bil-Appt status missing/uni"}]
[14,"14-Meets OL req-Not Entd to BB","14-Satisf LO-ne reçoit pas","Active","Actif","Use this value when the employee MEETS the OL requirement of the Position, but IS NOT ENTITLED to the Bilingual Bonus (ie – Executives, Translators, NFB)","Utilisez cette valeur lorsque l'employé satisfait à l'exigence de LO du poste, mais N'EST PAS admissible à la prime bilingue (c.-à-d. Cadres, traducteurs, ONF) ",{"$f":"IF('General Information Générale'!$Z$1=\"e\",'LSI Codes'!B6,'LSI Codes'!C6)","v":"14-Meets OL req-Not Entd to BB"}]
[15,"15-Not required to meet OL req","15-Pas obligé-Satisf exig. LO","Active","Actif","Use this value when the employee is NOT REQUIRED TO MEET any OL requirement (ie – Casuals, Acting less than 4 months, etc..)","Utilisez cette valeur lorsque l'employé N'EST PAS REQUIS DE RÉPONDRE à une exigence de LO (c.-à-d. occasionnels, agissant moins de 4 mois, etc.) ",{"$f":"IF('General Information Générale'!$Z$1=\"e\",'LSI Codes'!B7,'LSI Codes'!C7)","v":"15-Not required to meet OL req"}]
[16,"16-Does not meet - gets BB","16-Ne rencontre pas-reçoit PB","Active","Actif","Use this value when the employee DOES NOT MEET the OL requirement, but IS STILL ENTITLED to the Bilingual Bonus","Utilisez cette valeur lorsque l'employé NE RÉPOND PAS à l'exigence de LO, mais EST TOUJOURS Admissible à la prime au bilinguisme ",{"$f":"IF('General Information Générale'!$Z$1=\"e\",'LSI Codes'!B8,'LSI Codes'!C8)","v":"16-Does not meet - gets BB"}]
["20","20 - Employee does not meet","20 - L'employé rencontre pas","Inactive","Inactif","Inactive","Inactif",{"$f":"IF('General Information Générale'!$Z$1=\"e\",'LSI Codes'!B9,'LSI Codes'!C9)","v":"20 - Employee does not meet"}]
["21","Exmp appt/depl/renum/restr","Exemption nom/mut/","Inactive","Inactif","Inactive","Inactif",{"$f":"IF('General Information Générale'!$Z$1=\"e\",'LSI Codes'!B10,'LSI Codes'!C10)","v":"Exmp appt/depl/renum/restr"}]
{"$rows_left_out":11}
{"sheet":"REH _ Bilingual Posn ","index":5,"n_rows":0,"n_cols":0,"rows_kept":0,"cut":false,"hidden":true,"merged":[]}

{"sheet":"Sheet1","index":6,"n_rows":38,"n_cols":9,"rows_kept":38,"cut":false,"hidden":true,"merged":[[0,5,0,6],[2,8,6,8],[3,2,6,2],[8,1,11,1],[8,4,11,4],[8,8,11,8],[10,2,11,2],[2,0,17,0],[2,1,6,1],[2,4,6,4],[30,2,30,4],[31,1,31,4],[28,2,28,4],[29,1,29,4],[13,2,13,4],[15,2,15,4],[16,1,16,4],[17,2,17,4],[32,2,32,4],[34,0,36,0],[34,1,36,1],[34,4,36,4],[19,0,32,0],[19,1,20,1],[19,4,20,4],[21,1,21,4],[22,1,26,1],[22,4,26,4],[24,2,26,2],[27,1,27,4]]}
[null,"Business description of the Appointment Official Languages Status codes","Linguistic Status of Incumbent options",null,null,"Existing Editing in HR systems\n&\nMessage Description",null,"Applies to which specific scenario and which HR system"]
["Series","If the action is… ","Select… \nIf Employee Meets language requirements: ","Select… \nIf Employee does NOT meet language requirements: ","Select… \nIf SLE result is unrecognized by PSC",8.9,9.1,null,"Questions and Answers"]
["Series 10 - The employee meets the language requirements of the position","13 – Appointment / Promotion (Bilingual position imperative) \nPCIS website = \nAppointment - Imperative, bilingual position","10 – Meets OL Req - Entitled to BB ","15  – NOT Required to meet OL Req ","17  – Meets OL-Not PSC-No Entd BB \n(Example: Department or Agency is not subject to PSEA)",null,"If you chose codes 15 or 16 for a bilingual imperative position :\nThe Aptmt Official Language Status and Linguistic Status of Incumbent are required for Bilingual Pos (21000,50).\n\nThe position's language requirement is bilingual and either the Appointment Official Language Status and/or the Linguistic Status of Incumbent are not valued.Please ensure both values are entered and correct.","* we can note type of appointment:  for e.g. exrenal or internal appointment.  Imperative appointment in a bilingual position\n* Action Reason that can be used for this code combination :  for e.g. HIR, REH, Transfer, Data Change/  Official Langauges\n* Correction:  in the event the wrong code is used - you can use Correct History functionality.\nCorrecting historical data rows will require sending a Data Correction data row.\n* employee gets Bilingual bonus","Series 10 - The employee meets the language requirements of the position\n\nQuestion: Does 15 - NOT required to meet OL Req fit in there? "]
[null,null,"14  – Meet OL Req - NOT entitled to BB \n(e.g. EX, Translators )","16  – Does not meet - gets BB  \n(Example: Retested - notice period to meet) "]
[null,null,null,"40 – Acting appointment encumbered bilingual position - exclusion under PSER "]
[null,null,null,"41 – Acting appointment in bilingual position while incumbent on Language Training - exclusion under PSER"]
[null,null,null,"50 – Acting appointment to position in rotational system – exclusion under PSER"]
[null,"  "]
[null,"14 – Appointment / Promotion (Bilingual position non-imperative) \nPCIS website = \nAppointment - Non-imperative, bilingual position","10 – Meets OL Req - Entitled to BB  ","15  – NOT Required to meet OL Req    ","17  – Meets OL-Not PSC-No Entd BB \n(Example: Department or Agency is not subject to PSEA)",null,null,null,"Question: Does 10 - Meets OL req - Entitled to BB fit there?\nThis is NOT a NON-IMPERATIVE position\nSame question for 14  – Meet OL Req - NOT entitled to BB"]
[null,null,"14  – Meet OL Req - NOT entitled to BB\n(e.g. EX, Translators )","30 – PSOLEO Employee must meet OL requirements \n(insert a Target Date for employee to Meet) "]
{"$rows_left_out":28}